t=801: probe_leste-oeste_leste_1; '130009694'->'130009702'
t=801: probe_leste-oeste_oeste_1; '132347413'->'132347421'
t=840: probe_leste-oeste_leste_1; '130009702'->'5407688434'
t=842: probe_leste-oeste_oeste_1; '132347421'->'4512222518'
t=847: probe_leste-oeste_leste_1; '5407688434'->'2225397470'
t=852: probe_leste-oeste_oeste_1; '4512222518'->'865297247'
t=858: probe_leste-oeste_oeste_1; '865297247'->'865297244'
t=864: probe_leste-oeste_leste_1; '2225397470'->'130009845'
t=867: probe_leste-oeste_oeste_1; '865297244'->'459347453'
t=872: probe_leste-oeste_leste_1; '130009845'->'130009847'
t=873: probe_leste-oeste_oeste_1; '459347453'->'1665039639'
t=879: probe_leste-oeste_oeste_1; '1665039639'->'1113784794'
t=882: probe_leste-oeste_oeste_1; '1113784794'->'1113784977'
t=889: probe_leste-oeste_oeste_1; '1113784977'->'132347429'
t=891: probe_leste-oeste_leste_1; '130009847'->'1798937480'
t=900: probe_leste-oeste_leste_1; '1798937480'->'2494964316'
t=905: probe_leste-oeste_leste_1; '2494964316'->'130009851'
t=909: probe_leste-oeste_oeste_1; '132347429'->'132347430'
t=920: probe_leste-oeste_oeste_1; '132347430'->'4338643100'
t=922: probe_leste-oeste_leste_1; '130009851'->'130009852'
t=924: probe_leste-oeste_oeste_1; '4338643100'->'2494964317'
t=931: probe_leste-oeste_oeste_1; '2494964317'->'4338643097'
t=932: probe_leste-oeste_leste_1; '130009852'->'130009853'
t=939: probe_leste-oeste_leste_1; '130009853'->'1665298742'
t=948: probe_leste-oeste_oeste_1; '4338643097'->'133491023'
t=952: probe_leste-oeste_leste_1; '1665298742'->'865297240'
t=953: probe_leste-oeste_oeste_1; '133491023'->'4338642944'
t=961: probe_leste-oeste_leste_1; '865297240'->'455606166'
t=979: probe_leste-oeste_leste_1; '455606166'->'130009861'
t=1001: probe_paulista_paraiso_1; '1952545091'->'5381067434'
t=1001: probe_paulista_consolacao_1; '60609822'->'303863647'
t=1003: probe_leste-oeste_leste_1; '130009861'->'4338642945'
t=1008: probe_paulista_paraiso_1; '5381067434'->'2098758071'
t=1010: probe_paulista_paraiso_1; '2098758071'->'4124282297'
t=1013: probe_paulista_paraiso_1; '4124282297'->'4124282296'
t=1021: probe_paulista_paraiso_1; '4124282296'->'1953466364'
t=1023: probe_paulista_paraiso_1; '1953466364'->'2006973645'
t=1024: probe_paulista_consolacao_1; '303863647'->'1953466378'
t=1033: probe_paulista_consolacao_1; '1953466378'->'1953466359'
t=1036: probe_paulista_paraiso_1; '2006973645'->'60624611'
t=1048: probe_paulista_paraiso_1; '60624611'->'60624596'
t=1050: probe_paulista_consolacao_1; '1953466359'->'1990934597'
t=1062: probe_paulista_paraiso_1; '60624596'->'60624571'
t=1069: probe_paulista_consolacao_1; '1990934597'->'1953466360'
t=1079: probe_paulista_paraiso_1; '60624571'->'60609797'
t=1084: probe_paulista_consolacao_1; '1953466360'->'1990911134'
t=1092: probe_paulista_paraiso_1; '60609797'->'60609766'
t=1100: probe_paulista_consolacao_1; '1990911134'->'2021000708'
t=1109: probe_paulista_paraiso_1; '60609766'->'60609692'
t=1114: probe_paulista_consolacao_1; '2021000708'->'2352453476'
t=1119: probe_paulista_consolacao_1; '2352453476'->'60609697'
t=1122: probe_paulista_paraiso_1; '60609692'->'1990911135'
t=1124: probe_paulista_consolacao_1; '60609697'->'165463204'
t=1132: probe_paulista_consolacao_1; '165463204'->'1953466375'
t=1139: probe_paulista_consolacao_1; '1953466375'->'1953466365'
t=1143: probe_paulista_paraiso_1; '1990911135'->'1953466370'
t=1149: probe_paulista_consolacao_1; '1953466365'->'165459105'
t=1159: probe_paulista_paraiso_1; '1953466370'->'1990934598'
t=1160: probe_paulista_consolacao_1; '165459105'->'1953466357'
t=1173: probe_paulista_consolacao_1; '1953466357'->'1819616337'
t=1174: probe_paulista_paraiso_1; '1990934598'->'1953466361'
t=1181: probe_paulista_consolacao_1; '1819616337'->'1953466362'
t=1184: probe_paulista_consolacao_1; '1953466362'->'5539611102'
t=1186: probe_paulista_consolacao_1; '5539611102'->'4236712736'
t=1193: probe_paulista_paraiso_1; '1953466361'->'856727276'
t=1194: probe_paulista_consolacao_1; '4236712736'->'60609643'
t=1197: probe_paulista_consolacao_1; '60609643'->'5381067437'
t=1197: probe_paulista_paraiso_1; '856727276'->'1953466358'
t=1199: probe_paulista_consolacao_1; '5381067437'->'4236712716'
t=1201: probe_marginal_local_norte_1; '302819883'->'25629374'
t=1201: probe_marginal_local_sul_1; '25620018'->'25619792'
t=1208: probe_marginal_local_sul_1; '25619792'->'1964678732'
t=1211: probe_paulista_paraiso_1; '1953466358'->'1953466373'
t=1220: probe_paulista_paraiso_1; '1953466373'->'303863453'
t=1221: probe_marginal_local_norte_1; '25629374'->'25629371'
t=1228: probe_marginal_local_norte_1; '25629371'->'25613868'
t=1229: probe_paulista_paraiso_1; '303863453'->'60609866'
t=1240: probe_marginal_local_sul_1; '1964678732'->'25619078'
t=1243: probe_marginal_local_norte_1; '25613868'->'25718011'
t=1250: probe_marginal_local_norte_1; '25718011'->'25717980'
t=1255: probe_marginal_local_norte_1; '25717980'->'25614374'
t=1262: probe_marginal_local_sul_1; '25619078'->'597376'
t=1262: probe_marginal_local_norte_1; '25614374'->'287474414'
t=1291: probe_marginal_local_sul_1; '597376'->'303890490'
t=1311: probe_marginal_local_norte_1; '287474414'->'1452877485'
t=1322: probe_marginal_local_norte_1; '1452877485'->'573644'
t=1341: probe_marginal_local_sul_1; '303890490'->'1445874000'
t=1347: probe_marginal_local_sul_1; '1445874000'->'1838323747'
t=1355: probe_marginal_local_norte_1; '573644'->'2384667558'
t=1355: probe_marginal_local_sul_1; '1838323747'->'3292445379'
t=1361: probe_marginal_local_norte_1; '2384667558'->'2830306102'
t=1364: probe_marginal_local_norte_1; '2830306102'->'3416874064'
t=1369: probe_marginal_local_sul_1; '3292445379'->'2501351569'
t=1370: probe_marginal_local_norte_1; '3416874064'->'25619056'
t=1372: probe_marginal_local_norte_1; '25619056'->'25619362'
t=1378: probe_marginal_local_sul_1; '2501351569'->'765121521'
t=1391: probe_marginal_local_sul_1; '765121521'->'1113256890'
t=1398: probe_marginal_local_sul_1; '1113256890'->'765121487'
t=1401: probe_marginal_expressa_norte_1; '25629425'->'25613868'
t=1401: probe_marginal_expressa_sul_1; '2830306107'->'25619792'
t=1404: probe_marginal_local_sul_1; '765121487'->'765121528'
t=1411: probe_marginal_expressa_sul_1; '25619792'->'1964678732'
t=1420: probe_marginal_local_norte_1; '25619362'->'1452896103'
t=1420: probe_marginal_local_sul_1; '765121528'->'765121525'
t=1423: probe_marginal_local_sul_1; '765121525'->'1001569261'
t=1433: probe_marginal_local_norte_1; '1452896103'->'4361883898'
t=1439: probe_marginal_local_norte_1; '4361883898'->'25619917'
t=1443: probe_marginal_expressa_sul_1; '1964678732'->'25619078'
t=1444: probe_marginal_local_norte_1; '25619917'->'25619914'
t=1444: probe_marginal_expressa_norte_1; '25613868'->'25718011'
t=1451: probe_marginal_expressa_norte_1; '25718011'->'25717980'
t=1452: probe_marginal_local_norte_1; '25619914'->'4345292588'
t=1456: probe_marginal_expressa_norte_1; '25717980'->'25614374'
t=1460: probe_marginal_local_norte_1; '4345292588'->'465015202'
t=1462: probe_marginal_local_norte_1; '465015202'->'1986758050'
t=1463: probe_marginal_expressa_norte_1; '25614374'->'287474414'
t=1465: probe_marginal_expressa_sul_1; '25619078'->'597376'
t=1494: probe_marginal_expressa_sul_1; '597376'->'303890490'
t=1512: probe_marginal_expressa_norte_1; '287474414'->'1452877485'
t=1523: probe_marginal_expressa_norte_1; '1452877485'->'573644'
t=1544: probe_marginal_expressa_sul_1; '303890490'->'25614437'
t=1556: probe_marginal_expressa_norte_1; '573644'->'2384667558'
t=1562: probe_marginal_expressa_norte_1; '2384667558'->'2830306102'
t=1565: probe_marginal_expressa_norte_1; '2830306102'->'3416874064'
t=1568: probe_marginal_expressa_sul_1; '25614437'->'1113256918'
t=1571: probe_marginal_expressa_norte_1; '3416874064'->'25619056'
t=1573: probe_marginal_expressa_norte_1; '25619056'->'25619362'
t=1579: probe_marginal_expressa_sul_1; '1113256918'->'25629335'
t=1601: probe_alvares_cabral_bairro_1; '3278570119'->'1001237099'
t=1601: probe_alvares_cabral_centro_1; '40257133'->'40257158'
t=1602: probe_marginal_expressa_sul_1; '25629335'->'25629402'
t=1606: probe_alvares_cabral_centro_1; '40257158'->'1393378957'
t=1608: probe_alvares_cabral_centro_1; '1393378957'->'388512094'
t=1615: probe_alvares_cabral_centro_1; '388512094'->'40257256'
t=1618: probe_alvares_cabral_centro_1; '40257256'->'142777317'
t=1621: probe_marginal_expressa_norte_1; '25619362'->'1986757988'
t=1622: probe_alvares_cabral_bairro_1; '1001237099'->'1001237110'
t=1629: probe_alvares_cabral_centro_1; '142777317'->'142777323'
t=1630: probe_alvares_cabral_bairro_1; '1001237110'->'40257041'
t=1633: probe_alvares_cabral_bairro_1; '40257041'->'142833320'
t=1640: probe_alvares_cabral_centro_1; '142777323'->'1393378560'
t=1643: probe_alvares_cabral_bairro_1; '142833320'->'1393378777'
t=1648: probe_alvares_cabral_centro_1; '1393378560'->'142833093'
t=1652: probe_alvares_cabral_centro_1; '142833093'->'142777332'
t=1656: probe_alvares_cabral_bairro_1; '1393378777'->'1393378893'
t=1661: probe_alvares_cabral_centro_1; '142777332'->'1393378491'
t=1667: probe_alvares_cabral_bairro_1; '1393378893'->'40257123'
t=1672: probe_alvares_cabral_centro_1; '1393378491'->'28800788'
t=1681: probe_alvares_cabral_bairro_1; '40257123'->'40257133'
t=1801: probe_cidade_jardim_bairro_1; '1389167178'->'1389167195'
t=1801: probe_cidade_jardim_centro_1; '25614665'->'25614663'
t=1809: probe_cidade_jardim_bairro_1; '1389167195'->'1389167298'
t=1812: probe_cidade_jardim_centro_1; '25614663'->'4732084365'
t=1829: probe_cidade_jardim_centro_1; '4732084365'->'1389167299'
t=1836: probe_cidade_jardim_bairro_1; '1389167298'->'1389167339'
t=1839: probe_cidade_jardim_centro_1; '1389167299'->'5839272911'
t=1845: probe_cidade_jardim_bairro_1; '1389167339'->'302915396'
t=1847: probe_cidade_jardim_bairro_1; '302915396'->'25615440'
t=1849: probe_cidade_jardim_centro_1; '5839272911'->'302806119'
t=1851: probe_cidade_jardim_bairro_1; '25615440'->'25614854'
t=1858: probe_cidade_jardim_centro_1; '302806119'->'302806129'
t=1862: probe_cidade_jardim_bairro_1; '25614854'->'25614851'
t=1864: probe_cidade_jardim_bairro_1; '25614851'->'25614843'
t=1867: probe_cidade_jardim_centro_1; '302806129'->'301116630'
t=1871: probe_cidade_jardim_centro_1; '301116630'->'2447177454'
t=1878: probe_cidade_jardim_centro_1; '2447177454'->'3354044405'
t=1881: probe_cidade_jardim_centro_1; '3354044405'->'299169950'
t=1885: probe_cidade_jardim_centro_1; '299169950'->'140819571'
t=2001: probe_23_centro_1; '40257133'->'40257158'
t=2001: probe_23_bairro_1; '5102142306'->'25929410'
t=2006: probe_23_centro_1; '40257158'->'1393378957'
t=2008: probe_23_centro_1; '1393378957'->'388512094'
t=2011: probe_23_bairro_1; '25929410'->'25929413'
t=2015: probe_23_centro_1; '388512094'->'5058324127'
t=2020: probe_23_bairro_1; '25929413'->'5496814869'
t=2030: probe_23_centro_1; '5058324127'->'576412427'
t=2033: probe_23_bairro_1; '5496814869'->'25929486'
t=2034: probe_23_centro_1; '576412427'->'576412391'
t=2041: probe_23_centro_1; '576412391'->'5058324150'
t=2042: probe_23_centro_1; '5058324150'->'389062985'
t=2049: probe_23_bairro_1; '25929486'->'25929498'
t=2051: probe_23_centro_1; '389062985'->'5102157947'
t=2054: probe_23_bairro_1; '25929498'->'25929616'
t=2061: probe_23_centro_1; '5102157947'->'5102157949'
t=2063: probe_23_centro_1; '5102157949'->'389063004'
t=2073: probe_23_bairro_1; '25929616'->'5711623858'
t=2086: probe_23_centro_1; '389063004'->'25947790'
t=2091: probe_23_centro_1; '25947790'->'5102154384'
t=2103: probe_23_bairro_1; '5711623858'->'5049054343'
t=2114: probe_23_centro_1; '5102154384'->'1544684377'
t=2128: probe_23_centro_1; '1544684377'->'25947734'
t=2132: probe_23_centro_1; '25947734'->'778098426'
t=2136: probe_23_bairro_1; '5049054343'->'25947757'
t=2139: probe_23_bairro_1; '25947757'->'5102154381'
t=2159: probe_23_bairro_1; '5102154381'->'303866750'
t=2164: probe_23_centro_1; '778098426'->'1833396360'
t=2179: probe_23_bairro_1; '303866750'->'5102157948'
t=2195: probe_23_centro_1; '1833396360'->'25929499'
t=2204: probe_23_bairro_1; '5102157948'->'5058324135'
t=2207: probe_23_bairro_1; '5058324135'->'142835392'
t=2214: probe_23_bairro_1; '142835392'->'142777360'
t=2215: probe_23_centro_1; '25929499'->'25929487'
t=2220: probe_23_centro_1; '25929487'->'25929414'
t=2224: probe_23_bairro_1; '142777360'->'3278570116'
t=2227: probe_23_bairro_1; '3278570116'->'3278570115'
t=2231: probe_23_bairro_1; '3278570115'->'3278570111'
t=2247: probe_23_centro_1; '25929414'->'587993'
t=2253: probe_23_centro_1; '587993'->'5102142308'
