init year,Adjusted Rand Index,V-Measure,Adjusted Mutual Info Score,Fowlkes Mallows Score
2000,44.092244978390745,78.92246288428694,69.02106790595218,50.91182123975041
2001,48.02037183638627,80.35599588044214,71.1572861451687,54.43699764144972
2002,49.93700021891036,81.66563092707915,73.20820423537847,56.87640219793195
2003,46.288505548713445,81.53960127345592,72.91508983204956,53.332912622856114
2004,48.75917143555179,82.16922137446284,73.84911325737527,55.43241386444333
2005,54.74302342730285,84.12680174402114,76.47273791897527,59.68054838475727
2006,54.16010564195184,84.90194796792089,77.7457180074723,59.6779371222797
2007,53.277348664219645,84.74310858857751,77.65455895381,59.24265127331715
2008,56.15773587103161,85.67886747345595,78.86365504309175,61.36082837677468
2009,65.01323101560465,88.7217098186556,83.11555753344048,68.35221603271494
2010,62.36725216898596,87.22059649422572,80.89022263108625,65.95439758769282
2011,66.83703277540663,88.1355663574936,82.37442594103327,70.532065534668
2012,62.9186780406521,86.2893998378546,79.69730294005169,67.24773432211612
2013,54.79742004952317,83.64239339205933,76.09941946022246,60.927367981099614
2014,57.57372092844285,85.2095678439257,78.47287273467329,63.61167502038935
2015,56.759311700796324,85.04605414223211,78.32815485945275,63.1478106871733
