year,RJ,CE,SP
1994,47.18914845516202,42.223800176566044,57.874340836342895
1995,48.049034870434134,48.32299041837149,54.20590699273521
1996,49.552646751083685,41.09411122463134,54.48522150609754
1997,56.578530117934854,43.519853671717954,53.85483183513063
1998,66.96837363729605,36.5050861419639,55.68197511546003
1999,62.86400625421982,34.87077848764349,56.3444825574966
2000,67.83011352320256,36.235088368701,57.28505072140727
2001,61.41962907645968,38.33185717273155,55.455117775146434
2002,65.69540210428116,45.42043243191994,52.551809196533384
2003,61.27569528415962,42.051828153367104,57.68534883566553
2004,60.04481330278947,44.765311803774885,57.23505415525777
2005,62.46606674971006,56.69048697823149,58.583864101182236
2006,57.83670320601374,48.73917733229118,60.30056302040017
2007,63.23907803359001,46.267097791816944,61.64297358326512
2008,61.57567875142254,55.08054030219749,62.05157631183222
2009,77.00859540445964,61.34619313643953,58.06623629379166
2010,86.94051095663141,62.56659833932643,59.46977723914396
2011,77.7227091515907,63.29082621646243,60.70483666402971
2012,81.79251108351315,71.66921834047298,61.18864990132121
2013,79.27134434195844,67.49218509264145,56.34305070184509
2014,86.74497226409056,55.35916261750674,58.02737635374711
2015,87.87886403619,55.040703114786204,55.62820623825342
2016,81.87490493578933,52.52589850357228,61.264873358790574
2017,76.6086231530079,60.049941753375,59.70866516135433
2018,85.38657274518626,59.33685956303783,61.792746444386225
2019,88.84609534510113,65.40421525386961,52.88776406794019
2020,89.20428547421244,58.822058514181265,56.49179817628909
