%!PS-Adobe-3.0 EPSF-3.0
%%Title: figure_3_time_series_general_comparison.eps
%%Creator: Matplotlib v3.5.1, https://matplotlib.org/
%%CreationDate: Tue Jul 12 14:13:37 2022
%%Orientation: portrait
%%BoundingBox: 18 180 594 612
%%HiResBoundingBox: 18.000000 180.000000 594.000000 612.000000
%%EndComments
%%BeginProlog
/mpldict 11 dict def
mpldict begin
/_d { bind def } bind def
/m { moveto } _d
/l { lineto } _d
/r { rlineto } _d
/c { curveto } _d
/cl { closepath } _d
/ce { closepath eofill } _d
/box {
      m
      1 index 0 r
      0 exch r
      neg 0 r
      cl
    } _d
/clipbox {
      box
      clip
      newpath
    } _d
/sc { setcachedevice } _d
%!PS-Adobe-3.0 Resource-Font
%%Creator: Converted from TrueType to Type 3 by Matplotlib.
10 dict begin
/FontName /DejaVuSans def
/PaintType 0 def
/FontMatrix [0.00048828125 0 0 0.00048828125 0 0] def
/FontBBox [-2090 -948 3673 2524] def
/FontType 3 def
/Encoding [/space /parenleft /parenright /hyphen /zero /one /two /three /four /six /seven /eight /nine /A /B /C /D /M /P /R /a /c /d /e /g /h /i /l /m /n /o /r /s /t /u /v /y] def
/CharStrings 38 dict dup begin
/.notdef 0 def
/space{651 0 0 0 0 0 sc
ce} _d
/parenleft{799 0 176 -270 635 1554 sc
635 1554 m
546 1401 479 1249 436 1099 c
393 949 371 797 371 643 c
371 489 393 336 436 185 c
480 34 546 -117 635 -270 c
475 -270 l
375 -113 300 41 250 192 c
201 343 176 494 176 643 c
176 792 201 941 250 1092 c
299 1243 374 1397 475 1554 c
635 1554 l

ce} _d
/parenright{799 0 164 -270 623 1554 sc
164 1554 m
324 1554 l
424 1397 499 1243 548 1092 c
598 941 623 792 623 643 c
623 494 598 343 548 192 c
499 41 424 -113 324 -270 c
164 -270 l
253 -117 319 34 362 185 c
406 336 428 489 428 643 c
428 797 406 949 362 1099 c
319 1249 253 1401 164 1554 c

ce} _d
/hyphen{739 0 100 479 639 643 sc
100 643 m
639 643 l
639 479 l
100 479 l
100 643 l

ce} _d
/zero{1303 0 135 -29 1167 1520 sc
651 1360 m
547 1360 469 1309 416 1206 c
364 1104 338 950 338 745 c
338 540 364 387 416 284 c
469 182 547 131 651 131 c
756 131 834 182 886 284 c
939 387 965 540 965 745 c
965 950 939 1104 886 1206 c
834 1309 756 1360 651 1360 c

651 1520 m
818 1520 946 1454 1034 1321 c
1123 1189 1167 997 1167 745 c
1167 494 1123 302 1034 169 c
946 37 818 -29 651 -29 c
484 -29 356 37 267 169 c
179 302 135 494 135 745 c
135 997 179 1189 267 1321 c
356 1454 484 1520 651 1520 c

ce} _d
/one{1303 0 225 0 1114 1493 sc
254 170 m
584 170 l
584 1309 l
225 1237 l
225 1421 l
582 1493 l
784 1493 l
784 170 l
1114 170 l
1114 0 l
254 0 l
254 170 l

ce} _d
/two{1303 0 150 0 1098 1520 sc
393 170 m
1098 170 l
1098 0 l
150 0 l
150 170 l
227 249 331 356 463 489 c
596 623 679 709 713 748 c
778 821 823 882 848 932 c
874 983 887 1032 887 1081 c
887 1160 859 1225 803 1275 c
748 1325 675 1350 586 1350 c
523 1350 456 1339 385 1317 c
315 1295 240 1262 160 1217 c
160 1421 l
241 1454 317 1478 388 1495 c
459 1512 523 1520 582 1520 c
737 1520 860 1481 952 1404 c
1044 1327 1090 1223 1090 1094 c
1090 1033 1078 974 1055 919 c
1032 864 991 800 930 725 c
913 706 860 650 771 557 c
682 465 556 336 393 170 c

ce} _d
/three{1303 0 156 -29 1139 1520 sc
831 805 m
928 784 1003 741 1057 676 c
1112 611 1139 530 1139 434 c
1139 287 1088 173 987 92 c
886 11 742 -29 555 -29 c
492 -29 428 -23 361 -10 c
295 2 227 20 156 45 c
156 240 l
212 207 273 183 340 166 c
407 149 476 141 549 141 c
676 141 772 166 838 216 c
905 266 938 339 938 434 c
938 522 907 591 845 640 c
784 690 698 715 588 715 c
414 715 l
414 881 l
596 881 l
695 881 771 901 824 940 c
877 980 903 1037 903 1112 c
903 1189 876 1247 821 1288 c
767 1329 689 1350 588 1350 c
533 1350 473 1344 410 1332 c
347 1320 277 1301 201 1276 c
201 1456 l
278 1477 349 1493 416 1504 c
483 1515 547 1520 606 1520 c
759 1520 881 1485 970 1415 c
1059 1346 1104 1252 1104 1133 c
1104 1050 1080 980 1033 923 c
986 866 918 827 831 805 c

ce} _d
/four{1303 0 100 0 1188 1493 sc
774 1317 m
264 520 l
774 520 l
774 1317 l

721 1493 m
975 1493 l
975 520 l
1188 520 l
1188 352 l
975 352 l
975 0 l
774 0 l
774 352 l
100 352 l
100 547 l
721 1493 l

ce} _d
/six{1303 0 143 -29 1174 1520 sc
676 827 m
585 827 513 796 460 734 c
407 672 381 587 381 479 c
381 372 407 287 460 224 c
513 162 585 131 676 131 c
767 131 838 162 891 224 c
944 287 971 372 971 479 c
971 587 944 672 891 734 c
838 796 767 827 676 827 c

1077 1460 m
1077 1276 l
1026 1300 975 1318 923 1331 c
872 1344 821 1350 770 1350 c
637 1350 535 1305 464 1215 c
394 1125 354 989 344 807 c
383 865 433 909 492 940 c
551 971 617 987 688 987 c
838 987 956 941 1043 850 c
1130 759 1174 636 1174 479 c
1174 326 1129 203 1038 110 c
947 17 827 -29 676 -29 c
503 -29 371 37 280 169 c
189 302 143 494 143 745 c
143 981 199 1169 311 1309 c
423 1450 573 1520 762 1520 c
813 1520 864 1515 915 1505 c
967 1495 1021 1480 1077 1460 c

ce} _d
/seven{1303 0 168 0 1128 1493 sc
168 1493 m
1128 1493 l
1128 1407 l
586 0 l
375 0 l
885 1323 l
168 1323 l
168 1493 l

ce} _d
/eight{1303 0 139 -29 1163 1520 sc
651 709 m
555 709 479 683 424 632 c
369 581 342 510 342 420 c
342 330 369 259 424 208 c
479 157 555 131 651 131 c
747 131 823 157 878 208 c
933 260 961 331 961 420 c
961 510 933 581 878 632 c
823 683 748 709 651 709 c

449 795 m
362 816 295 857 246 916 c
198 975 174 1048 174 1133 c
174 1252 216 1347 301 1416 c
386 1485 503 1520 651 1520 c
800 1520 916 1485 1001 1416 c
1086 1347 1128 1252 1128 1133 c
1128 1048 1104 975 1055 916 c
1007 857 940 816 854 795 c
951 772 1027 728 1081 662 c
1136 596 1163 515 1163 420 c
1163 275 1119 164 1030 87 c
942 10 816 -29 651 -29 c
486 -29 360 10 271 87 c
183 164 139 275 139 420 c
139 515 166 596 221 662 c
276 728 352 772 449 795 c

375 1114 m
375 1037 399 976 447 933 c
496 890 564 868 651 868 c
738 868 805 890 854 933 c
903 976 928 1037 928 1114 c
928 1191 903 1252 854 1295 c
805 1338 738 1360 651 1360 c
564 1360 496 1338 447 1295 c
399 1252 375 1191 375 1114 c

ce} _d
/nine{1303 0 129 -29 1159 1520 sc
225 31 m
225 215 l
276 191 327 173 379 160 c
431 147 482 141 532 141 c
665 141 767 186 837 275 c
908 365 948 501 958 684 c
919 627 870 583 811 552 c
752 521 686 506 614 506 c
465 506 346 551 259 641 c
172 732 129 855 129 1012 c
129 1165 174 1288 265 1381 c
356 1474 476 1520 627 1520 c
800 1520 931 1454 1022 1321 c
1113 1189 1159 997 1159 745 c
1159 510 1103 322 991 181 c
880 41 730 -29 541 -29 c
490 -29 439 -24 387 -14 c
335 -4 281 11 225 31 c

627 664 m
718 664 789 695 842 757 c
895 819 922 904 922 1012 c
922 1119 895 1204 842 1266 c
789 1329 718 1360 627 1360 c
536 1360 464 1329 411 1266 c
358 1204 332 1119 332 1012 c
332 904 358 819 411 757 c
464 695 536 664 627 664 c

ce} _d
/A{1401 0 16 0 1384 1493 sc
700 1294 m
426 551 l
975 551 l
700 1294 l

586 1493 m
815 1493 l
1384 0 l
1174 0 l
1038 383 l
365 383 l
229 0 l
16 0 l
586 1493 l

ce} _d
/B{1405 0 201 0 1260 1493 sc
403 713 m
403 166 l
727 166 l
836 166 916 188 968 233 c
1021 278 1047 347 1047 440 c
1047 533 1021 602 968 646 c
916 691 836 713 727 713 c
403 713 l

403 1327 m
403 877 l
702 877 l
801 877 874 895 922 932 c
971 969 995 1026 995 1102 c
995 1177 971 1234 922 1271 c
874 1308 801 1327 702 1327 c
403 1327 l

201 1493 m
717 1493 l
871 1493 990 1461 1073 1397 c
1156 1333 1198 1242 1198 1124 c
1198 1033 1177 960 1134 906 c
1091 852 1029 818 946 805 c
1045 784 1122 739 1177 671 c
1232 604 1260 519 1260 418 c
1260 285 1215 182 1124 109 c
1033 36 904 0 737 0 c
201 0 l
201 1493 l

ce} _d
/C{1430 0 115 -29 1319 1520 sc
1319 1378 m
1319 1165 l
1251 1228 1178 1276 1101 1307 c
1024 1338 943 1354 856 1354 c
685 1354 555 1302 464 1197 c
373 1093 328 942 328 745 c
328 548 373 398 464 293 c
555 189 685 137 856 137 c
943 137 1024 153 1101 184 c
1178 215 1251 263 1319 326 c
1319 115 l
1248 67 1173 31 1094 7 c
1015 -17 932 -29 844 -29 c
618 -29 440 40 310 178 c
180 317 115 506 115 745 c
115 985 180 1174 310 1312 c
440 1451 618 1520 844 1520 c
933 1520 1017 1508 1096 1484 c
1175 1461 1250 1425 1319 1378 c

ce} _d
/D{1577 0 201 0 1456 1493 sc
403 1327 m
403 166 l
647 166 l
853 166 1004 213 1099 306 c
1195 399 1243 547 1243 748 c
1243 948 1195 1094 1099 1187 c
1004 1280 853 1327 647 1327 c
403 1327 l

201 1493 m
616 1493 l
905 1493 1118 1433 1253 1312 c
1388 1192 1456 1004 1456 748 c
1456 491 1388 302 1252 181 c
1116 60 904 0 616 0 c
201 0 l
201 1493 l

ce} _d
/M{1767 0 201 0 1567 1493 sc
201 1493 m
502 1493 l
883 477 l
1266 1493 l
1567 1493 l
1567 0 l
1370 0 l
1370 1311 l
985 287 l
782 287 l
397 1311 l
397 0 l
201 0 l
201 1493 l

ce} _d
/P{1235 0 201 0 1165 1493 sc
403 1327 m
403 766 l
657 766 l
751 766 824 790 875 839 c
926 888 952 957 952 1047 c
952 1136 926 1205 875 1254 c
824 1303 751 1327 657 1327 c
403 1327 l

201 1493 m
657 1493 l
824 1493 951 1455 1036 1379 c
1122 1304 1165 1193 1165 1047 c
1165 900 1122 788 1036 713 c
951 638 824 600 657 600 c
403 600 l
403 0 l
201 0 l
201 1493 l

ce} _d
/R{1423 0 201 0 1364 1493 sc
909 700 m
952 685 994 654 1035 606 c
1076 558 1118 492 1159 408 c
1364 0 l
1147 0 l
956 383 l
907 483 859 549 812 582 c
766 615 703 631 623 631 c
403 631 l
403 0 l
201 0 l
201 1493 l
657 1493 l
828 1493 955 1457 1039 1386 c
1123 1315 1165 1207 1165 1063 c
1165 969 1143 891 1099 829 c
1056 767 992 724 909 700 c

403 1327 m
403 797 l
657 797 l
754 797 828 819 877 864 c
927 909 952 976 952 1063 c
952 1150 927 1216 877 1260 c
828 1305 754 1327 657 1327 c
403 1327 l

ce} _d
/a{1255 0 123 -29 1069 1147 sc
702 563 m
553 563 450 546 393 512 c
336 478 307 420 307 338 c
307 273 328 221 371 182 c
414 144 473 125 547 125 c
649 125 731 161 792 233 c
854 306 885 402 885 522 c
885 563 l
702 563 l

1069 639 m
1069 0 l
885 0 l
885 170 l
843 102 791 52 728 19 c
665 -13 589 -29 498 -29 c
383 -29 292 3 224 67 c
157 132 123 218 123 326 c
123 452 165 547 249 611 c
334 675 460 707 627 707 c
885 707 l
885 725 l
885 810 857 875 801 921 c
746 968 668 991 567 991 c
503 991 441 983 380 968 c
319 953 261 930 205 899 c
205 1069 l
272 1095 338 1114 401 1127 c
464 1140 526 1147 586 1147 c
748 1147 869 1105 949 1021 c
1029 937 1069 810 1069 639 c

ce} _d
/c{1126 0 113 -29 999 1147 sc
999 1077 m
999 905 l
947 934 895 955 842 969 c
790 984 737 991 684 991 c
565 991 472 953 406 877 c
340 802 307 696 307 559 c
307 422 340 316 406 240 c
472 165 565 127 684 127 c
737 127 790 134 842 148 c
895 163 947 184 999 213 c
999 43 l
948 19 894 1 839 -11 c
784 -23 726 -29 664 -29 c
495 -29 361 24 262 130 c
163 236 113 379 113 559 c
113 742 163 885 263 990 c
364 1095 501 1147 676 1147 c
733 1147 788 1141 842 1129 c
896 1118 948 1100 999 1077 c

ce} _d
/d{1300 0 113 -29 1114 1556 sc
930 950 m
930 1556 l
1114 1556 l
1114 0 l
930 0 l
930 168 l
891 101 842 52 783 19 c
724 -13 654 -29 571 -29 c
436 -29 325 25 240 133 c
155 241 113 383 113 559 c
113 735 155 877 240 985 c
325 1093 436 1147 571 1147 c
654 1147 724 1131 783 1098 c
842 1066 891 1017 930 950 c

303 559 m
303 424 331 317 386 240 c
442 163 519 125 616 125 c
713 125 790 163 846 240 c
902 317 930 424 930 559 c
930 694 902 800 846 877 c
790 954 713 993 616 993 c
519 993 442 954 386 877 c
331 800 303 694 303 559 c

ce} _d
/e{1260 0 113 -29 1151 1147 sc
1151 606 m
1151 516 l
305 516 l
313 389 351 293 419 226 c
488 160 583 127 705 127 c
776 127 844 136 910 153 c
977 170 1043 196 1108 231 c
1108 57 l
1042 29 974 8 905 -7 c
836 -22 765 -29 694 -29 c
515 -29 374 23 269 127 c
165 231 113 372 113 549 c
113 732 162 878 261 985 c
360 1093 494 1147 662 1147 c
813 1147 932 1098 1019 1001 c
1107 904 1151 773 1151 606 c

967 660 m
966 761 937 841 882 901 c
827 961 755 991 664 991 c
561 991 479 962 417 904 c
356 846 320 764 311 659 c
967 660 l

ce} _d
/g{1300 0 113 -426 1114 1147 sc
930 573 m
930 706 902 810 847 883 c
792 956 715 993 616 993 c
517 993 440 956 385 883 c
330 810 303 706 303 573 c
303 440 330 337 385 264 c
440 191 517 154 616 154 c
715 154 792 191 847 264 c
902 337 930 440 930 573 c

1114 139 m
1114 -52 1072 -193 987 -286 c
902 -379 773 -426 598 -426 c
533 -426 472 -421 415 -411 c
358 -402 302 -387 248 -367 c
248 -188 l
302 -217 355 -239 408 -253 c
461 -267 514 -274 569 -274 c
690 -274 780 -242 840 -179 c
900 -116 930 -21 930 106 c
930 197 l
892 131 843 82 784 49 c
725 16 654 0 571 0 c
434 0 323 52 239 157 c
155 262 113 400 113 573 c
113 746 155 885 239 990 c
323 1095 434 1147 571 1147 c
654 1147 725 1131 784 1098 c
843 1065 892 1016 930 950 c
930 1120 l
1114 1120 l
1114 139 l

ce} _d
/h{1298 0 186 0 1124 1556 sc
1124 676 m
1124 0 l
940 0 l
940 670 l
940 776 919 855 878 908 c
837 961 775 987 692 987 c
593 987 514 955 457 892 c
400 829 371 742 371 633 c
371 0 l
186 0 l
186 1556 l
371 1556 l
371 946 l
415 1013 467 1064 526 1097 c
586 1130 655 1147 733 1147 c
862 1147 959 1107 1025 1027 c
1091 948 1124 831 1124 676 c

ce} _d
/i{569 0 193 0 377 1556 sc
193 1120 m
377 1120 l
377 0 l
193 0 l
193 1120 l

193 1556 m
377 1556 l
377 1323 l
193 1323 l
193 1556 l

ce} _d
/l{569 0 193 0 377 1556 sc
193 1556 m
377 1556 l
377 0 l
193 0 l
193 1556 l

ce} _d
/m{1995 0 186 0 1821 1147 sc
1065 905 m
1111 988 1166 1049 1230 1088 c
1294 1127 1369 1147 1456 1147 c
1573 1147 1663 1106 1726 1024 c
1789 943 1821 827 1821 676 c
1821 0 l
1636 0 l
1636 670 l
1636 777 1617 857 1579 909 c
1541 961 1483 987 1405 987 c
1310 987 1234 955 1179 892 c
1124 829 1096 742 1096 633 c
1096 0 l
911 0 l
911 670 l
911 778 892 858 854 909 c
816 961 757 987 678 987 c
584 987 509 955 454 891 c
399 828 371 742 371 633 c
371 0 l
186 0 l
186 1120 l
371 1120 l
371 946 l
413 1015 463 1065 522 1098 c
581 1131 650 1147 731 1147 c
812 1147 881 1126 938 1085 c
995 1044 1038 984 1065 905 c

ce} _d
/n{1298 0 186 0 1124 1147 sc
1124 676 m
1124 0 l
940 0 l
940 670 l
940 776 919 855 878 908 c
837 961 775 987 692 987 c
593 987 514 955 457 892 c
400 829 371 742 371 633 c
371 0 l
186 0 l
186 1120 l
371 1120 l
371 946 l
415 1013 467 1064 526 1097 c
586 1130 655 1147 733 1147 c
862 1147 959 1107 1025 1027 c
1091 948 1124 831 1124 676 c

ce} _d
/o{1253 0 113 -29 1141 1147 sc
627 991 m
528 991 450 952 393 875 c
336 798 307 693 307 559 c
307 425 335 319 392 242 c
449 165 528 127 627 127 c
725 127 803 166 860 243 c
917 320 946 426 946 559 c
946 692 917 797 860 874 c
803 952 725 991 627 991 c

627 1147 m
787 1147 913 1095 1004 991 c
1095 887 1141 743 1141 559 c
1141 376 1095 232 1004 127 c
913 23 787 -29 627 -29 c
466 -29 340 23 249 127 c
158 232 113 376 113 559 c
113 743 158 887 249 991 c
340 1095 466 1147 627 1147 c

ce} _d
/r{842 0 186 0 842 1147 sc
842 948 m
821 960 799 969 774 974 c
750 980 723 983 694 983 c
590 983 510 949 454 881 c
399 814 371 717 371 590 c
371 0 l
186 0 l
186 1120 l
371 1120 l
371 946 l
410 1014 460 1064 522 1097 c
584 1130 659 1147 748 1147 c
761 1147 775 1146 790 1144 c
805 1143 822 1140 841 1137 c
842 948 l

ce} _d
/s{1067 0 111 -29 967 1147 sc
907 1087 m
907 913 l
855 940 801 960 745 973 c
689 986 631 993 571 993 c
480 993 411 979 365 951 c
320 923 297 881 297 825 c
297 782 313 749 346 724 c
379 700 444 677 543 655 c
606 641 l
737 613 829 573 884 522 c
939 471 967 400 967 309 c
967 205 926 123 843 62 c
761 1 648 -29 504 -29 c
444 -29 381 -23 316 -11 c
251 0 183 18 111 41 c
111 231 l
179 196 246 169 312 151 c
378 134 443 125 508 125 c
595 125 661 140 708 169 c
755 199 778 241 778 295 c
778 345 761 383 727 410 c
694 437 620 462 506 487 c
442 502 l
328 526 246 563 195 612 c
144 662 119 730 119 817 c
119 922 156 1004 231 1061 c
306 1118 412 1147 549 1147 c
617 1147 681 1142 741 1132 c
801 1122 856 1107 907 1087 c

ce} _d
/t{803 0 55 0 754 1438 sc
375 1438 m
375 1120 l
754 1120 l
754 977 l
375 977 l
375 369 l
375 278 387 219 412 193 c
437 167 488 154 565 154 c
754 154 l
754 0 l
565 0 l
423 0 325 26 271 79 c
217 132 190 229 190 369 c
190 977 l
55 977 l
55 1120 l
190 1120 l
190 1438 l
375 1438 l

ce} _d
/u{1298 0 174 -29 1112 1147 sc
174 442 m
174 1120 l
358 1120 l
358 449 l
358 343 379 263 420 210 c
461 157 523 131 606 131 c
705 131 784 163 841 226 c
899 289 928 376 928 485 c
928 1120 l
1112 1120 l
1112 0 l
928 0 l
928 172 l
883 104 831 53 772 20 c
713 -13 645 -29 567 -29 c
438 -29 341 11 274 91 c
207 171 174 288 174 442 c

637 1147 m
637 1147 l

ce} _d
/v{1212 0 61 0 1151 1120 sc
61 1120 m
256 1120 l
606 180 l
956 1120 l
1151 1120 l
731 0 l
481 0 l
61 1120 l

ce} _d
/y{1212 0 61 -426 1151 1120 sc
659 -104 m
607 -237 556 -324 507 -365 c
458 -406 392 -426 309 -426 c
162 -426 l
162 -272 l
270 -272 l
321 -272 360 -260 388 -236 c
416 -212 447 -155 481 -66 c
514 18 l
61 1120 l
256 1120 l
606 244 l
956 1120 l
1151 1120 l
659 -104 l

ce} _d
end readonly def

/BuildGlyph {
 exch begin
 CharStrings exch
 2 copy known not {pop /.notdef} if
 true 3 1 roll get exec
 end
} _d

/BuildChar {
 1 index /Encoding get exch get
 1 index /BuildGlyph get exec
} _d

FontName currentdict end definefont pop
end
%%EndProlog
mpldict begin
18 180 translate
576 432 0 0 clipbox
gsave
0 0 m
576 0 l
576 432 l
0 432 l
cl
1.000 setgray
fill
grestore
gsave
67.15 242 m
565.2 242 l
565.2 404 l
67.15 404 l
cl
1.000 setgray
fill
grestore
0.800 setlinewidth
1 setlinejoin
0 setlinecap
[] 0 setdash
0.000 setgray
gsave
/o {
gsave
newpath
translate
0.8 setlinewidth
1 setlinejoin

0 setlinecap

0 0 m
0 -3.5 l

gsave
0.000 setgray
fill
grestore
stroke
grestore
} bind def
89.7886 242 o
grestore
/DejaVuSans 14.000 selectfont
gsave

71.976136 224.359375 translate
0.000000 rotate
0.000000 0 m /two glyphshow
8.907227 0 m /zero glyphshow
17.814453 0 m /one glyphshow
26.721680 0 m /six glyphshow
grestore
gsave
/o {
gsave
newpath
translate
0.8 setlinewidth
1 setlinejoin

0 setlinecap

0 0 m
0 -3.5 l

gsave
0.000 setgray
fill
grestore
stroke
grestore
} bind def
186.982 242 o
grestore
gsave

169.169578 224.359375 translate
0.000000 rotate
0.000000 0 m /two glyphshow
8.907227 0 m /zero glyphshow
17.814453 0 m /one glyphshow
26.721680 0 m /seven glyphshow
grestore
gsave
/o {
gsave
newpath
translate
0.8 setlinewidth
1 setlinejoin

0 setlinecap

0 0 m
0 -3.5 l

gsave
0.000 setgray
fill
grestore
stroke
grestore
} bind def
283.91 242 o
grestore
gsave

266.097464 224.359375 translate
0.000000 rotate
0.000000 0 m /two glyphshow
8.907227 0 m /zero glyphshow
17.814453 0 m /one glyphshow
26.721680 0 m /eight glyphshow
grestore
gsave
/o {
gsave
newpath
translate
0.8 setlinewidth
1 setlinejoin

0 setlinecap

0 0 m
0 -3.5 l

gsave
0.000 setgray
fill
grestore
stroke
grestore
} bind def
380.838 242 o
grestore
gsave

363.025350 224.359375 translate
0.000000 rotate
0.000000 0 m /two glyphshow
8.907227 0 m /zero glyphshow
17.814453 0 m /one glyphshow
26.721680 0 m /nine glyphshow
grestore
gsave
/o {
gsave
newpath
translate
0.8 setlinewidth
1 setlinejoin

0 setlinecap

0 0 m
0 -3.5 l

gsave
0.000 setgray
fill
grestore
stroke
grestore
} bind def
477.766 242 o
grestore
gsave

459.953236 224.359375 translate
0.000000 rotate
0.000000 0 m /two glyphshow
8.907227 0 m /zero glyphshow
17.814453 0 m /two glyphshow
26.721680 0 m /zero glyphshow
grestore
gsave
/o {
gsave
newpath
translate
0.8 setlinewidth
1 setlinejoin

0 setlinecap

-0 0 m
-3.5 0 l

gsave
0.000 setgray
fill
grestore
stroke
grestore
} bind def
67.15 249.204 o
grestore
/DejaVuSans 10.000 selectfont
gsave

53.790625 245.407516 translate
0.000000 rotate
0.000000 0 m /zero glyphshow
grestore
gsave
/o {
gsave
newpath
translate
0.8 setlinewidth
1 setlinejoin

0 setlinecap

-0 0 m
-3.5 0 l

gsave
0.000 setgray
fill
grestore
stroke
grestore
} bind def
67.15 278.158 o
grestore
gsave

34.712500 274.361164 translate
0.000000 rotate
0.000000 0 m /two glyphshow
6.362305 0 m /zero glyphshow
12.724609 0 m /zero glyphshow
19.086914 0 m /zero glyphshow
grestore
gsave
/o {
gsave
newpath
translate
0.8 setlinewidth
1 setlinejoin

0 setlinecap

-0 0 m
-3.5 0 l

gsave
0.000 setgray
fill
grestore
stroke
grestore
} bind def
67.15 307.112 o
grestore
gsave

34.712500 303.314811 translate
0.000000 rotate
0.000000 0 m /four glyphshow
6.362305 0 m /zero glyphshow
12.724609 0 m /zero glyphshow
19.086914 0 m /zero glyphshow
grestore
gsave
/o {
gsave
newpath
translate
0.8 setlinewidth
1 setlinejoin

0 setlinecap

-0 0 m
-3.5 0 l

gsave
0.000 setgray
fill
grestore
stroke
grestore
} bind def
67.15 336.065 o
grestore
gsave

34.712500 332.268458 translate
0.000000 rotate
0.000000 0 m /six glyphshow
6.362305 0 m /zero glyphshow
12.724609 0 m /zero glyphshow
19.086914 0 m /zero glyphshow
grestore
gsave
/o {
gsave
newpath
translate
0.8 setlinewidth
1 setlinejoin

0 setlinecap

-0 0 m
-3.5 0 l

gsave
0.000 setgray
fill
grestore
stroke
grestore
} bind def
67.15 365.019 o
grestore
gsave

34.712500 361.222106 translate
0.000000 rotate
0.000000 0 m /eight glyphshow
6.362305 0 m /zero glyphshow
12.724609 0 m /zero glyphshow
19.086914 0 m /zero glyphshow
grestore
gsave
/o {
gsave
newpath
translate
0.8 setlinewidth
1 setlinejoin

0 setlinecap

-0 0 m
-3.5 0 l

gsave
0.000 setgray
fill
grestore
stroke
grestore
} bind def
67.15 393.973 o
grestore
gsave

28.353125 390.175753 translate
0.000000 rotate
0.000000 0 m /one glyphshow
6.362305 0 m /zero glyphshow
12.724609 0 m /zero glyphshow
19.086914 0 m /zero glyphshow
25.449219 0 m /zero glyphshow
grestore
/DejaVuSans 14.000 selectfont
gsave

21.446875 272.671875 translate
90.000000 rotate
0.000000 0 m /D glyphshow
10.780273 0 m /e glyphshow
19.393555 0 m /n glyphshow
28.266602 0 m /g glyphshow
37.153320 0 m /u glyphshow
46.026367 0 m /e glyphshow
54.639648 0 m /space glyphshow
59.089844 0 m /C glyphshow
68.865234 0 m /a glyphshow
77.444336 0 m /s glyphshow
84.738281 0 m /e glyphshow
93.351562 0 m /s glyphshow
grestore
1.500 setlinewidth
2 setlinecap
0.122 0.467 0.706 setrgbcolor
gsave
498.05 162 67.15 242 clipbox
89.788636 261.495215 m
98.020868 264.984129 l
105.721987 267.430712 l
113.954219 362.934318 l
121.920894 396.636364 l
130.153126 269.327176 l
138.119801 254.777968 l
146.352033 252.606445 l
154.584264 250.319107 l
162.55094 250.30463 l
170.783171 250.57969 l
178.749847 252.027372 l
186.982078 254.068604 l
195.21431 258.64328 l
202.649873 288.755074 l
210.882105 267.184606 l
218.84878 253.156564 l
227.081012 250.854749 l
235.047687 250.275676 l
243.279919 250.130908 l
251.51215 249.884802 l
259.478826 250.101954 l
267.711057 251.013994 l
275.677733 251.028471 l
283.909964 251.564114 l
292.142195 253.011796 l
299.577759 251.564114 l
307.809991 256.022975 l
315.776666 258.426128 l
324.008898 258.122115 l
331.975573 254.112035 l
340.207805 253.286856 l
348.440036 251.144286 l
356.406712 250.449398 l
364.638943 250.999517 l
372.605619 251.158762 l
380.83785 253.663253 l
389.070081 254.879306 l
396.505645 252.76569 l
404.737877 269.471944 l
412.704552 353.741535 l
420.936784 358.866331 l
428.903459 266.750302 l
437.13569 252.982842 l
445.367922 250.94161 l
453.334597 250.507305 l
461.566829 251.375915 l
469.533504 251.85365 l
477.765736 251.81022 l
485.997967 252.997319 l
493.699087 263.999705 l
501.931318 274.524356 l
509.897994 259.207876 l
518.130225 249.363636 l
526.096901 249.71108 l
534.329132 249.841372 l
stroke
grestore
1.000 0.498 0.055 setrgbcolor
gsave
498.05 162 67.15 242 clipbox
89.788636 279.359615 m
98.020868 301.552586 l
105.721987 302.725208 l
113.954219 326.496153 l
121.920894 365.916544 l
130.153126 267.647865 l
138.119801 257.586472 l
146.352033 254.488432 l
154.584264 251.839173 l
162.55094 251.926034 l
170.783171 251.969465 l
178.749847 256.211174 l
186.982078 269.602236 l
195.21431 267.966355 l
202.649873 257.543042 l
210.882105 257.514088 l
218.84878 253.561915 l
227.081012 252.316908 l
235.047687 251.245623 l
243.279919 251.202193 l
251.51215 250.840272 l
259.478826 249.971663 l
267.711057 252.910458 l
275.677733 252.273478 l
283.909964 263.79703 l
292.142195 263.116619 l
299.577759 258.585373 l
307.809991 263.478539 l
315.776666 261.408354 l
324.008898 256.384896 l
331.975573 254.604247 l
340.207805 253.417147 l
348.440036 252.838074 l
356.406712 250.565213 l
364.638943 252.331385 l
372.605619 255.009598 l
380.83785 255.791346 l
389.070081 260.858234 l
396.505645 274.075574 l
404.737877 303.724109 l
412.704552 350.643495 l
420.936784 318.302271 l
428.903459 265.215758 l
437.13569 253.923836 l
445.367922 252.273478 l
453.334597 251.2601 l
461.566829 253.735637 l
469.533504 252.823597 l
477.765736 253.923836 l
485.997967 257.123214 l
493.699087 256.13879 l
501.931318 257.847055 l
509.897994 250.89818 l
518.130225 249.870325 l
526.096901 250.536259 l
534.329132 249.754511 l
542.561364 249.464974 l
stroke
grestore
0.173 0.627 0.173 setrgbcolor
gsave
498.05 162 67.15 242 clipbox
89.788636 274.886277 m
98.020868 285.005576 l
105.721987 335.891611 l
113.954219 378.004692 l
121.920894 297.166108 l
130.153126 264.824884 l
138.119801 256.544141 l
146.352033 251.897081 l
154.584264 251.245623 l
162.55094 251.375915 l
170.783171 252.982842 l
178.749847 256.080883 l
186.982078 260.308115 l
195.21431 258.035254 l
202.649873 256.587571 l
210.882105 254.676631 l
218.84878 252.76569 l
227.081012 250.999517 l
235.047687 250.999517 l
243.279919 250.681027 l
251.51215 251.013994 l
259.478826 251.85365 l
267.711057 251.781266 l
275.677733 252.49063 l
283.909964 254.792445 l
292.142195 253.619823 l
299.577759 258.817002 l
307.809991 262.146672 l
315.776666 262.320394 l
324.008898 257.73124 l
331.975573 256.153267 l
340.207805 252.924935 l
348.440036 251.564114 l
356.406712 252.360339 l
364.638943 252.591968 l
372.605619 255.994022 l
380.83785 259.048631 l
389.070081 257.108737 l
396.505645 276.391866 l
404.737877 315.044985 l
412.704552 333.502936 l
420.936784 283.16702 l
428.903459 261.770274 l
437.13569 254.285756 l
445.367922 252.027372 l
453.334597 252.461677 l
461.566829 252.070802 l
469.533504 252.548538 l
477.765736 254.213372 l
485.997967 252.230047 l
493.699087 251.824696 l
501.931318 250.637597 l
509.897994 249.913756 l
518.130225 249.624219 l
526.096901 249.884802 l
534.329132 249.66765 l
542.561364 249.624219 l
stroke
grestore
0.800 setlinewidth
0 setlinejoin
0.000 setgray
gsave
67.15 242 m
67.15 404 l
stroke
grestore
gsave
565.2 242 m
565.2 404 l
stroke
grestore
gsave
67.15 242 m
565.2 242 l
stroke
grestore
gsave
67.15 404 m
565.2 404 l
stroke
grestore
/DejaVuSans 15.000 selectfont
gsave

146.604687 410.000000 translate
0.000000 rotate
0.000000 0 m /P glyphshow
8.795410 0 m /r glyphshow
14.587402 0 m /e glyphshow
23.815918 0 m /d glyphshow
33.337402 0 m /i glyphshow
37.504883 0 m /c glyphshow
45.751953 0 m /t glyphshow
51.633301 0 m /i glyphshow
55.800781 0 m /o glyphshow
64.978027 0 m /n glyphshow
74.484863 0 m /space glyphshow
79.252930 0 m /A glyphshow
89.514160 0 m /n glyphshow
99.020996 0 m /a glyphshow
108.212891 0 m /l glyphshow
112.380371 0 m /y glyphshow
121.257324 0 m /s glyphshow
129.072266 0 m /i glyphshow
133.239746 0 m /s glyphshow
141.054688 0 m /space glyphshow
145.822754 0 m /hyphen glyphshow
151.235352 0 m /space glyphshow
156.003418 0 m /M glyphshow
168.945312 0 m /o glyphshow
178.122559 0 m /d glyphshow
187.644043 0 m /e glyphshow
196.872559 0 m /l glyphshow
201.040039 0 m /space glyphshow
205.808105 0 m /v glyphshow
214.685059 0 m /s glyphshow
222.500000 0 m /space glyphshow
227.268066 0 m /R glyphshow
237.065430 0 m /e glyphshow
246.293945 0 m /a glyphshow
255.485840 0 m /l glyphshow
259.653320 0 m /space glyphshow
264.421387 0 m /parenleft glyphshow
270.273438 0 m /one glyphshow
279.816895 0 m /space glyphshow
284.584961 0 m /m glyphshow
299.196777 0 m /o glyphshow
308.374023 0 m /n glyphshow
317.880859 0 m /t glyphshow
323.762207 0 m /h glyphshow
333.269043 0 m /parenright glyphshow
grestore
1.000 setlinewidth
0 setlinecap
0.800 setgray
gsave
451.240625 331.159375 m
555.4 331.159375 l
557.266667 331.159375 558.2 332.092708 558.2 333.959375 c
558.2 394.2 l
558.2 396.066667 557.266667 397 555.4 397 c
451.240625 397 l
449.373958 397 448.440625 396.066667 448.440625 394.2 c
448.440625 333.959375 l
448.440625 332.092708 449.373958 331.159375 451.240625 331.159375 c
cl
gsave
1.000 setgray
fill
grestore
stroke
grestore
1.500 setlinewidth
1 setlinejoin
2 setlinecap
0.122 0.467 0.706 setrgbcolor
gsave
454.040625 385.659375 m
468.040625 385.659375 l
482.040625 385.659375 l
stroke
grestore
0.000 setgray
/DejaVuSans 14.000 selectfont
gsave

493.240625 380.759375 translate
0.000000 rotate
0.000000 0 m /B glyphshow
9.604492 0 m /a glyphshow
18.183594 0 m /s glyphshow
25.477539 0 m /e glyphshow
34.090820 0 m /l glyphshow
37.980469 0 m /i glyphshow
41.870117 0 m /n glyphshow
50.743164 0 m /e glyphshow
grestore
1.000 0.498 0.055 setrgbcolor
gsave
454.040625 365.1125 m
468.040625 365.1125 l
482.040625 365.1125 l
stroke
grestore
0.000 setgray
gsave

493.240625 360.212500 translate
0.000000 rotate
0.000000 0 m /M glyphshow
12.079102 0 m /o glyphshow
20.644531 0 m /d glyphshow
29.531250 0 m /e glyphshow
38.144531 0 m /l glyphshow
grestore
0.173 0.627 0.173 setrgbcolor
gsave
454.040625 344.565625 m
468.040625 344.565625 l
482.040625 344.565625 l
stroke
grestore
0.000 setgray
gsave

493.240625 339.665625 translate
0.000000 rotate
0.000000 0 m /R glyphshow
9.102539 0 m /e glyphshow
17.715820 0 m /a glyphshow
26.294922 0 m /l glyphshow
grestore
gsave
67.15 31.4 m
565.2 31.4 l
565.2 193.4 l
67.15 193.4 l
cl
1.000 setgray
fill
grestore
0.800 setlinewidth
0 setlinecap
gsave
/o {
gsave
newpath
translate
0.8 setlinewidth
1 setlinejoin

0 setlinecap

0 0 m
0 -3.5 l

gsave
0.000 setgray
fill
grestore
stroke
grestore
} bind def
89.7886 31.4 o
grestore
gsave

71.976136 13.759375 translate
0.000000 rotate
0.000000 0 m /two glyphshow
8.907227 0 m /zero glyphshow
17.814453 0 m /one glyphshow
26.721680 0 m /six glyphshow
grestore
gsave
/o {
gsave
newpath
translate
0.8 setlinewidth
1 setlinejoin

0 setlinecap

0 0 m
0 -3.5 l

gsave
0.000 setgray
fill
grestore
stroke
grestore
} bind def
185.301 31.4 o
grestore
gsave

167.489000 13.759375 translate
0.000000 rotate
0.000000 0 m /two glyphshow
8.907227 0 m /zero glyphshow
17.814453 0 m /one glyphshow
26.721680 0 m /seven glyphshow
grestore
gsave
/o {
gsave
newpath
translate
0.8 setlinewidth
1 setlinejoin

0 setlinecap

0 0 m
0 -3.5 l

gsave
0.000 setgray
fill
grestore
stroke
grestore
} bind def
280.553 31.4 o
grestore
gsave

262.740899 13.759375 translate
0.000000 rotate
0.000000 0 m /two glyphshow
8.907227 0 m /zero glyphshow
17.814453 0 m /one glyphshow
26.721680 0 m /eight glyphshow
grestore
gsave
/o {
gsave
newpath
translate
0.8 setlinewidth
1 setlinejoin

0 setlinecap

0 0 m
0 -3.5 l

gsave
0.000 setgray
fill
grestore
stroke
grestore
} bind def
375.805 31.4 o
grestore
gsave

357.992799 13.759375 translate
0.000000 rotate
0.000000 0 m /two glyphshow
8.907227 0 m /zero glyphshow
17.814453 0 m /one glyphshow
26.721680 0 m /nine glyphshow
grestore
gsave
/o {
gsave
newpath
translate
0.8 setlinewidth
1 setlinejoin

0 setlinecap

0 0 m
0 -3.5 l

gsave
0.000 setgray
fill
grestore
stroke
grestore
} bind def
471.057 31.4 o
grestore
gsave

453.244698 13.759375 translate
0.000000 rotate
0.000000 0 m /two glyphshow
8.907227 0 m /zero glyphshow
17.814453 0 m /two glyphshow
26.721680 0 m /zero glyphshow
grestore
gsave
/o {
gsave
newpath
translate
0.8 setlinewidth
1 setlinejoin

0 setlinecap

-0 0 m
-3.5 0 l

gsave
0.000 setgray
fill
grestore
stroke
grestore
} bind def
67.15 38.5195 o
grestore
/DejaVuSans 10.000 selectfont
gsave

53.790625 34.722669 translate
0.000000 rotate
0.000000 0 m /zero glyphshow
grestore
gsave
/o {
gsave
newpath
translate
0.8 setlinewidth
1 setlinejoin

0 setlinecap

-0 0 m
-3.5 0 l

gsave
0.000 setgray
fill
grestore
stroke
grestore
} bind def
67.15 59.745 o
grestore
gsave

34.712500 55.948110 translate
0.000000 rotate
0.000000 0 m /two glyphshow
6.362305 0 m /zero glyphshow
12.724609 0 m /zero glyphshow
19.086914 0 m /zero glyphshow
grestore
gsave
/o {
gsave
newpath
translate
0.8 setlinewidth
1 setlinejoin

0 setlinecap

-0 0 m
-3.5 0 l

gsave
0.000 setgray
fill
grestore
stroke
grestore
} bind def
67.15 80.9704 o
grestore
gsave

34.712500 77.173552 translate
0.000000 rotate
0.000000 0 m /four glyphshow
6.362305 0 m /zero glyphshow
12.724609 0 m /zero glyphshow
19.086914 0 m /zero glyphshow
grestore
gsave
/o {
gsave
newpath
translate
0.8 setlinewidth
1 setlinejoin

0 setlinecap

-0 0 m
-3.5 0 l

gsave
0.000 setgray
fill
grestore
stroke
grestore
} bind def
67.15 102.196 o
grestore
gsave

34.712500 98.398994 translate
0.000000 rotate
0.000000 0 m /six glyphshow
6.362305 0 m /zero glyphshow
12.724609 0 m /zero glyphshow
19.086914 0 m /zero glyphshow
grestore
gsave
/o {
gsave
newpath
translate
0.8 setlinewidth
1 setlinejoin

0 setlinecap

-0 0 m
-3.5 0 l

gsave
0.000 setgray
fill
grestore
stroke
grestore
} bind def
67.15 123.421 o
grestore
gsave

34.712500 119.624436 translate
0.000000 rotate
0.000000 0 m /eight glyphshow
6.362305 0 m /zero glyphshow
12.724609 0 m /zero glyphshow
19.086914 0 m /zero glyphshow
grestore
gsave
/o {
gsave
newpath
translate
0.8 setlinewidth
1 setlinejoin

0 setlinecap

-0 0 m
-3.5 0 l

gsave
0.000 setgray
fill
grestore
stroke
grestore
} bind def
67.15 144.647 o
grestore
gsave

28.353125 140.849877 translate
0.000000 rotate
0.000000 0 m /one glyphshow
6.362305 0 m /zero glyphshow
12.724609 0 m /zero glyphshow
19.086914 0 m /zero glyphshow
25.449219 0 m /zero glyphshow
grestore
gsave
/o {
gsave
newpath
translate
0.8 setlinewidth
1 setlinejoin

0 setlinecap

-0 0 m
-3.5 0 l

gsave
0.000 setgray
fill
grestore
stroke
grestore
} bind def
67.15 165.872 o
grestore
gsave

28.353125 162.075319 translate
0.000000 rotate
0.000000 0 m /one glyphshow
6.362305 0 m /two glyphshow
12.724609 0 m /zero glyphshow
19.086914 0 m /zero glyphshow
25.449219 0 m /zero glyphshow
grestore
gsave
/o {
gsave
newpath
translate
0.8 setlinewidth
1 setlinejoin

0 setlinecap

-0 0 m
-3.5 0 l

gsave
0.000 setgray
fill
grestore
stroke
grestore
} bind def
67.15 187.098 o
grestore
gsave

28.353125 183.300761 translate
0.000000 rotate
0.000000 0 m /one glyphshow
6.362305 0 m /four glyphshow
12.724609 0 m /zero glyphshow
19.086914 0 m /zero glyphshow
25.449219 0 m /zero glyphshow
grestore
/DejaVuSans 14.000 selectfont
gsave

21.446875 62.071875 translate
90.000000 rotate
0.000000 0 m /D glyphshow
10.780273 0 m /e glyphshow
19.393555 0 m /n glyphshow
28.266602 0 m /g glyphshow
37.153320 0 m /u glyphshow
46.026367 0 m /e glyphshow
54.639648 0 m /space glyphshow
59.089844 0 m /C glyphshow
68.865234 0 m /a glyphshow
77.444336 0 m /s glyphshow
84.738281 0 m /e glyphshow
93.351562 0 m /s glyphshow
grestore
1.500 setlinewidth
2 setlinecap
0.122 0.467 0.706 setrgbcolor
gsave
498.05 162 67.15 31.4 clipbox
89.788636 47.529744 m
97.878524 46.601131 l
105.446483 45.651292 l
113.53637 70.194978 l
121.365293 118.037124 l
129.455181 154.15575 l
137.284104 87.578615 l
145.373991 43.871893 l
153.463879 39.88151 l
161.292802 39.212908 l
169.382689 39.142157 l
177.211613 39.669255 l
185.3015 40.468747 l
193.391387 42.262297 l
200.698382 54.304197 l
208.78827 64.63745 l
216.617193 45.120656 l
224.70708 40.037163 l
232.536003 39.28366 l
240.625891 39.039567 l
248.715778 38.883914 l
256.544701 38.940515 l
264.634589 39.212908 l
272.463512 39.485301 l
280.553399 39.821371 l
288.643287 40.111452 l
295.950282 39.888585 l
304.040169 40.861418 l
311.869092 42.131406 l
319.95898 42.983962 l
327.787903 42.269372 l
335.87779 41.487568 l
343.967677 40.228192 l
351.796601 39.598504 l
359.886488 39.319035 l
367.715411 39.411012 l
375.805299 40.214042 l
383.895186 40.818967 l
391.202181 40.896793 l
399.292068 44.600633 l
407.120992 68.394353 l
415.210879 114.955897 l
423.039802 186.036364 l
431.12969 102.521326 l
439.219577 44.278714 l
447.0485 39.4287 l
455.138387 39.44285 l
462.967311 40.263568 l
471.057198 40.093764 l
479.147085 40.281255 l
486.715045 45.923685 l
494.804932 57.491551 l
502.633855 63.540802 l
510.723742 43.298806 l
518.552666 38.848538 l
526.642553 38.912214 l
534.73244 38.975891 l
542.561364 38.912214 l
stroke
grestore
1.000 0.498 0.055 setrgbcolor
gsave
498.05 162 67.15 31.4 clipbox
89.788636 54.014116 m
97.878524 64.892155 l
105.446483 77.974102 l
113.53637 102.567314 l
121.365293 110.873537 l
129.455181 95.499242 l
137.284104 70.817591 l
145.373991 43.737465 l
153.463879 41.448655 l
161.292802 40.6244 l
169.382689 40.39092 l
177.211613 41.533557 l
185.3015 46.609975 l
193.391387 57.360661 l
200.698382 68.751648 l
208.78827 56.041146 l
216.617193 44.00632 l
224.70708 43.14669 l
232.536003 40.822504 l
240.625891 40.12914 l
248.715778 39.609116 l
256.544701 39.502989 l
264.634589 40.033625 l
272.463512 40.323706 l
280.553399 43.606575 l
288.643287 50.179386 l
295.950282 64.594999 l
304.040169 62.483067 l
311.869092 53.349052 l
319.95898 49.726577 l
327.787903 44.56172 l
335.87779 41.533557 l
343.967677 41.215175 l
351.796601 40.454597 l
359.886488 40.461672 l
367.715411 41.126736 l
375.805299 43.16084 l
383.895186 46.475547 l
391.202181 47.614646 l
399.292068 63.392224 l
407.120992 101.863337 l
415.210879 120.577101 l
423.039802 90.401598 l
431.12969 55.99162 l
439.219577 42.060655 l
447.0485 39.945186 l
455.138387 40.284793 l
462.967311 40.967545 l
471.057198 42.304748 l
479.147085 43.836517 l
486.715045 47.961328 l
494.804932 51.463526 l
502.633855 55.223966 l
510.723742 45.891847 l
518.552666 39.655105 l
526.642553 39.251822 l
534.73244 39.06433 l
542.561364 38.853844 l
stroke
grestore
0.173 0.627 0.173 setrgbcolor
gsave
498.05 162 67.15 31.4 clipbox
89.788636 57.346511 m
97.878524 64.764802 l
105.446483 102.068516 l
113.53637 132.940921 l
121.365293 73.679488 l
129.455181 49.97067 l
137.284104 43.900193 l
145.373991 40.49351 l
153.463879 40.015937 l
161.292802 40.111452 l
169.382689 41.289464 l
177.211613 43.560586 l
185.3015 46.659501 l
193.391387 44.993304 l
200.698382 43.932031 l
208.78827 42.531152 l
216.617193 41.130273 l
224.70708 39.835521 l
232.536003 39.835521 l
240.625891 39.602041 l
248.715778 39.846134 l
256.544701 40.461672 l
264.634589 40.408608 l
272.463512 40.928631 l
280.553399 42.616054 l
288.643287 41.756424 l
295.950282 45.56639 l
304.040169 48.007316 l
311.869092 48.134669 l
319.95898 44.770436 l
327.787903 43.61365 l
335.87779 41.247013 l
343.967677 40.249417 l
351.796601 40.833117 l
359.886488 41.00292 l
367.715411 43.49691 l
375.805299 45.736194 l
383.895186 44.314089 l
391.202181 58.450234 l
399.292068 86.786198 l
407.120992 100.317417 l
415.210879 63.416987 l
423.039802 47.731385 l
431.12969 42.244609 l
439.219577 40.589024 l
447.0485 40.907406 l
455.138387 40.620863 l
462.967311 40.971082 l
471.057198 42.191545 l
479.147085 40.737602 l
486.715045 40.440446 l
494.804932 39.570203 l
502.633855 39.039567 l
510.723742 38.827313 l
518.552666 39.018342 l
526.642553 38.859151 l
534.73244 38.827313 l
542.561364 38.763636 l
stroke
grestore
0.800 setlinewidth
0 setlinejoin
0.000 setgray
gsave
67.15 31.4 m
67.15 193.4 l
stroke
grestore
gsave
565.2 31.4 m
565.2 193.4 l
stroke
grestore
gsave
67.15 31.4 m
565.2 31.4 l
stroke
grestore
gsave
67.15 193.4 m
565.2 193.4 l
stroke
grestore
/DejaVuSans 15.000 selectfont
gsave

142.698437 199.400000 translate
0.000000 rotate
0.000000 0 m /P glyphshow
8.795410 0 m /r glyphshow
14.587402 0 m /e glyphshow
23.815918 0 m /d glyphshow
33.337402 0 m /i glyphshow
37.504883 0 m /c glyphshow
45.751953 0 m /t glyphshow
51.633301 0 m /i glyphshow
55.800781 0 m /o glyphshow
64.978027 0 m /n glyphshow
74.484863 0 m /space glyphshow
79.252930 0 m /A glyphshow
89.514160 0 m /n glyphshow
99.020996 0 m /a glyphshow
108.212891 0 m /l glyphshow
112.380371 0 m /y glyphshow
121.257324 0 m /s glyphshow
129.072266 0 m /i glyphshow
133.239746 0 m /s glyphshow
141.054688 0 m /space glyphshow
145.822754 0 m /hyphen glyphshow
151.235352 0 m /space glyphshow
156.003418 0 m /M glyphshow
168.945312 0 m /o glyphshow
178.122559 0 m /d glyphshow
187.644043 0 m /e glyphshow
196.872559 0 m /l glyphshow
201.040039 0 m /space glyphshow
205.808105 0 m /v glyphshow
214.685059 0 m /s glyphshow
222.500000 0 m /space glyphshow
227.268066 0 m /R glyphshow
237.065430 0 m /e glyphshow
246.293945 0 m /a glyphshow
255.485840 0 m /l glyphshow
259.653320 0 m /space glyphshow
264.421387 0 m /parenleft glyphshow
270.273438 0 m /three glyphshow
279.816895 0 m /space glyphshow
284.584961 0 m /m glyphshow
299.196777 0 m /o glyphshow
308.374023 0 m /n glyphshow
317.880859 0 m /t glyphshow
323.762207 0 m /h glyphshow
333.269043 0 m /s glyphshow
341.083984 0 m /parenright glyphshow
grestore
1.000 setlinewidth
0 setlinecap
0.800 setgray
gsave
451.240625 120.559375 m
555.4 120.559375 l
557.266667 120.559375 558.2 121.492708 558.2 123.359375 c
558.2 183.6 l
558.2 185.466667 557.266667 186.4 555.4 186.4 c
451.240625 186.4 l
449.373958 186.4 448.440625 185.466667 448.440625 183.6 c
448.440625 123.359375 l
448.440625 121.492708 449.373958 120.559375 451.240625 120.559375 c
cl
gsave
1.000 setgray
fill
grestore
stroke
grestore
1.500 setlinewidth
1 setlinejoin
2 setlinecap
0.122 0.467 0.706 setrgbcolor
gsave
454.040625 175.059375 m
468.040625 175.059375 l
482.040625 175.059375 l
stroke
grestore
0.000 setgray
/DejaVuSans 14.000 selectfont
gsave

493.240625 170.159375 translate
0.000000 rotate
0.000000 0 m /B glyphshow
9.604492 0 m /a glyphshow
18.183594 0 m /s glyphshow
25.477539 0 m /e glyphshow
34.090820 0 m /l glyphshow
37.980469 0 m /i glyphshow
41.870117 0 m /n glyphshow
50.743164 0 m /e glyphshow
grestore
1.000 0.498 0.055 setrgbcolor
gsave
454.040625 154.5125 m
468.040625 154.5125 l
482.040625 154.5125 l
stroke
grestore
0.000 setgray
gsave

493.240625 149.612500 translate
0.000000 rotate
0.000000 0 m /M glyphshow
12.079102 0 m /o glyphshow
20.644531 0 m /d glyphshow
29.531250 0 m /e glyphshow
38.144531 0 m /l glyphshow
grestore
0.173 0.627 0.173 setrgbcolor
gsave
454.040625 133.965625 m
468.040625 133.965625 l
482.040625 133.965625 l
stroke
grestore
0.000 setgray
gsave

493.240625 129.065625 translate
0.000000 rotate
0.000000 0 m /R glyphshow
9.102539 0 m /e glyphshow
17.715820 0 m /a glyphshow
26.294922 0 m /l glyphshow
grestore

end
showpage
