%!PS-Adobe-3.0 EPSF-3.0
%%Title: figure_2_table_part_1.eps
%%Creator: Matplotlib v3.5.1, https://matplotlib.org/
%%CreationDate: Tue Jul 12 14:08:02 2022
%%Orientation: portrait
%%BoundingBox: 162 288 450 504
%%HiResBoundingBox: 162.000000 288.000000 450.000000 504.000000
%%EndComments
%%BeginProlog
/mpldict 11 dict def
mpldict begin
/_d { bind def } bind def
/m { moveto } _d
/l { lineto } _d
/r { rlineto } _d
/c { curveto } _d
/cl { closepath } _d
/ce { closepath eofill } _d
/box {
      m
      1 index 0 r
      0 exch r
      neg 0 r
      cl
    } _d
/clipbox {
      box
      clip
      newpath
    } _d
/sc { setcachedevice } _d
%!PS-Adobe-3.0 Resource-Font
%%Creator: Converted from TrueType to Type 3 by Matplotlib.
10 dict begin
/FontName /DejaVuSans def
/PaintType 0 def
/FontMatrix [0.00048828125 0 0 0.00048828125 0 0] def
/FontBBox [-2090 -948 3673 2524] def
/FontType 3 def
/Encoding [/space /parenleft /parenright /hyphen /period /zero /one /two /three /four /five /six /seven /eight /nine /A /E /M /P /R /S /c /d /e /h /i /l /m /n /o /r /s /t] def
/CharStrings 34 dict dup begin
/.notdef 0 def
/space{651 0 0 0 0 0 sc
ce} _d
/parenleft{799 0 176 -270 635 1554 sc
635 1554 m
546 1401 479 1249 436 1099 c
393 949 371 797 371 643 c
371 489 393 336 436 185 c
480 34 546 -117 635 -270 c
475 -270 l
375 -113 300 41 250 192 c
201 343 176 494 176 643 c
176 792 201 941 250 1092 c
299 1243 374 1397 475 1554 c
635 1554 l

ce} _d
/parenright{799 0 164 -270 623 1554 sc
164 1554 m
324 1554 l
424 1397 499 1243 548 1092 c
598 941 623 792 623 643 c
623 494 598 343 548 192 c
499 41 424 -113 324 -270 c
164 -270 l
253 -117 319 34 362 185 c
406 336 428 489 428 643 c
428 797 406 949 362 1099 c
319 1249 253 1401 164 1554 c

ce} _d
/hyphen{739 0 100 479 639 643 sc
100 643 m
639 643 l
639 479 l
100 479 l
100 643 l

ce} _d
/period{651 0 219 0 430 254 sc
219 254 m
430 254 l
430 0 l
219 0 l
219 254 l

ce} _d
/zero{1303 0 135 -29 1167 1520 sc
651 1360 m
547 1360 469 1309 416 1206 c
364 1104 338 950 338 745 c
338 540 364 387 416 284 c
469 182 547 131 651 131 c
756 131 834 182 886 284 c
939 387 965 540 965 745 c
965 950 939 1104 886 1206 c
834 1309 756 1360 651 1360 c

651 1520 m
818 1520 946 1454 1034 1321 c
1123 1189 1167 997 1167 745 c
1167 494 1123 302 1034 169 c
946 37 818 -29 651 -29 c
484 -29 356 37 267 169 c
179 302 135 494 135 745 c
135 997 179 1189 267 1321 c
356 1454 484 1520 651 1520 c

ce} _d
/one{1303 0 225 0 1114 1493 sc
254 170 m
584 170 l
584 1309 l
225 1237 l
225 1421 l
582 1493 l
784 1493 l
784 170 l
1114 170 l
1114 0 l
254 0 l
254 170 l

ce} _d
/two{1303 0 150 0 1098 1520 sc
393 170 m
1098 170 l
1098 0 l
150 0 l
150 170 l
227 249 331 356 463 489 c
596 623 679 709 713 748 c
778 821 823 882 848 932 c
874 983 887 1032 887 1081 c
887 1160 859 1225 803 1275 c
748 1325 675 1350 586 1350 c
523 1350 456 1339 385 1317 c
315 1295 240 1262 160 1217 c
160 1421 l
241 1454 317 1478 388 1495 c
459 1512 523 1520 582 1520 c
737 1520 860 1481 952 1404 c
1044 1327 1090 1223 1090 1094 c
1090 1033 1078 974 1055 919 c
1032 864 991 800 930 725 c
913 706 860 650 771 557 c
682 465 556 336 393 170 c

ce} _d
/three{1303 0 156 -29 1139 1520 sc
831 805 m
928 784 1003 741 1057 676 c
1112 611 1139 530 1139 434 c
1139 287 1088 173 987 92 c
886 11 742 -29 555 -29 c
492 -29 428 -23 361 -10 c
295 2 227 20 156 45 c
156 240 l
212 207 273 183 340 166 c
407 149 476 141 549 141 c
676 141 772 166 838 216 c
905 266 938 339 938 434 c
938 522 907 591 845 640 c
784 690 698 715 588 715 c
414 715 l
414 881 l
596 881 l
695 881 771 901 824 940 c
877 980 903 1037 903 1112 c
903 1189 876 1247 821 1288 c
767 1329 689 1350 588 1350 c
533 1350 473 1344 410 1332 c
347 1320 277 1301 201 1276 c
201 1456 l
278 1477 349 1493 416 1504 c
483 1515 547 1520 606 1520 c
759 1520 881 1485 970 1415 c
1059 1346 1104 1252 1104 1133 c
1104 1050 1080 980 1033 923 c
986 866 918 827 831 805 c

ce} _d
/four{1303 0 100 0 1188 1493 sc
774 1317 m
264 520 l
774 520 l
774 1317 l

721 1493 m
975 1493 l
975 520 l
1188 520 l
1188 352 l
975 352 l
975 0 l
774 0 l
774 352 l
100 352 l
100 547 l
721 1493 l

ce} _d
/five{1303 0 158 -29 1124 1493 sc
221 1493 m
1014 1493 l
1014 1323 l
406 1323 l
406 957 l
435 967 465 974 494 979 c
523 984 553 987 582 987 c
749 987 881 941 978 850 c
1075 759 1124 635 1124 479 c
1124 318 1074 193 974 104 c
874 15 733 -29 551 -29 c
488 -29 424 -24 359 -13 c
294 -2 227 14 158 35 c
158 238 l
218 205 280 181 344 165 c
408 149 476 141 547 141 c
662 141 754 171 821 232 c
888 293 922 375 922 479 c
922 583 888 665 821 726 c
754 787 662 817 547 817 c
493 817 439 811 385 799 c
332 787 277 768 221 743 c
221 1493 l

ce} _d
/six{1303 0 143 -29 1174 1520 sc
676 827 m
585 827 513 796 460 734 c
407 672 381 587 381 479 c
381 372 407 287 460 224 c
513 162 585 131 676 131 c
767 131 838 162 891 224 c
944 287 971 372 971 479 c
971 587 944 672 891 734 c
838 796 767 827 676 827 c

1077 1460 m
1077 1276 l
1026 1300 975 1318 923 1331 c
872 1344 821 1350 770 1350 c
637 1350 535 1305 464 1215 c
394 1125 354 989 344 807 c
383 865 433 909 492 940 c
551 971 617 987 688 987 c
838 987 956 941 1043 850 c
1130 759 1174 636 1174 479 c
1174 326 1129 203 1038 110 c
947 17 827 -29 676 -29 c
503 -29 371 37 280 169 c
189 302 143 494 143 745 c
143 981 199 1169 311 1309 c
423 1450 573 1520 762 1520 c
813 1520 864 1515 915 1505 c
967 1495 1021 1480 1077 1460 c

ce} _d
/seven{1303 0 168 0 1128 1493 sc
168 1493 m
1128 1493 l
1128 1407 l
586 0 l
375 0 l
885 1323 l
168 1323 l
168 1493 l

ce} _d
/eight{1303 0 139 -29 1163 1520 sc
651 709 m
555 709 479 683 424 632 c
369 581 342 510 342 420 c
342 330 369 259 424 208 c
479 157 555 131 651 131 c
747 131 823 157 878 208 c
933 260 961 331 961 420 c
961 510 933 581 878 632 c
823 683 748 709 651 709 c

449 795 m
362 816 295 857 246 916 c
198 975 174 1048 174 1133 c
174 1252 216 1347 301 1416 c
386 1485 503 1520 651 1520 c
800 1520 916 1485 1001 1416 c
1086 1347 1128 1252 1128 1133 c
1128 1048 1104 975 1055 916 c
1007 857 940 816 854 795 c
951 772 1027 728 1081 662 c
1136 596 1163 515 1163 420 c
1163 275 1119 164 1030 87 c
942 10 816 -29 651 -29 c
486 -29 360 10 271 87 c
183 164 139 275 139 420 c
139 515 166 596 221 662 c
276 728 352 772 449 795 c

375 1114 m
375 1037 399 976 447 933 c
496 890 564 868 651 868 c
738 868 805 890 854 933 c
903 976 928 1037 928 1114 c
928 1191 903 1252 854 1295 c
805 1338 738 1360 651 1360 c
564 1360 496 1338 447 1295 c
399 1252 375 1191 375 1114 c

ce} _d
/nine{1303 0 129 -29 1159 1520 sc
225 31 m
225 215 l
276 191 327 173 379 160 c
431 147 482 141 532 141 c
665 141 767 186 837 275 c
908 365 948 501 958 684 c
919 627 870 583 811 552 c
752 521 686 506 614 506 c
465 506 346 551 259 641 c
172 732 129 855 129 1012 c
129 1165 174 1288 265 1381 c
356 1474 476 1520 627 1520 c
800 1520 931 1454 1022 1321 c
1113 1189 1159 997 1159 745 c
1159 510 1103 322 991 181 c
880 41 730 -29 541 -29 c
490 -29 439 -24 387 -14 c
335 -4 281 11 225 31 c

627 664 m
718 664 789 695 842 757 c
895 819 922 904 922 1012 c
922 1119 895 1204 842 1266 c
789 1329 718 1360 627 1360 c
536 1360 464 1329 411 1266 c
358 1204 332 1119 332 1012 c
332 904 358 819 411 757 c
464 695 536 664 627 664 c

ce} _d
/A{1401 0 16 0 1384 1493 sc
700 1294 m
426 551 l
975 551 l
700 1294 l

586 1493 m
815 1493 l
1384 0 l
1174 0 l
1038 383 l
365 383 l
229 0 l
16 0 l
586 1493 l

ce} _d
/E{1294 0 201 0 1163 1493 sc
201 1493 m
1145 1493 l
1145 1323 l
403 1323 l
403 881 l
1114 881 l
1114 711 l
403 711 l
403 170 l
1163 170 l
1163 0 l
201 0 l
201 1493 l

ce} _d
/M{1767 0 201 0 1567 1493 sc
201 1493 m
502 1493 l
883 477 l
1266 1493 l
1567 1493 l
1567 0 l
1370 0 l
1370 1311 l
985 287 l
782 287 l
397 1311 l
397 0 l
201 0 l
201 1493 l

ce} _d
/P{1235 0 201 0 1165 1493 sc
403 1327 m
403 766 l
657 766 l
751 766 824 790 875 839 c
926 888 952 957 952 1047 c
952 1136 926 1205 875 1254 c
824 1303 751 1327 657 1327 c
403 1327 l

201 1493 m
657 1493 l
824 1493 951 1455 1036 1379 c
1122 1304 1165 1193 1165 1047 c
1165 900 1122 788 1036 713 c
951 638 824 600 657 600 c
403 600 l
403 0 l
201 0 l
201 1493 l

ce} _d
/R{1423 0 201 0 1364 1493 sc
909 700 m
952 685 994 654 1035 606 c
1076 558 1118 492 1159 408 c
1364 0 l
1147 0 l
956 383 l
907 483 859 549 812 582 c
766 615 703 631 623 631 c
403 631 l
403 0 l
201 0 l
201 1493 l
657 1493 l
828 1493 955 1457 1039 1386 c
1123 1315 1165 1207 1165 1063 c
1165 969 1143 891 1099 829 c
1056 767 992 724 909 700 c

403 1327 m
403 797 l
657 797 l
754 797 828 819 877 864 c
927 909 952 976 952 1063 c
952 1150 927 1216 877 1260 c
828 1305 754 1327 657 1327 c
403 1327 l

ce} _d
/S{1300 0 135 -29 1186 1520 sc
1096 1444 m
1096 1247 l
1019 1284 947 1311 879 1329 c
811 1347 745 1356 682 1356 c
572 1356 487 1335 427 1292 c
368 1249 338 1189 338 1110 c
338 1044 358 994 397 960 c
437 927 512 900 623 879 c
745 854 l
896 825 1007 775 1078 702 c
1150 630 1186 533 1186 412 c
1186 267 1137 158 1040 83 c
943 8 801 -29 614 -29 c
543 -29 468 -21 388 -5 c
309 11 226 35 141 66 c
141 274 l
223 228 303 193 382 170 c
461 147 538 135 614 135 c
729 135 818 158 881 203 c
944 248 975 313 975 397 c
975 470 952 528 907 569 c
862 610 789 641 686 662 c
563 686 l
412 716 303 763 236 827 c
169 891 135 980 135 1094 c
135 1226 181 1330 274 1406 c
367 1482 496 1520 659 1520 c
729 1520 800 1514 873 1501 c
946 1488 1020 1469 1096 1444 c

ce} _d
/c{1126 0 113 -29 999 1147 sc
999 1077 m
999 905 l
947 934 895 955 842 969 c
790 984 737 991 684 991 c
565 991 472 953 406 877 c
340 802 307 696 307 559 c
307 422 340 316 406 240 c
472 165 565 127 684 127 c
737 127 790 134 842 148 c
895 163 947 184 999 213 c
999 43 l
948 19 894 1 839 -11 c
784 -23 726 -29 664 -29 c
495 -29 361 24 262 130 c
163 236 113 379 113 559 c
113 742 163 885 263 990 c
364 1095 501 1147 676 1147 c
733 1147 788 1141 842 1129 c
896 1118 948 1100 999 1077 c

ce} _d
/d{1300 0 113 -29 1114 1556 sc
930 950 m
930 1556 l
1114 1556 l
1114 0 l
930 0 l
930 168 l
891 101 842 52 783 19 c
724 -13 654 -29 571 -29 c
436 -29 325 25 240 133 c
155 241 113 383 113 559 c
113 735 155 877 240 985 c
325 1093 436 1147 571 1147 c
654 1147 724 1131 783 1098 c
842 1066 891 1017 930 950 c

303 559 m
303 424 331 317 386 240 c
442 163 519 125 616 125 c
713 125 790 163 846 240 c
902 317 930 424 930 559 c
930 694 902 800 846 877 c
790 954 713 993 616 993 c
519 993 442 954 386 877 c
331 800 303 694 303 559 c

ce} _d
/e{1260 0 113 -29 1151 1147 sc
1151 606 m
1151 516 l
305 516 l
313 389 351 293 419 226 c
488 160 583 127 705 127 c
776 127 844 136 910 153 c
977 170 1043 196 1108 231 c
1108 57 l
1042 29 974 8 905 -7 c
836 -22 765 -29 694 -29 c
515 -29 374 23 269 127 c
165 231 113 372 113 549 c
113 732 162 878 261 985 c
360 1093 494 1147 662 1147 c
813 1147 932 1098 1019 1001 c
1107 904 1151 773 1151 606 c

967 660 m
966 761 937 841 882 901 c
827 961 755 991 664 991 c
561 991 479 962 417 904 c
356 846 320 764 311 659 c
967 660 l

ce} _d
/h{1298 0 186 0 1124 1556 sc
1124 676 m
1124 0 l
940 0 l
940 670 l
940 776 919 855 878 908 c
837 961 775 987 692 987 c
593 987 514 955 457 892 c
400 829 371 742 371 633 c
371 0 l
186 0 l
186 1556 l
371 1556 l
371 946 l
415 1013 467 1064 526 1097 c
586 1130 655 1147 733 1147 c
862 1147 959 1107 1025 1027 c
1091 948 1124 831 1124 676 c

ce} _d
/i{569 0 193 0 377 1556 sc
193 1120 m
377 1120 l
377 0 l
193 0 l
193 1120 l

193 1556 m
377 1556 l
377 1323 l
193 1323 l
193 1556 l

ce} _d
/l{569 0 193 0 377 1556 sc
193 1556 m
377 1556 l
377 0 l
193 0 l
193 1556 l

ce} _d
/m{1995 0 186 0 1821 1147 sc
1065 905 m
1111 988 1166 1049 1230 1088 c
1294 1127 1369 1147 1456 1147 c
1573 1147 1663 1106 1726 1024 c
1789 943 1821 827 1821 676 c
1821 0 l
1636 0 l
1636 670 l
1636 777 1617 857 1579 909 c
1541 961 1483 987 1405 987 c
1310 987 1234 955 1179 892 c
1124 829 1096 742 1096 633 c
1096 0 l
911 0 l
911 670 l
911 778 892 858 854 909 c
816 961 757 987 678 987 c
584 987 509 955 454 891 c
399 828 371 742 371 633 c
371 0 l
186 0 l
186 1120 l
371 1120 l
371 946 l
413 1015 463 1065 522 1098 c
581 1131 650 1147 731 1147 c
812 1147 881 1126 938 1085 c
995 1044 1038 984 1065 905 c

ce} _d
/n{1298 0 186 0 1124 1147 sc
1124 676 m
1124 0 l
940 0 l
940 670 l
940 776 919 855 878 908 c
837 961 775 987 692 987 c
593 987 514 955 457 892 c
400 829 371 742 371 633 c
371 0 l
186 0 l
186 1120 l
371 1120 l
371 946 l
415 1013 467 1064 526 1097 c
586 1130 655 1147 733 1147 c
862 1147 959 1107 1025 1027 c
1091 948 1124 831 1124 676 c

ce} _d
/o{1253 0 113 -29 1141 1147 sc
627 991 m
528 991 450 952 393 875 c
336 798 307 693 307 559 c
307 425 335 319 392 242 c
449 165 528 127 627 127 c
725 127 803 166 860 243 c
917 320 946 426 946 559 c
946 692 917 797 860 874 c
803 952 725 991 627 991 c

627 1147 m
787 1147 913 1095 1004 991 c
1095 887 1141 743 1141 559 c
1141 376 1095 232 1004 127 c
913 23 787 -29 627 -29 c
466 -29 340 23 249 127 c
158 232 113 376 113 559 c
113 743 158 887 249 991 c
340 1095 466 1147 627 1147 c

ce} _d
/r{842 0 186 0 842 1147 sc
842 948 m
821 960 799 969 774 974 c
750 980 723 983 694 983 c
590 983 510 949 454 881 c
399 814 371 717 371 590 c
371 0 l
186 0 l
186 1120 l
371 1120 l
371 946 l
410 1014 460 1064 522 1097 c
584 1130 659 1147 748 1147 c
761 1147 775 1146 790 1144 c
805 1143 822 1140 841 1137 c
842 948 l

ce} _d
/s{1067 0 111 -29 967 1147 sc
907 1087 m
907 913 l
855 940 801 960 745 973 c
689 986 631 993 571 993 c
480 993 411 979 365 951 c
320 923 297 881 297 825 c
297 782 313 749 346 724 c
379 700 444 677 543 655 c
606 641 l
737 613 829 573 884 522 c
939 471 967 400 967 309 c
967 205 926 123 843 62 c
761 1 648 -29 504 -29 c
444 -29 381 -23 316 -11 c
251 0 183 18 111 41 c
111 231 l
179 196 246 169 312 151 c
378 134 443 125 508 125 c
595 125 661 140 708 169 c
755 199 778 241 778 295 c
778 345 761 383 727 410 c
694 437 620 462 506 487 c
442 502 l
328 526 246 563 195 612 c
144 662 119 730 119 817 c
119 922 156 1004 231 1061 c
306 1118 412 1147 549 1147 c
617 1147 681 1142 741 1132 c
801 1122 856 1107 907 1087 c

ce} _d
/t{803 0 55 0 754 1438 sc
375 1438 m
375 1120 l
754 1120 l
754 977 l
375 977 l
375 369 l
375 278 387 219 412 193 c
437 167 488 154 565 154 c
754 154 l
754 0 l
565 0 l
423 0 325 26 271 79 c
217 132 190 229 190 369 c
190 977 l
55 977 l
55 1120 l
190 1120 l
190 1438 l
375 1438 l

ce} _d
end readonly def

/BuildGlyph {
 exch begin
 CharStrings exch
 2 copy known not {pop /.notdef} if
 true 3 1 roll get exec
 end
} _d

/BuildChar {
 1 index /Encoding get exch get
 1 index /BuildGlyph get exec
} _d

FontName currentdict end definefont pop
end
%%EndProlog
mpldict begin
162 288 translate
288 216 0 0 clipbox
1.000 setlinewidth
0 setlinejoin
0 setlinecap
[] 0 setdash
0.000 setgray
gsave
10.8 174.219048 m
64.08 174.219048 l
64.08 186.028571 l
10.8 186.028571 l
cl
gsave
1.000 setgray
fill
grestore
stroke
grestore
/DejaVuSans 11.000 selectfont
gsave

13.674375 177.084747 translate
0.000000 rotate
0.000000 0 m /P glyphshow
6.258301 0 m /e glyphshow
13.025879 0 m /r glyphshow
17.298340 0 m /c glyphshow
23.346191 0 m /e glyphshow
30.113770 0 m /n glyphshow
37.085449 0 m /t glyphshow
41.398438 0 m /i glyphshow
44.454590 0 m /l glyphshow
grestore
gsave
64.08 174.219048 m
117.36 174.219048 l
117.36 186.028571 l
64.08 186.028571 l
cl
gsave
1.000 setgray
fill
grestore
stroke
grestore
gsave

78.735625 177.084747 translate
0.000000 rotate
0.000000 0 m /M glyphshow
9.490723 0 m /A glyphshow
17.015625 0 m /E glyphshow
grestore
gsave
117.36 174.219048 m
170.64 174.219048 l
170.64 186.028571 l
117.36 186.028571 l
cl
gsave
1.000 setgray
fill
grestore
stroke
grestore
gsave

128.468750 177.084747 translate
0.000000 rotate
0.000000 0 m /R glyphshow
7.643066 0 m /M glyphshow
17.133789 0 m /S glyphshow
24.116211 0 m /E glyphshow
grestore
gsave
170.64 174.219048 m
223.92 174.219048 l
223.92 186.028571 l
170.64 186.028571 l
cl
gsave
1.000 setgray
fill
grestore
stroke
grestore
gsave

181.975313 177.084747 translate
0.000000 rotate
0.000000 0 m /M glyphshow
9.490723 0 m /A glyphshow
17.015625 0 m /P glyphshow
23.648926 0 m /E glyphshow
grestore
gsave
223.92 174.219048 m
277.2 174.219048 l
277.2 186.028571 l
223.92 186.028571 l
cl
gsave
1.000 setgray
fill
grestore
stroke
grestore
gsave

243.239688 177.084747 translate
0.000000 rotate
0.000000 0 m /R glyphshow
7.643066 0 m /two glyphshow
grestore
gsave
10.8 162.409524 m
64.08 162.409524 l
64.08 174.219048 l
10.8 174.219048 l
cl
gsave
1.000 setgray
fill
grestore
stroke
grestore
gsave

41.252000 165.275223 translate
0.000000 rotate
0.000000 0 m /zero glyphshow
6.998535 0 m /period glyphshow
10.495117 0 m /zero glyphshow
grestore
gsave
64.08 162.409524 m
117.36 162.409524 l
117.36 174.219048 l
64.08 174.219048 l
cl
gsave
1.000 setgray
fill
grestore
stroke
grestore
gsave

94.532000 165.275223 translate
0.000000 rotate
0.000000 0 m /one glyphshow
6.998535 0 m /period glyphshow
10.495117 0 m /zero glyphshow
grestore
gsave
117.36 162.409524 m
170.64 162.409524 l
170.64 174.219048 l
117.36 174.219048 l
cl
gsave
1.000 setgray
fill
grestore
stroke
grestore
gsave

147.812000 165.275223 translate
0.000000 rotate
0.000000 0 m /one glyphshow
6.998535 0 m /period glyphshow
10.495117 0 m /zero glyphshow
grestore
gsave
170.64 162.409524 m
223.92 162.409524 l
223.92 174.219048 l
170.64 174.219048 l
cl
gsave
1.000 setgray
fill
grestore
stroke
grestore
gsave

194.092000 165.275223 translate
0.000000 rotate
0.000000 0 m /zero glyphshow
6.998535 0 m /period glyphshow
10.495117 0 m /four glyphshow
17.493652 0 m /seven glyphshow
grestore
gsave
223.92 162.409524 m
277.2 162.409524 l
277.2 174.219048 l
223.92 174.219048 l
cl
gsave
1.000 setgray
fill
grestore
stroke
grestore
gsave

243.403250 165.275223 translate
0.000000 rotate
0.000000 0 m /hyphen glyphshow
3.969238 0 m /zero glyphshow
10.967773 0 m /period glyphshow
14.464355 0 m /zero glyphshow
21.462891 0 m /six glyphshow
grestore
gsave
10.8 150.6 m
64.08 150.6 l
64.08 162.409524 l
10.8 162.409524 l
cl
gsave
1.000 setgray
fill
grestore
stroke
grestore
gsave

34.252000 153.465699 translate
0.000000 rotate
0.000000 0 m /two glyphshow
6.998535 0 m /five glyphshow
13.997070 0 m /period glyphshow
17.493652 0 m /zero glyphshow
grestore
gsave
64.08 150.6 m
117.36 150.6 l
117.36 162.409524 l
64.08 162.409524 l
cl
gsave
1.000 setgray
fill
grestore
stroke
grestore
gsave

94.532000 153.465699 translate
0.000000 rotate
0.000000 0 m /one glyphshow
6.998535 0 m /period glyphshow
10.495117 0 m /zero glyphshow
grestore
gsave
117.36 150.6 m
170.64 150.6 l
170.64 162.409524 l
117.36 162.409524 l
cl
gsave
1.000 setgray
fill
grestore
stroke
grestore
gsave

147.812000 153.465699 translate
0.000000 rotate
0.000000 0 m /two glyphshow
6.998535 0 m /period glyphshow
10.495117 0 m /zero glyphshow
grestore
gsave
170.64 150.6 m
223.92 150.6 l
223.92 162.409524 l
170.64 162.409524 l
cl
gsave
1.000 setgray
fill
grestore
stroke
grestore
gsave

194.092000 153.465699 translate
0.000000 rotate
0.000000 0 m /zero glyphshow
6.998535 0 m /period glyphshow
10.495117 0 m /six glyphshow
17.493652 0 m /four glyphshow
grestore
gsave
223.92 150.6 m
277.2 150.6 l
277.2 162.409524 l
223.92 162.409524 l
cl
gsave
1.000 setgray
fill
grestore
stroke
grestore
gsave

247.372000 153.465699 translate
0.000000 rotate
0.000000 0 m /zero glyphshow
6.998535 0 m /period glyphshow
10.495117 0 m /two glyphshow
17.493652 0 m /four glyphshow
grestore
gsave
10.8 138.790476 m
64.08 138.790476 l
64.08 150.6 l
10.8 150.6 l
cl
gsave
1.000 setgray
fill
grestore
stroke
grestore
gsave

34.252000 141.656176 translate
0.000000 rotate
0.000000 0 m /five glyphshow
6.998535 0 m /zero glyphshow
13.997070 0 m /period glyphshow
17.493652 0 m /zero glyphshow
grestore
gsave
64.08 138.790476 m
117.36 138.790476 l
117.36 150.6 l
64.08 150.6 l
cl
gsave
1.000 setgray
fill
grestore
stroke
grestore
gsave

94.532000 141.656176 translate
0.000000 rotate
0.000000 0 m /three glyphshow
6.998535 0 m /period glyphshow
10.495117 0 m /zero glyphshow
grestore
gsave
117.36 138.790476 m
170.64 138.790476 l
170.64 150.6 l
117.36 150.6 l
cl
gsave
1.000 setgray
fill
grestore
stroke
grestore
gsave

147.812000 141.656176 translate
0.000000 rotate
0.000000 0 m /six glyphshow
6.998535 0 m /period glyphshow
10.495117 0 m /zero glyphshow
grestore
gsave
170.64 138.790476 m
223.92 138.790476 l
223.92 150.6 l
170.64 150.6 l
cl
gsave
1.000 setgray
fill
grestore
stroke
grestore
gsave

194.092000 141.656176 translate
0.000000 rotate
0.000000 0 m /zero glyphshow
6.998535 0 m /period glyphshow
10.495117 0 m /seven glyphshow
17.493652 0 m /two glyphshow
grestore
gsave
223.92 138.790476 m
277.2 138.790476 l
277.2 150.6 l
223.92 150.6 l
cl
gsave
1.000 setgray
fill
grestore
stroke
grestore
gsave

247.372000 141.656176 translate
0.000000 rotate
0.000000 0 m /zero glyphshow
6.998535 0 m /period glyphshow
10.495117 0 m /four glyphshow
17.493652 0 m /nine glyphshow
grestore
gsave
10.8 126.980952 m
64.08 126.980952 l
64.08 138.790476 l
10.8 138.790476 l
cl
gsave
1.000 setgray
fill
grestore
stroke
grestore
gsave

34.252000 129.846652 translate
0.000000 rotate
0.000000 0 m /seven glyphshow
6.998535 0 m /five glyphshow
13.997070 0 m /period glyphshow
17.493652 0 m /zero glyphshow
grestore
gsave
64.08 126.980952 m
117.36 126.980952 l
117.36 138.790476 l
64.08 138.790476 l
cl
gsave
1.000 setgray
fill
grestore
stroke
grestore
gsave

94.532000 129.846652 translate
0.000000 rotate
0.000000 0 m /five glyphshow
6.998535 0 m /period glyphshow
10.495117 0 m /zero glyphshow
grestore
gsave
117.36 126.980952 m
170.64 126.980952 l
170.64 138.790476 l
117.36 138.790476 l
cl
gsave
1.000 setgray
fill
grestore
stroke
grestore
gsave

140.812000 129.846652 translate
0.000000 rotate
0.000000 0 m /one glyphshow
6.998535 0 m /nine glyphshow
13.997070 0 m /period glyphshow
17.493652 0 m /zero glyphshow
grestore
gsave
170.64 126.980952 m
223.92 126.980952 l
223.92 138.790476 l
170.64 138.790476 l
cl
gsave
1.000 setgray
fill
grestore
stroke
grestore
gsave

194.092000 129.846652 translate
0.000000 rotate
0.000000 0 m /one glyphshow
6.998535 0 m /period glyphshow
10.495117 0 m /one glyphshow
17.493652 0 m /four glyphshow
grestore
gsave
223.92 126.980952 m
277.2 126.980952 l
277.2 138.790476 l
223.92 138.790476 l
cl
gsave
1.000 setgray
fill
grestore
stroke
grestore
gsave

247.372000 129.846652 translate
0.000000 rotate
0.000000 0 m /zero glyphshow
6.998535 0 m /period glyphshow
10.495117 0 m /six glyphshow
17.493652 0 m /two glyphshow
grestore
gsave
10.8 115.171429 m
64.08 115.171429 l
64.08 126.980952 l
10.8 126.980952 l
cl
gsave
1.000 setgray
fill
grestore
stroke
grestore
gsave

27.252000 118.037128 translate
0.000000 rotate
0.000000 0 m /one glyphshow
6.998535 0 m /zero glyphshow
13.997070 0 m /zero glyphshow
20.995605 0 m /period glyphshow
24.492188 0 m /zero glyphshow
grestore
gsave
64.08 115.171429 m
117.36 115.171429 l
117.36 126.980952 l
64.08 126.980952 l
cl
gsave
1.000 setgray
fill
grestore
stroke
grestore
gsave

87.532000 118.037128 translate
0.000000 rotate
0.000000 0 m /one glyphshow
6.998535 0 m /one glyphshow
13.997070 0 m /period glyphshow
17.493652 0 m /zero glyphshow
grestore
gsave
117.36 115.171429 m
170.64 115.171429 l
170.64 126.980952 l
117.36 126.980952 l
cl
gsave
1.000 setgray
fill
grestore
stroke
grestore
gsave

140.812000 118.037128 translate
0.000000 rotate
0.000000 0 m /four glyphshow
6.998535 0 m /three glyphshow
13.997070 0 m /period glyphshow
17.493652 0 m /zero glyphshow
grestore
gsave
170.64 115.171429 m
223.92 115.171429 l
223.92 126.980952 l
170.64 126.980952 l
cl
gsave
1.000 setgray
fill
grestore
stroke
grestore
gsave

194.092000 118.037128 translate
0.000000 rotate
0.000000 0 m /one glyphshow
6.998535 0 m /period glyphshow
10.495117 0 m /five glyphshow
17.493652 0 m /six glyphshow
grestore
gsave
223.92 115.171429 m
277.2 115.171429 l
277.2 126.980952 l
223.92 126.980952 l
cl
gsave
1.000 setgray
fill
grestore
stroke
grestore
gsave

247.372000 118.037128 translate
0.000000 rotate
0.000000 0 m /zero glyphshow
6.998535 0 m /period glyphshow
10.495117 0 m /six glyphshow
17.493652 0 m /seven glyphshow
grestore
/DejaVuSans 15.000 selectfont
gsave

81.742188 193.800000 translate
0.000000 rotate
0.000000 0 m /M glyphshow
12.941895 0 m /o glyphshow
22.119141 0 m /d glyphshow
31.640625 0 m /e glyphshow
40.869141 0 m /l glyphshow
45.036621 0 m /space glyphshow
49.804688 0 m /parenleft glyphshow
55.656738 0 m /one glyphshow
65.200195 0 m /space glyphshow
69.968262 0 m /m glyphshow
84.580078 0 m /o glyphshow
93.757324 0 m /n glyphshow
103.264160 0 m /t glyphshow
109.145508 0 m /h glyphshow
118.652344 0 m /parenright glyphshow
grestore
gsave
10.8 71.619048 m
64.08 71.619048 l
64.08 83.428571 l
10.8 83.428571 l
cl
gsave
1.000 setgray
fill
grestore
stroke
grestore
/DejaVuSans 11.000 selectfont
gsave

13.674375 74.484747 translate
0.000000 rotate
0.000000 0 m /P glyphshow
6.258301 0 m /e glyphshow
13.025879 0 m /r glyphshow
17.298340 0 m /c glyphshow
23.346191 0 m /e glyphshow
30.113770 0 m /n glyphshow
37.085449 0 m /t glyphshow
41.398438 0 m /i glyphshow
44.454590 0 m /l glyphshow
grestore
gsave
64.08 71.619048 m
117.36 71.619048 l
117.36 83.428571 l
64.08 83.428571 l
cl
gsave
1.000 setgray
fill
grestore
stroke
grestore
gsave

78.735625 74.484747 translate
0.000000 rotate
0.000000 0 m /M glyphshow
9.490723 0 m /A glyphshow
17.015625 0 m /E glyphshow
grestore
gsave
117.36 71.619048 m
170.64 71.619048 l
170.64 83.428571 l
117.36 83.428571 l
cl
gsave
1.000 setgray
fill
grestore
stroke
grestore
gsave

128.468750 74.484747 translate
0.000000 rotate
0.000000 0 m /R glyphshow
7.643066 0 m /M glyphshow
17.133789 0 m /S glyphshow
24.116211 0 m /E glyphshow
grestore
gsave
170.64 71.619048 m
223.92 71.619048 l
223.92 83.428571 l
170.64 83.428571 l
cl
gsave
1.000 setgray
fill
grestore
stroke
grestore
gsave

181.975313 74.484747 translate
0.000000 rotate
0.000000 0 m /M glyphshow
9.490723 0 m /A glyphshow
17.015625 0 m /P glyphshow
23.648926 0 m /E glyphshow
grestore
gsave
223.92 71.619048 m
277.2 71.619048 l
277.2 83.428571 l
223.92 83.428571 l
cl
gsave
1.000 setgray
fill
grestore
stroke
grestore
gsave

243.239688 74.484747 translate
0.000000 rotate
0.000000 0 m /R glyphshow
7.643066 0 m /two glyphshow
grestore
gsave
10.8 59.809524 m
64.08 59.809524 l
64.08 71.619048 l
10.8 71.619048 l
cl
gsave
1.000 setgray
fill
grestore
stroke
grestore
gsave

41.252000 62.675223 translate
0.000000 rotate
0.000000 0 m /zero glyphshow
6.998535 0 m /period glyphshow
10.495117 0 m /zero glyphshow
grestore
gsave
64.08 59.809524 m
117.36 59.809524 l
117.36 71.619048 l
64.08 71.619048 l
cl
gsave
1.000 setgray
fill
grestore
stroke
grestore
gsave

94.532000 62.675223 translate
0.000000 rotate
0.000000 0 m /one glyphshow
6.998535 0 m /period glyphshow
10.495117 0 m /zero glyphshow
grestore
gsave
117.36 59.809524 m
170.64 59.809524 l
170.64 71.619048 l
117.36 71.619048 l
cl
gsave
1.000 setgray
fill
grestore
stroke
grestore
gsave

147.812000 62.675223 translate
0.000000 rotate
0.000000 0 m /two glyphshow
6.998535 0 m /period glyphshow
10.495117 0 m /zero glyphshow
grestore
gsave
170.64 59.809524 m
223.92 59.809524 l
223.92 71.619048 l
170.64 71.619048 l
cl
gsave
1.000 setgray
fill
grestore
stroke
grestore
gsave

194.092000 62.675223 translate
0.000000 rotate
0.000000 0 m /zero glyphshow
6.998535 0 m /period glyphshow
10.495117 0 m /four glyphshow
17.493652 0 m /four glyphshow
grestore
gsave
223.92 59.809524 m
277.2 59.809524 l
277.2 71.619048 l
223.92 71.619048 l
cl
gsave
1.000 setgray
fill
grestore
stroke
grestore
gsave

243.403250 62.675223 translate
0.000000 rotate
0.000000 0 m /hyphen glyphshow
3.969238 0 m /three glyphshow
10.967773 0 m /period glyphshow
14.464355 0 m /nine glyphshow
21.462891 0 m /eight glyphshow
grestore
gsave
10.8 48 m
64.08 48 l
64.08 59.809524 l
10.8 59.809524 l
cl
gsave
1.000 setgray
fill
grestore
stroke
grestore
gsave

34.252000 50.865699 translate
0.000000 rotate
0.000000 0 m /two glyphshow
6.998535 0 m /five glyphshow
13.997070 0 m /period glyphshow
17.493652 0 m /zero glyphshow
grestore
gsave
64.08 48 m
117.36 48 l
117.36 59.809524 l
64.08 59.809524 l
cl
gsave
1.000 setgray
fill
grestore
stroke
grestore
gsave

94.532000 50.865699 translate
0.000000 rotate
0.000000 0 m /two glyphshow
6.998535 0 m /period glyphshow
10.495117 0 m /zero glyphshow
grestore
gsave
117.36 48 m
170.64 48 l
170.64 59.809524 l
117.36 59.809524 l
cl
gsave
1.000 setgray
fill
grestore
stroke
grestore
gsave

147.812000 50.865699 translate
0.000000 rotate
0.000000 0 m /three glyphshow
6.998535 0 m /period glyphshow
10.495117 0 m /zero glyphshow
grestore
gsave
170.64 48 m
223.92 48 l
223.92 59.809524 l
170.64 59.809524 l
cl
gsave
1.000 setgray
fill
grestore
stroke
grestore
gsave

194.092000 50.865699 translate
0.000000 rotate
0.000000 0 m /zero glyphshow
6.998535 0 m /period glyphshow
10.495117 0 m /six glyphshow
17.493652 0 m /two glyphshow
grestore
gsave
223.92 48 m
277.2 48 l
277.2 59.809524 l
223.92 59.809524 l
cl
gsave
1.000 setgray
fill
grestore
stroke
grestore
gsave

243.403250 50.865699 translate
0.000000 rotate
0.000000 0 m /hyphen glyphshow
3.969238 0 m /zero glyphshow
10.967773 0 m /period glyphshow
14.464355 0 m /zero glyphshow
21.462891 0 m /seven glyphshow
grestore
gsave
10.8 36.190476 m
64.08 36.190476 l
64.08 48 l
10.8 48 l
cl
gsave
1.000 setgray
fill
grestore
stroke
grestore
gsave

34.252000 39.056176 translate
0.000000 rotate
0.000000 0 m /five glyphshow
6.998535 0 m /zero glyphshow
13.997070 0 m /period glyphshow
17.493652 0 m /zero glyphshow
grestore
gsave
64.08 36.190476 m
117.36 36.190476 l
117.36 48 l
64.08 48 l
cl
gsave
1.000 setgray
fill
grestore
stroke
grestore
gsave

94.532000 39.056176 translate
0.000000 rotate
0.000000 0 m /four glyphshow
6.998535 0 m /period glyphshow
10.495117 0 m /zero glyphshow
grestore
gsave
117.36 36.190476 m
170.64 36.190476 l
170.64 48 l
117.36 48 l
cl
gsave
1.000 setgray
fill
grestore
stroke
grestore
gsave

140.812000 39.056176 translate
0.000000 rotate
0.000000 0 m /one glyphshow
6.998535 0 m /four glyphshow
13.997070 0 m /period glyphshow
17.493652 0 m /zero glyphshow
grestore
gsave
170.64 36.190476 m
223.92 36.190476 l
223.92 48 l
170.64 48 l
cl
gsave
1.000 setgray
fill
grestore
stroke
grestore
gsave

194.092000 39.056176 translate
0.000000 rotate
0.000000 0 m /one glyphshow
6.998535 0 m /period glyphshow
10.495117 0 m /two glyphshow
17.493652 0 m /six glyphshow
grestore
gsave
223.92 36.190476 m
277.2 36.190476 l
277.2 48 l
223.92 48 l
cl
gsave
1.000 setgray
fill
grestore
stroke
grestore
gsave

247.372000 39.056176 translate
0.000000 rotate
0.000000 0 m /zero glyphshow
6.998535 0 m /period glyphshow
10.495117 0 m /two glyphshow
17.493652 0 m /four glyphshow
grestore
gsave
10.8 24.380952 m
64.08 24.380952 l
64.08 36.190476 l
10.8 36.190476 l
cl
gsave
1.000 setgray
fill
grestore
stroke
grestore
gsave

34.252000 27.246652 translate
0.000000 rotate
0.000000 0 m /seven glyphshow
6.998535 0 m /five glyphshow
13.997070 0 m /period glyphshow
17.493652 0 m /zero glyphshow
grestore
gsave
64.08 24.380952 m
117.36 24.380952 l
117.36 36.190476 l
64.08 36.190476 l
cl
gsave
1.000 setgray
fill
grestore
stroke
grestore
gsave

87.532000 27.246652 translate
0.000000 rotate
0.000000 0 m /one glyphshow
6.998535 0 m /two glyphshow
13.997070 0 m /period glyphshow
17.493652 0 m /zero glyphshow
grestore
gsave
117.36 24.380952 m
170.64 24.380952 l
170.64 36.190476 l
117.36 36.190476 l
cl
gsave
1.000 setgray
fill
grestore
stroke
grestore
gsave

140.812000 27.246652 translate
0.000000 rotate
0.000000 0 m /three glyphshow
6.998535 0 m /two glyphshow
13.997070 0 m /period glyphshow
17.493652 0 m /zero glyphshow
grestore
gsave
170.64 24.380952 m
223.92 24.380952 l
223.92 36.190476 l
170.64 36.190476 l
cl
gsave
1.000 setgray
fill
grestore
stroke
grestore
gsave

194.092000 27.246652 translate
0.000000 rotate
0.000000 0 m /three glyphshow
6.998535 0 m /period glyphshow
10.495117 0 m /two glyphshow
17.493652 0 m /six glyphshow
grestore
gsave
223.92 24.380952 m
277.2 24.380952 l
277.2 36.190476 l
223.92 36.190476 l
cl
gsave
1.000 setgray
fill
grestore
stroke
grestore
gsave

247.372000 27.246652 translate
0.000000 rotate
0.000000 0 m /zero glyphshow
6.998535 0 m /period glyphshow
10.495117 0 m /four glyphshow
17.493652 0 m /four glyphshow
grestore
gsave
10.8 12.571429 m
64.08 12.571429 l
64.08 24.380952 l
10.8 24.380952 l
cl
gsave
1.000 setgray
fill
grestore
stroke
grestore
gsave

27.252000 15.437128 translate
0.000000 rotate
0.000000 0 m /one glyphshow
6.998535 0 m /zero glyphshow
13.997070 0 m /zero glyphshow
20.995605 0 m /period glyphshow
24.492188 0 m /zero glyphshow
grestore
gsave
64.08 12.571429 m
117.36 12.571429 l
117.36 24.380952 l
64.08 24.380952 l
cl
gsave
1.000 setgray
fill
grestore
stroke
grestore
gsave

87.532000 15.437128 translate
0.000000 rotate
0.000000 0 m /one glyphshow
6.998535 0 m /seven glyphshow
13.997070 0 m /period glyphshow
17.493652 0 m /zero glyphshow
grestore
gsave
117.36 12.571429 m
170.64 12.571429 l
170.64 24.380952 l
117.36 24.380952 l
cl
gsave
1.000 setgray
fill
grestore
stroke
grestore
gsave

140.812000 15.437128 translate
0.000000 rotate
0.000000 0 m /six glyphshow
6.998535 0 m /zero glyphshow
13.997070 0 m /period glyphshow
17.493652 0 m /zero glyphshow
grestore
gsave
170.64 12.571429 m
223.92 12.571429 l
223.92 24.380952 l
170.64 24.380952 l
cl
gsave
1.000 setgray
fill
grestore
stroke
grestore
gsave

194.092000 15.437128 translate
0.000000 rotate
0.000000 0 m /three glyphshow
6.998535 0 m /period glyphshow
10.495117 0 m /six glyphshow
17.493652 0 m /three glyphshow
grestore
gsave
223.92 12.571429 m
277.2 12.571429 l
277.2 24.380952 l
223.92 24.380952 l
cl
gsave
1.000 setgray
fill
grestore
stroke
grestore
gsave

247.372000 15.437128 translate
0.000000 rotate
0.000000 0 m /zero glyphshow
6.998535 0 m /period glyphshow
10.495117 0 m /five glyphshow
17.493652 0 m /six glyphshow
grestore
/DejaVuSans 15.000 selectfont
gsave

77.835938 91.200000 translate
0.000000 rotate
0.000000 0 m /M glyphshow
12.941895 0 m /o glyphshow
22.119141 0 m /d glyphshow
31.640625 0 m /e glyphshow
40.869141 0 m /l glyphshow
45.036621 0 m /space glyphshow
49.804688 0 m /parenleft glyphshow
55.656738 0 m /three glyphshow
65.200195 0 m /space glyphshow
69.968262 0 m /m glyphshow
84.580078 0 m /o glyphshow
93.757324 0 m /n glyphshow
103.264160 0 m /t glyphshow
109.145508 0 m /h glyphshow
118.652344 0 m /s glyphshow
126.467285 0 m /parenright glyphshow
grestore

end
showpage
