{
  "project_info": {
    "project_number": "995005550588",
    "project_id": "bikesp-8e327",
    "storage_bucket": "bikesp-8e327.appspot.com"
  },
  "client": [
    {
      "client_info": {
        "mobilesdk_app_id": "1:995005550588:android:dd1f2bda1e6b462d17ac79",
        "android_client_info": {
          "package_name": "com.bikesp"
        }
      },
      "oauth_client": [],
      "api_key": [
        {
          "current_key": "AIzaSyDvrC-SCDI0H2SFv57XrINVejCrHrFOZtg"
        }
      ],
      "services": {
        "appinvite_service": {
          "other_platform_oauth_client": []
        }
      }
    }
  ],
  "configuration_version": "1"
}