wip

10 jobs for pipenv in 12 minutes and 33 seconds (queued for 3 seconds)
latest
Status Job ID Name Coverage
  Test
passed #130421806
check

00:06:11

passed #130421821
dataset

00:06:42

failed #130422782
image_test

00:02:37

failed #130423730
integration

00:05:55

failed #130423803
test

00:06:02

failed #130423817
test_mysql

00:06:18

failed #130421836
image_test

00:02:38

failed #130421815
integration

00:05:52

failed #130421801
test

00:06:10

failed #130421803
test_mysql

00:06:14

 
Name Stage Failure
failed
image_test Test
  File "/usr/lib/python3.6/re.py", line 229, in finditer
return _compile(pattern, flags).finditer(string)
TypeError: expected string or bytes-like object
The command '/bin/sh -c VIRTUAL_ENV=/pyenv/ PIPENV_QUIET=1 PIPENV_COLORBLIND=1 pipenv sync' returned a non-zero code: 1
Command exited with non-zero status 1
real 1m 20.40s
user 0m 1.04s
sys 0m 0.53s
ERROR: Job failed: exit code 1
failed
test_mysql Test
  /builds/failmap/failmap/failmap/settings.py:693: DeprecationWarning: invalid escape sequence \s
'RESPONSIBLE_ORGANIZATION_PROMO_TEXT': ('', 'Some text promoting this organization and it\s mission. This text will'

-- Docs: https://docs.pytest.org/en/latest/warnings.html
!!!!!!!!!!!!!!!!!!! Interrupted: 1 errors during collection !!!!!!!!!!!!!!!!!!!!
===================== 1 warnings, 1 error in 2.47 seconds ======================
Makefile:22: recipe for target 'test' failed
make: *** [test] Error 2
ERROR: Job failed: exit code 1
failed
test Test
  /builds/failmap/failmap/failmap/settings.py:693: DeprecationWarning: invalid escape sequence \s
'RESPONSIBLE_ORGANIZATION_PROMO_TEXT': ('', 'Some text promoting this organization and it\s mission. This text will'

-- Docs: https://docs.pytest.org/en/latest/warnings.html
!!!!!!!!!!!!!!!!!!! Interrupted: 1 errors during collection !!!!!!!!!!!!!!!!!!!!
===================== 1 warnings, 1 error in 1.74 seconds ======================
Makefile:22: recipe for target 'test' failed
make: *** [test] Error 2
ERROR: Job failed: exit code 1
failed
integration Test
To activate this project's virtualenv, run pipenv shell.
Alternatively, run a command inside the virtualenv with pipenv run.
All dependencies are now up-to-date!
touch /.installed
nc localhost:redisport || exit 1
/bin/sh: 1: nc: not found
Makefile:40: recipe for target 'test_integration' failed
make: *** [test_integration] Error 1
ERROR: Job failed: exit code 1