Adjust gitlab CI config for make

12 jobs for pipenv in 4 minutes and 6 seconds (queued for 1 second)
Status Job ID Name Coverage
  Test
failed #126811802
check

00:01:20

failed #126811772
dataset

00:02:46

failed #126813458
image_test

00:02:33

failed #126812298
integration

00:01:25

failed #126812332
test

00:01:34

failed #126812333
test_mysql

00:01:35

failed #126810842
check

00:01:15

failed #126810846
dataset

00:01:13

failed #126810847
image_test

00:02:45

failed #126810844
integration

00:01:30

failed #126810838
test

00:01:32

failed #126810840
test_mysql

00:01:32

 
Name Stage Failure
failed
image_test Test
Removing intermediate container 899a6cfa22ef
---> 390bccda48fc
Step 5/47 : COPY requirements.txt /source/
COPY failed: stat /var/lib/docker/tmp/docker-builder660226653/requirements.txt: no such file or directory
Command exited with non-zero status 1
real 1m 0.40s
user 0m 1.09s
sys 0m 0.65s
ERROR: Job failed: exit code 1
failed
dataset Test
Downloading cache.zip from https://storage.googleapis.com/gitlab-com-runners-cache/project/4968474/dataset 
Successfully extracted cache
$ make test_datasets
Running in virtualenv:
pipenv sync --dev
make: pipenv: Command not found
Makefile:50: recipe for target '/.installed' failed
make: *** [/.installed] Error 127
ERROR: Job failed: exit code 1
failed
test_mysql Test
Downloading cache.zip from https://storage.googleapis.com/gitlab-com-runners-cache/project/4968474/test_mysql 
Successfully extracted cache
$ make test
Running in virtualenv:
pipenv sync --dev
make: pipenv: Command not found
Makefile:50: recipe for target '/.installed' failed
make: *** [/.installed] Error 127
ERROR: Job failed: exit code 1
failed
check Test
Downloading cache.zip from https://storage.googleapis.com/gitlab-com-runners-cache/project/4968474/check 
Successfully extracted cache
$ make check
Running in virtualenv:
pipenv sync --dev
make: pipenv: Command not found
Makefile:50: recipe for target '/.installed' failed
make: *** [/.installed] Error 127
ERROR: Job failed: exit code 1
failed
test Test
Downloading cache.zip from https://storage.googleapis.com/gitlab-com-runners-cache/project/4968474/test 
Successfully extracted cache
$ make test
Running in virtualenv:
pipenv sync --dev
make: pipenv: Command not found
Makefile:50: recipe for target '/.installed' failed
make: *** [/.installed] Error 127
ERROR: Job failed: exit code 1
failed
integration Test
Downloading cache.zip from https://storage.googleapis.com/gitlab-com-runners-cache/project/4968474/integration 
Successfully extracted cache
$ make test_integration
Running in virtualenv:
pipenv sync --dev
make: pipenv: Command not found
Makefile:50: recipe for target '/.installed' failed
make: *** [/.installed] Error 127
ERROR: Job failed: exit code 1