add metrics to mail scan, not dashboard_mail

9 jobs for bugfixes in 24 minutes and 59 seconds
Status Name Job ID Coverage
  Test
passed dataset #1829365500

00:03:37

passed image_test #1829365503

00:24:58

passed integration #1829365498

00:03:25

failed test #1829379619

00:03:15

failed test_mysql #1829384023

00:04:48

failed test_postgres #1829380942

00:04:04

failed test #1829365491

00:03:25

failed test_mysql #1829365494

00:04:07

failed test_postgres #1829365497

00:03:45

 
Name Stage Failure
failed
test Test
-- Docs: https://docs.pytest.org/en/stable/warnings.html
=========================== short test summary info ============================
FAILED websecmap/map/tests/test_openstreetmap.py::test_openstreetmaps - asser...
FAILED websecmap/scanners/tests/test_internet_nl_v2.py::test_internet_nl_logging
FAILED websecmap/scanners/tests/test_internet_nl_v2.py::test_internet_nl_store_testresults
========== 3 failed, 59 passed, 10 deselected, 91 warnings in 34.88s ===========
make: *** [Makefile:73: .make.test] Error 1
Cleaning up project directory and file based variables
ERROR: Job failed: exit code 1

failed
test_postgres Test
-- Docs: https://docs.pytest.org/en/stable/warnings.html
=========================== short test summary info ============================
FAILED websecmap/map/tests/test_openstreetmap.py::test_openstreetmaps - asser...
FAILED websecmap/scanners/tests/test_internet_nl_v2.py::test_internet_nl_logging
FAILED websecmap/scanners/tests/test_internet_nl_v2.py::test_internet_nl_store_testresults
========== 3 failed, 59 passed, 10 deselected, 93 warnings in 45.73s ===========
make: *** [Makefile:73: .make.test] Error 1
Cleaning up project directory and file based variables
ERROR: Job failed: exit code 1

failed
test_mysql Test
-- Docs: https://docs.pytest.org/en/stable/warnings.html
=========================== short test summary info ============================
FAILED websecmap/map/tests/test_openstreetmap.py::test_openstreetmaps - asser...
FAILED websecmap/scanners/tests/test_internet_nl_v2.py::test_internet_nl_logging
FAILED websecmap/scanners/tests/test_internet_nl_v2.py::test_internet_nl_store_testresults
===== 3 failed, 59 passed, 10 deselected, 93 warnings in 61.44s (0:01:01) ======
make: *** [Makefile:73: .make.test] Error 1
Cleaning up project directory and file based variables
ERROR: Job failed: exit code 1