<svg width="67" height="77" viewBox="0 0 67 77" fill="none" xmlns="http://www.w3.org/2000/svg">
<path d="M47.1903 48.0819L33.2114 62.3468L19.2326 48.0819C8.75573 48.5454 0.388916 57.2928 0.388916 68.0887V69.5242C0.388916 73.4867 3.53929 76.7015 7.42231 76.7015H59.0005C62.8836 76.7015 66.0339 73.4867 66.0339 69.5242V68.0887C66.0339 57.2928 57.6671 48.5454 47.1903 48.0819ZM2.38171 12.0755L3.3195 12.2998V21.0322C2.29379 21.6602 1.56115 22.7518 1.56115 24.0676C1.56115 25.3237 2.23518 26.3704 3.18762 27.0133L0.901768 36.3289C0.652668 37.3607 1.20948 38.4223 2.01539 38.4223H8.1403C8.94621 38.4223 9.50302 37.3607 9.25392 36.3289L6.96807 27.0133C7.92051 26.3704 8.59454 25.3237 8.59454 24.0676C8.59454 22.7518 7.8619 21.6602 6.83619 21.0322V13.167L16.5071 15.5445C15.247 18.1164 14.4557 20.9874 14.4557 24.0676C14.4557 34.6393 22.8518 43.2072 33.2114 43.2072C43.571 43.2072 51.9671 34.6393 51.9671 24.0676C51.9671 20.9874 51.1905 18.1164 49.9157 15.5445L64.0265 12.0755C66.6933 11.4176 66.6933 8.02327 64.0265 7.36535L36.1274 0.487057C34.2225 0.02352 32.215 0.02352 30.3102 0.487057L2.38171 7.3504C-0.270465 8.00832 -0.270465 11.4176 2.38171 12.0755Z" fill="#0B2E88"/>
</svg>
