<svg width="8" height="12" viewBox="0 0 8 12" fill="none" xmlns="http://www.w3.org/2000/svg">
<path d="M0.760742 1.87865L1.93931 0.700073L6.85085 5.61079L7.41312 6.20007L6.85167 6.78936L1.94095 11.7001L0.762379 10.5215L5.08544 6.20007L0.760742 1.87865Z" fill="#403A93"/>
</svg>
