<svg width="55" height="61" viewBox="0 0 55 61" fill="none" xmlns="http://www.w3.org/2000/svg">
<path fill-rule="evenodd" clip-rule="evenodd" d="M48.5166 60.0786H6.5166C3.2076 60.0786 0.516602 57.3876 0.516602 54.0786V12.0786C0.516602 8.76961 3.2076 6.07861 6.5166 6.07861H12.5166V0.0786133H18.5166V6.07861H36.5166V0.0786133H42.5166V6.07861H48.5166C51.8256 6.07861 54.5166 8.76961 54.5166 12.0786V54.0786C54.5166 57.3876 51.8256 60.0786 48.5166 60.0786ZM48.5196 54.0786L48.5166 18.0786H6.5166V54.0786H48.5196ZM18.5165 27.0786H12.5165V33.0786H18.5165V27.0786ZM18.5165 39.0786H12.5165V45.0786H18.5165V39.0786ZM30.5165 27.0786H24.5165V33.0786H30.5165V27.0786ZM30.5165 39.0786H24.5165V45.0786H30.5165V39.0786ZM42.5165 27.0786H36.5165V33.0786H42.5165V27.0786ZM42.5165 39.0786H36.5165V45.0786H42.5165V39.0786Z" fill="#265084"/>
</svg>
