<svg width="22" height="22" viewBox="0 0 22 22" fill="none" xmlns="http://www.w3.org/2000/svg">
<path fill-rule="evenodd" clip-rule="evenodd" d="M0.958008 9.21164C0.958008 13.7596 4.62211 17.4233 9.17065 17.4233C11.216 17.4233 13.0826 16.6825 14.5175 15.4535L20.0646 21L20.9579 20.1068L15.411 14.5605C16.6414 13.1254 17.3833 11.2581 17.3833 9.21164C17.3833 4.66366 13.7192 1 9.17065 1C4.62211 1 0.958008 4.66366 0.958008 9.21164ZM2.22149 9.21164C2.22149 5.35849 5.31703 2.26333 9.17065 2.26333C13.0243 2.26333 16.1198 5.35849 16.1198 9.21164C16.1198 13.0648 13.0243 16.16 9.17065 16.16C5.31703 16.16 2.22149 13.0648 2.22149 9.21164Z" fill="#1CCDE6"/>
<path d="M14.5175 15.4535L14.7826 15.1883L14.5372 14.9429L14.2736 15.1687L14.5175 15.4535ZM20.0646 21L19.7995 21.2652L20.0646 21.5303L20.3298 21.2652L20.0646 21ZM20.9579 20.1068L21.2231 20.372L21.4883 20.1068L21.2231 19.8416L20.9579 20.1068ZM15.411 14.5605L15.1263 14.3165L14.9002 14.5801L15.1458 14.8257L15.411 14.5605ZM9.17065 17.0483C4.82917 17.0483 1.33301 13.5525 1.33301 9.21164H0.583008C0.583008 13.9668 4.41505 17.7983 9.17065 17.7983V17.0483ZM14.2736 15.1687C12.9044 16.3413 11.1237 17.0483 9.17065 17.0483V17.7983C11.3083 17.7983 13.2607 17.0236 14.7614 15.7383L14.2736 15.1687ZM20.3298 20.7348L14.7826 15.1883L14.2523 15.7187L19.7995 21.2652L20.3298 20.7348ZM20.6928 19.8416L19.7995 20.7348L20.3298 21.2652L21.2231 20.372L20.6928 19.8416ZM15.1458 14.8257L20.6928 20.372L21.2231 19.8416L15.6761 14.2954L15.1458 14.8257ZM17.0083 9.21164C17.0083 11.1657 16.3004 12.9471 15.1263 14.3165L15.6957 14.8046C16.9825 13.3037 17.7583 11.3504 17.7583 9.21164H17.0083ZM9.17065 1.375C13.5121 1.375 17.0083 4.87081 17.0083 9.21164H17.7583C17.7583 4.45651 13.9263 0.625 9.17065 0.625V1.375ZM1.33301 9.21164C1.33301 4.87081 4.82917 1.375 9.17065 1.375V0.625C4.41505 0.625 0.583008 4.45651 0.583008 9.21164H1.33301ZM9.17065 1.88833C5.10996 1.88833 1.84649 5.15134 1.84649 9.21164H2.59649C2.59649 5.56564 5.52409 2.63833 9.17065 2.63833V1.88833ZM16.4948 9.21164C16.4948 5.15134 13.2313 1.88833 9.17065 1.88833V2.63833C12.8172 2.63833 15.7448 5.56564 15.7448 9.21164H16.4948ZM9.17065 16.535C13.2313 16.535 16.4948 13.2719 16.4948 9.21164H15.7448C15.7448 12.8576 12.8172 15.785 9.17065 15.785V16.535ZM1.84649 9.21164C1.84649 13.2719 5.10996 16.535 9.17065 16.535V15.785C5.52409 15.785 2.59649 12.8576 2.59649 9.21164H1.84649Z" fill="#1CCDE6"/>
</svg>
