<svg width="27" height="19" viewBox="0 0 27 19" fill="none" xmlns="http://www.w3.org/2000/svg">
<path d="M25.613 3.34027C25.4688 2.80517 25.187 2.31717 24.7955 1.92485C24.4041 1.53253 23.9167 1.24957 23.382 1.10413C21.3991 0.559654 13.4662 0.550791 13.4662 0.550791C13.4662 0.550791 5.53458 0.541927 3.55042 1.06234C3.01598 1.21448 2.52962 1.50144 2.13803 1.89569C1.74644 2.28993 1.46278 2.77822 1.31427 3.31368C0.791322 5.29658 0.786257 9.40927 0.786257 9.40927C0.786257 9.40927 0.781192 13.5422 1.30034 15.5048C1.59157 16.59 2.44627 17.4472 3.53269 17.7397C5.53585 18.2842 13.4472 18.2931 13.4472 18.2931C13.4472 18.2931 21.3801 18.3019 23.363 17.7828C23.8979 17.6376 24.3857 17.3553 24.7782 16.9638C25.1706 16.5722 25.454 16.0851 25.6004 15.5504C26.1246 13.5688 26.1284 9.45738 26.1284 9.45738C26.1284 9.45738 26.1537 5.32317 25.613 3.34027ZM10.9287 13.2193L10.935 5.622L17.5282 9.42699L10.9287 13.2193Z" fill="#C7C7D3"/>
</svg>
