<svg width="8" height="5" viewBox="0 0 8 5" fill="none" xmlns="http://www.w3.org/2000/svg">
<path d="M7.14286 0.0800781L8 0.937221L4.42857 4.50925L4 4.91817L3.57143 4.50984L4.39318e-07 0.938411L0.857142 0.0812682L4 3.22532L7.14286 0.0800781Z" fill="#4C4B5C"/>
</svg>
