<svg width="60" height="60" viewBox="0 0 60 60" fill="none" xmlns="http://www.w3.org/2000/svg">
<circle cx="30" cy="30" r="30" fill="#FDBA30"/>
<rect x="14" y="20" width="32" height="3" rx="1.5" fill="black"/>
<rect x="14" y="28" width="32" height="3" rx="1.5" fill="black"/>
<rect x="14" y="36" width="32" height="3" rx="1.5" fill="black"/>
</svg>
