<svg width="32" height="19" viewBox="0 0 32 19" fill="none" xmlns="http://www.w3.org/2000/svg">
<rect width="32" height="3" rx="1.5" fill="black"/>
<rect y="8" width="32" height="3" rx="1.5" fill="black"/>
<rect y="16" width="32" height="3" rx="1.5" fill="black"/>
</svg>
