{
  "compilerOptions": {
    "baseUrl": "https://remaxdesignperu.com/system/patrones",
    "paths": {
      "~/*": ["./*"],
      "@/*": ["./*"],
      "~~/*": ["./*"],
      "@@/*": ["./*"]
		}
  },
  "exclude": ["node_modules", ".nuxt", "dist"]
}
