{
	"id": "",
	"tag": "p",
	"texto": "",
	"estilo": {
		"left": "0px",
		"top": "0px",
		"width": "100px",
		"height": "24px",
		"backgroundColor": "transparent",
		"color": "black",
		"padding": "0px",
		"fontSize": "16px",
		"lineHeight": 1
	}
}
