label,stamp,example_index,num_people,p0_x,p0_y,p0_theta,p1_x,p1_y,p1_theta,p2_x,p2_y,p2_theta,p3_x,p3_y,p3_theta,p4_x,p4_y,p4_theta,p5_x,p5_y,p5_theta
gt,1275403288.27212,9,3,3.049999952316284,4.630000114440918,3.7780001163482666,2.200000047683716,4.289999961853027,0.48899999260902405,2.379999876022339,5.060000419616699,4.953999996185303,,,,,,,,,
gt,1275404118.306806,155,3,2.5999999046325684,3.4700000286102295,0.14399999380111694,4.46999979019165,3.8299999237060547,3.0799999237060547,4.519999980926514,3.1700000762939453,3.0759999752044678,,,,,,,,,
