label,stamp,example_index,num_people,p0_x,p0_y,p0_theta,p1_x,p1_y,p1_theta,p2_x,p2_y,p2_theta,p3_x,p3_y,p3_theta,p4_x,p4_y,p4_theta,p5_x,p5_y,p5_theta
opt,1275403283.267134,3,4,2.7664166443634493,3.690510113339495,1.2731019478599281,2.190000057220459,4.309999942779541,0.47999998927116394,2.390000104904175,5.069999694824219,4.920000076293945,3.5799999237060547,3.869999885559082,2.5940001010894775,,,,,,
opt,1275403293.277107,13,4,3.1966557869938037,15.546164229770234,-1.0933166200548359,3.0900001525878906,4.660000324249268,3.2739999294281006,2.380000114440918,5.0400004386901855,4.520999908447266,1.8700001239776611,5.390000343322754,4.119999885559082,,,,,,
opt,1275403298.282257,20,4,1.4563032902123862,2.348972022470624,1.4209556915826382,3.240000009536743,3.619999885559082,1.6299999952316284,3.0899999141693115,4.62999963760376,3.5769999027252197,2.6700000762939453,5.139999866485596,4.6020002365112305,,,,,,
opt,1275403313.29727,30,4,1.4759758432323378,4.242392643649149,0.6306688186465766,2.2300000190734863,4.309999942779541,0.8410000205039978,2.4000000953674316,5.159999847412109,4.366000175476074,1.7700001001358032,4.940000057220459,5.76200008392334,,,,,,
opt,1275403378.296034,100,4,2.4978102102330277,2.4200423455336573,1.2598295038109895,1.4600000381469727,3.6700000762939453,0.7080000042915344,2.0799999237060547,5.090000152587891,4.480000019073486,1.590000033378601,4.5,6.2129998207092285,,,,,,
opt,1275404058.31315,123,4,2.4399933836788517,3.5558699185438902,-0.7885154991758045,3.1000001430511475,1.8600000143051147,0.8709999918937683,3.120000123977661,3.319999933242798,5.997000217437744,2.6500000953674316,2.359999895095825,-0.18700000643730164,,,,,,
opt,1275404828.353874,217,4,1.5312677233116143,3.9300016987645887,0.9273156792999355,2.259999990463257,4.110000133514404,2.2929999828338623,1.5,4.679999828338623,5.656000137329102,2.0299999713897705,4.909999847412109,4.2820000648498535,,,,,,
opt,1275404833.292233,224,4,2.713187597767174,3.6419132411316624,2.2990168284246417,1.6899999380111694,3.5999999046325684,1.2089999914169312,1.5099999904632568,4.699999809265137,5.690000057220459,2.129999876022339,5.049999713897705,4.776000022888184,,,,,,
opt,1275404843.302277,235,4,1.6216971189099825,3.36474983608884,1.2506907614779947,2.1700000762939453,3.9100000858306885,2.296999931335449,1.4800000190734863,4.639999866485596,5.692999839782715,1.9800000190734863,4.949999809265137,4.564000129699707,,,,,,
opt,1275404868.327419,268,4,2.261669476208786,3.414455474190395,2.198425775784624,1.600000023841858,3.7899997234344482,1.6330000162124634,2.1100001335144043,4.159999847412109,2.5460000038146973,1.4100000858306885,4.75,-0.4300000071525574,,,,,,
