label,stamp,example_index,num_people,p0_x,p0_y,p0_theta,p1_x,p1_y,p1_theta,p2_x,p2_y,p2_theta,p3_x,p3_y,p3_theta,p4_x,p4_y,p4_theta,p5_x,p5_y,p5_theta
fake,1275403308.292247,27,5,2.4200000762939453,5.180000305175781,7.487592848139354,3.109999895095825,3.640000104904175,1.5759999752044678,2.190000057220459,4.309999942779541,0.531000018119812,3.069999933242798,4.559999942779541,3.2119998931884766,1.7899999618530273,5.0,5.830999851226807,,,
fake,1275403338.322534,53,5,3.2799999713897705,3.7200000286102295,5.6815926154428205,2.4000000953674316,4.019999980926514,1.1799999475479126,2.8299999237060547,4.78000020980835,3.694999933242798,2.4700000286102295,5.090000152587891,5.084000110626221,1.6800000667572021,4.460000038146973,6.590000152587891,,,
