label,stamp,example_index,num_people,p0_x,p0_y,p0_theta,p1_x,p1_y,p1_theta,p2_x,p2_y,p2_theta,p3_x,p3_y,p3_theta,p4_x,p4_y,p4_theta,p5_x,p5_y,p5_theta
gt,1275403358.275902,76,6,2.81000018119812,4.869999885559082,3.7300000190734863,3.2699999809265137,3.7900002002716064,2.5810000896453857,2.240000009536743,3.5500001907348633,1.1269999742507935,1.4800000190734863,3.640000104904175,0.8149999976158142,2.070000171661377,5.110000133514404,4.682000160217285,1.690000057220459,4.360000133514404,6.482999801635742
gt,1275403383.301042,104,6,2.240000009536743,3.5200002193450928,1.4609999656677246,3.1600000858306885,3.81000018119812,3.121999979019165,1.590000033378601,3.870000123977661,1.0,2.820000171661377,4.510000228881836,4.046999931335449,2.049999952316284,5.12000036239624,4.566999912261963,1.4800000190734863,4.650000095367432,5.7779998779296875
