{
  "schemaVersion": 1,
  "id"           : "megane-applied-energistics-2",
  "version"      : "${version}",
  "authors"      : ["deirn"],
  "license"      : "MIT",
  "icon"         : "assets/megane/icon.png",
  "mixins"       : ["megane-applied-energistics-2.mixins.json"],
  "depends"      : {
    "megane-base": "*"
  },
  "custom"       : {
    "megane:modules": [
      {
        "deps": ["appliedenergistics2"],
        "init": "badasintended.megane.impl.AppliedEnergistics2"
      }
    ],
    "modmenu"       : {
      "parent": "megane"
    }
  }
}
