{
  "required"          : true,
  "minVersion"        : "0.8",
  "package"           : "badasintended.cpas.mixin",
  "compatibilityLevel": "JAVA_8",
  "priority"          : 999,
  "mixins"            : [],
  "client"            : [
    "AccessorHandledScreen",
    "MixinConfigObjectImpl",
    "MixinHandledScreen",
    "MixinMouse"
  ],
  "injectors"         : {
    "defaultRequire": 1
  }
}
