[
{"keyword": "Feature", "name": "Retrive all sprint of a organization", "tags": [], "location": "features/sprint.feature:1", "status": "failed", "elements": [{"type": "scenario", "keyword": "Scenario", "name": "get all sprint", "tags": [], "location": "features/sprint.feature:3", "steps": [{"keyword": "Given", "step_type": "given", "name": "a organization with sprint", "location": "features/sprint.feature:4", "match": {"location": "features/steps/sprint.py:9", "arguments": []}, "result": {"status": "passed", "duration": 5.817413330078125e-05}}, {"keyword": "When", "step_type": "when", "name": "i request a sprint", "location": "features/sprint.feature:5", "match": {"location": "features/steps/sprint.py:18", "arguments": []}, "result": {"status": "passed", "duration": 0.00011515617370605469}}, {"keyword": "Then", "step_type": "then", "name": "i save a list of sprints  on data base", "location": "features/sprint.feature:6", "match": {"location": "features/steps/sprint.py:24", "arguments": []}, "result": {"status": "failed", "duration": 5.776412010192871, "error_message": ["Traceback (most recent call last):", "  File \"/home/lucas/repositorios/jira_sro_etl/jira_sro_etl/sprint.py\", line 43, in do", "    sprints[project.key] += sprint_apl.find_by_board(board.id)", "  File \"/home/lucas/repositorios/env/lib/python3.8/site-packages/jiraX/sprint.py\", line 29, in find_by_board", "    return self.jira.sprints(board_id)", "  File \"/home/lucas/repositorios/env/lib/python3.8/site-packages/jira/client.py\", line 114, in wrapper", "    result = func(*arg_list, **kwargs)", "  File \"/home/lucas/repositorios/env/lib/python3.8/site-packages/jira/client.py\", line 4023, in sprints", "    return self._fetch_pages(", "  File \"/home/lucas/repositorios/env/lib/python3.8/site-packages/jira/client.py\", line 640, in _fetch_pages", "    resource = self._get_json(request_path, params=page_params, base=base)", "  File \"/home/lucas/repositorios/env/lib/python3.8/site-packages/jira/client.py\", line 3129, in _get_json", "    r = self._session.get(url, params=params)", "  File \"/home/lucas/repositorios/env/lib/python3.8/site-packages/jira/resilientsession.py\", line 173, in get", "    return self.__verb(\"GET\", url, **kwargs)", "  File \"/home/lucas/repositorios/env/lib/python3.8/site-packages/jira/resilientsession.py\", line 144, in __verb", "    response = method(url, timeout=self.timeout, **kwargs)", "  File \"/home/lucas/repositorios/env/lib/python3.8/site-packages/requests/sessions.py\", line 543, in get", "    return self.request('GET', url, **kwargs)", "  File \"/home/lucas/repositorios/env/lib/python3.8/site-packages/requests/sessions.py\", line 530, in request", "    resp = self.send(prep, **send_kwargs)", "  File \"/home/lucas/repositorios/env/lib/python3.8/site-packages/requests/sessions.py\", line 643, in send", "    r = adapter.send(request, **kwargs)", "  File \"/home/lucas/repositorios/env/lib/python3.8/site-packages/requests/adapters.py\", line 439, in send", "    resp = conn.urlopen(", "  File \"/home/lucas/repositorios/env/lib/python3.8/site-packages/urllib3/connectionpool.py\", line 670, in urlopen", "    httplib_response = self._make_request(", "  File \"/home/lucas/repositorios/env/lib/python3.8/site-packages/urllib3/connectionpool.py\", line 426, in _make_request", "    six.raise_from(e, None)", "  File \"<string>\", line 3, in raise_from", "  File \"/home/lucas/repositorios/env/lib/python3.8/site-packages/urllib3/connectionpool.py\", line 421, in _make_request", "    httplib_response = conn.getresponse()", "  File \"/usr/lib/python3.8/http/client.py\", line 1332, in getresponse", "    response.begin()", "  File \"/usr/lib/python3.8/http/client.py\", line 303, in begin", "    version, status, reason = self._read_status()", "  File \"/usr/lib/python3.8/http/client.py\", line 264, in _read_status", "    line = str(self.fp.readline(_MAXLINE + 1), \"iso-8859-1\")", "  File \"/usr/lib/python3.8/socket.py\", line 669, in readinto", "    return self._sock.recv_into(b)", "  File \"/usr/lib/python3.8/ssl.py\", line 1241, in recv_into", "    return self.read(nbytes, buffer)", "  File \"/usr/lib/python3.8/ssl.py\", line 1099, in read", "    return self._sslobj.read(len, buffer)", "KeyboardInterrupt", "", "During handling of the above exception, another exception occurred:", "", "Traceback (most recent call last):", "  File \"/home/lucas/repositorios/env/lib/python3.8/site-packages/behave/model.py\", line 1329, in run", "    match.run(runner.context)", "  File \"/home/lucas/repositorios/env/lib/python3.8/site-packages/behave/matchers.py\", line 98, in run", "    self.func(context, *args, **kwargs)", "  File \"features/steps/sprint.py\", line 26, in step_impl", "    sprint.do(data)", "  File \"/home/lucas/repositorios/jira_sro_etl/jira_sro_etl/sprint.py\", line 74, in do", "    except e:", "UnboundLocalError: local variable 'e' referenced before assignment", "", "Captured logging:", "INFO:root:Sprint", "INFO:root:Start function: find_all", "INFO:root:Start function: find_by_project", "INFO:root:Start function: find_by_board", "INFO:root:Start function: find_by_project", "INFO:root:Start function: find_by_board", "INFO:root:Start function: find_by_project", "INFO:root:Start function: find_by_board", "INFO:root:Start function: find_by_project", "INFO:root:Start function: find_by_board", "INFO:root:Start function: find_by_project", "INFO:root:Start function: find_by_board", "INFO:root:Start function: find_by_project", "INFO:root:Start function: find_by_board"]}}], "status": "failed"}, {"type": "scenario", "keyword": "Scenario", "name": "fail get all sprint", "tags": [], "location": "features/sprint.feature:9", "steps": [{"keyword": "Given", "step_type": "given", "name": "a false organization_sprint", "location": "features/sprint.feature:10", "match": {"location": "features/steps/sprint.py:29", "arguments": []}, "result": {"status": "passed", "duration": 0.00010371208190917969}}, {"keyword": "When", "step_type": "when", "name": "i request a false sprint", "location": "features/sprint.feature:11", "match": {"location": "features/steps/sprint.py:42", "arguments": []}, "result": {"status": "passed", "duration": 0.0003063678741455078}}, {"keyword": "Then", "step_type": "then", "name": "i fail in save a list of sprints on data base", "location": "features/sprint.feature:12", "match": {"location": "features/steps/sprint.py:48", "arguments": []}, "result": {"status": "passed", "duration": 0.000270843505859375}}], "status": "passed"}]}
]
