7
Propyne
  C         -8.12801        1.15241        0.00000
  C         -6.66865        1.15241       -0.00000
  H         -8.50893        0.86267        0.98377
  H         -8.50893        0.44531       -0.74280
  H         -8.50893        2.14924       -0.24097
  C         -5.46914        1.15241       -0.00000
  H         -4.40518        1.15241       -0.00000