%YAML 1.1
%TAG !u! tag:unity3d.com,2011:
--- !u!114 &11400000
MonoBehaviour:
  m_ObjectHideFlags: 0
  m_CorrespondingSourceObject: {fileID: 0}
  m_PrefabInternal: {fileID: 0}
  m_GameObject: {fileID: 0}
  m_Enabled: 1
  m_EditorHideFlags: 0
  m_Script: {fileID: 11500000, guid: 0e99b1f67dca9064fb3bfe3b68bf5616, type: 3}
  m_Name: Playback Palette
  m_EditorClassIdentifier: 
  BackgroundColorDark: {r: 0.14901961, g: 0.14901961, b: 0.14901961, a: 1}
  BackgroundColorLight: {r: 1, g: 1, b: 1, a: 1}
  DarkPrimaryColor: {r: 0.14117648, g: 0.07450981, b: 0.2901961, a: 1}
  DarkSecondaryColor: {r: 0.7019608, g: 0.44313726, b: 0, a: 1}
  DividerColor: {r: 0.741, g: 0.741, b: 0.741, a: 1}
  LightPrimaryColor: {r: 0.4862745, g: 0.3372549, b: 0.827451, a: 1}
  LightSecondaryColor: {r: 1, g: 0.7411765, b: 0.3019608, a: 1}
  PrimaryColor: {r: 0.6745098, g: 0.06666667, b: 0, a: 1}
  PrimaryTextColor: {r: 1, g: 1, b: 1, a: 1}
  SecondaryColor: {r: 0, g: 0.69575506, b: 0.9150943, a: 1}
  SecondaryTextColor: {r: 0.458, g: 0.458, b: 0.458, a: 1}
