%YAML 1.1
%TAG !u! tag:unity3d.com,2011:
--- !u!1045 &1
EditorBuildSettings:
  m_ObjectHideFlags: 0
  serializedVersion: 2
  m_Scenes:
  - enabled: 1
    path: Assets/Narupa.VR/Scenes/NarupaVR.unity
    guid: 51a4bb6e114a4a74193ec30d94e74fb6
  m_configObjects: {}
