%YAML 1.1
%TAG !u! tag:unity3d.com,2011:
--- !u!1 &8351017974155460076
GameObject:
  m_ObjectHideFlags: 0
  m_CorrespondingSourceObject: {fileID: 0}
  m_PrefabInstance: {fileID: 0}
  m_PrefabAsset: {fileID: 0}
  serializedVersion: 6
  m_Component:
  - component: {fileID: 1060773542299304799}
  - component: {fileID: 6856390651414668505}
  m_Layer: 0
  m_Name: GameObject
  m_TagString: Untagged
  m_Icon: {fileID: 0}
  m_NavMeshLayer: 0
  m_StaticEditorFlags: 0
  m_IsActive: 1
--- !u!224 &1060773542299304799
RectTransform:
  m_ObjectHideFlags: 0
  m_CorrespondingSourceObject: {fileID: 0}
  m_PrefabInstance: {fileID: 0}
  m_PrefabAsset: {fileID: 0}
  m_GameObject: {fileID: 8351017974155460076}
  m_LocalRotation: {x: -0, y: -0, z: -0, w: 1}
  m_LocalPosition: {x: 0, y: 0, z: 0}
  m_LocalScale: {x: 1, y: 1, z: 1}
  m_Children:
  - {fileID: 3409454978577183808}
  - {fileID: 4154513587008866836}
  m_Father: {fileID: 1691903542784734893}
  m_RootOrder: 0
  m_LocalEulerAnglesHint: {x: 0, y: 0, z: 0}
  m_AnchorMin: {x: 0.5, y: 0.5}
  m_AnchorMax: {x: 0.5, y: 0.5}
  m_AnchoredPosition: {x: 0, y: 66}
  m_SizeDelta: {x: 512, y: 100}
  m_Pivot: {x: 0.5, y: 0.5}
--- !u!114 &6856390651414668505
MonoBehaviour:
  m_ObjectHideFlags: 0
  m_CorrespondingSourceObject: {fileID: 0}
  m_PrefabInstance: {fileID: 0}
  m_PrefabAsset: {fileID: 0}
  m_GameObject: {fileID: 8351017974155460076}
  m_Enabled: 1
  m_EditorHideFlags: 0
  m_Script: {fileID: 11500000, guid: 30649d3a9faa99c48a7b1166b86bf2a0, type: 3}
  m_Name: 
  m_EditorClassIdentifier: 
  m_Padding:
    m_Left: 0
    m_Right: 0
    m_Top: 0
    m_Bottom: 0
  m_ChildAlignment: 4
  m_Spacing: 80
  m_ChildForceExpandWidth: 0
  m_ChildForceExpandHeight: 0
  m_ChildControlWidth: 0
  m_ChildControlHeight: 0
  m_ChildScaleWidth: 0
  m_ChildScaleHeight: 0
--- !u!1001 &387694811153346067
PrefabInstance:
  m_ObjectHideFlags: 0
  serializedVersion: 2
  m_Modification:
    m_TransformParent: {fileID: 1691903542784734893}
    m_Modifications:
    - target: {fileID: 2995849000346883717, guid: 035816e598fb6c741a93868e818b71da,
        type: 3}
      propertyPath: m_LocalPosition.x
      value: 0
      objectReference: {fileID: 0}
    - target: {fileID: 2995849000346883717, guid: 035816e598fb6c741a93868e818b71da,
        type: 3}
      propertyPath: m_LocalPosition.y
      value: 0
      objectReference: {fileID: 0}
    - target: {fileID: 2995849000346883717, guid: 035816e598fb6c741a93868e818b71da,
        type: 3}
      propertyPath: m_LocalPosition.z
      value: 0
      objectReference: {fileID: 0}
    - target: {fileID: 2995849000346883717, guid: 035816e598fb6c741a93868e818b71da,
        type: 3}
      propertyPath: m_LocalRotation.x
      value: 0
      objectReference: {fileID: 0}
    - target: {fileID: 2995849000346883717, guid: 035816e598fb6c741a93868e818b71da,
        type: 3}
      propertyPath: m_LocalRotation.y
      value: 0
      objectReference: {fileID: 0}
    - target: {fileID: 2995849000346883717, guid: 035816e598fb6c741a93868e818b71da,
        type: 3}
      propertyPath: m_LocalRotation.z
      value: 0
      objectReference: {fileID: 0}
    - target: {fileID: 2995849000346883717, guid: 035816e598fb6c741a93868e818b71da,
        type: 3}
      propertyPath: m_LocalRotation.w
      value: 1
      objectReference: {fileID: 0}
    - target: {fileID: 2995849000346883717, guid: 035816e598fb6c741a93868e818b71da,
        type: 3}
      propertyPath: m_RootOrder
      value: 1
      objectReference: {fileID: 0}
    - target: {fileID: 2995849000346883717, guid: 035816e598fb6c741a93868e818b71da,
        type: 3}
      propertyPath: m_LocalEulerAnglesHint.x
      value: 0
      objectReference: {fileID: 0}
    - target: {fileID: 2995849000346883717, guid: 035816e598fb6c741a93868e818b71da,
        type: 3}
      propertyPath: m_LocalEulerAnglesHint.y
      value: 0
      objectReference: {fileID: 0}
    - target: {fileID: 2995849000346883717, guid: 035816e598fb6c741a93868e818b71da,
        type: 3}
      propertyPath: m_LocalEulerAnglesHint.z
      value: 0
      objectReference: {fileID: 0}
    - target: {fileID: 2995849000346883717, guid: 035816e598fb6c741a93868e818b71da,
        type: 3}
      propertyPath: m_AnchoredPosition.x
      value: 0
      objectReference: {fileID: 0}
    - target: {fileID: 2995849000346883717, guid: 035816e598fb6c741a93868e818b71da,
        type: 3}
      propertyPath: m_AnchoredPosition.y
      value: -74.92
      objectReference: {fileID: 0}
    - target: {fileID: 2995849000346883717, guid: 035816e598fb6c741a93868e818b71da,
        type: 3}
      propertyPath: m_SizeDelta.x
      value: 270
      objectReference: {fileID: 0}
    - target: {fileID: 2995849000346883717, guid: 035816e598fb6c741a93868e818b71da,
        type: 3}
      propertyPath: m_SizeDelta.y
      value: 80
      objectReference: {fileID: 0}
    - target: {fileID: 2995849000346883717, guid: 035816e598fb6c741a93868e818b71da,
        type: 3}
      propertyPath: m_AnchorMin.x
      value: 0.5
      objectReference: {fileID: 0}
    - target: {fileID: 2995849000346883717, guid: 035816e598fb6c741a93868e818b71da,
        type: 3}
      propertyPath: m_AnchorMin.y
      value: 0.5
      objectReference: {fileID: 0}
    - target: {fileID: 2995849000346883717, guid: 035816e598fb6c741a93868e818b71da,
        type: 3}
      propertyPath: m_AnchorMax.x
      value: 0.5
      objectReference: {fileID: 0}
    - target: {fileID: 2995849000346883717, guid: 035816e598fb6c741a93868e818b71da,
        type: 3}
      propertyPath: m_AnchorMax.y
      value: 0.5
      objectReference: {fileID: 0}
    - target: {fileID: 2995849000346883717, guid: 035816e598fb6c741a93868e818b71da,
        type: 3}
      propertyPath: m_Pivot.x
      value: 0.5
      objectReference: {fileID: 0}
    - target: {fileID: 2995849000346883717, guid: 035816e598fb6c741a93868e818b71da,
        type: 3}
      propertyPath: m_Pivot.y
      value: 0.5
      objectReference: {fileID: 0}
    - target: {fileID: 3698763748470933409, guid: 035816e598fb6c741a93868e818b71da,
        type: 3}
      propertyPath: m_textInfo.characterCount
      value: 6
      objectReference: {fileID: 0}
    - target: {fileID: 3698763748470933409, guid: 035816e598fb6c741a93868e818b71da,
        type: 3}
      propertyPath: m_textInfo.wordCount
      value: 1
      objectReference: {fileID: 0}
    - target: {fileID: 3698763748470933409, guid: 035816e598fb6c741a93868e818b71da,
        type: 3}
      propertyPath: m_textInfo.lineCount
      value: 1
      objectReference: {fileID: 0}
    - target: {fileID: 3698763748470933409, guid: 035816e598fb6c741a93868e818b71da,
        type: 3}
      propertyPath: m_textInfo.pageCount
      value: 1
      objectReference: {fileID: 0}
    - target: {fileID: 5445117640613744940, guid: 035816e598fb6c741a93868e818b71da,
        type: 3}
      propertyPath: m_Name
      value: User Color Picker
      objectReference: {fileID: 0}
    m_RemovedComponents: []
  m_SourcePrefab: {fileID: 100100000, guid: 035816e598fb6c741a93868e818b71da, type: 3}
--- !u!1001 &8051643248463703678
PrefabInstance:
  m_ObjectHideFlags: 0
  serializedVersion: 2
  m_Modification:
    m_TransformParent: {fileID: 1060773542299304799}
    m_Modifications:
    - target: {fileID: 1865149173984279355, guid: 6cbbc06ceb9a9794299a1e06a17c86b2,
        type: 3}
      propertyPath: m_Name
      value: Back
      objectReference: {fileID: 0}
    - target: {fileID: 3794691817542679349, guid: 6cbbc06ceb9a9794299a1e06a17c86b2,
        type: 3}
      propertyPath: m_Sprite
      value: 
      objectReference: {fileID: 21300000, guid: 064c682231c4a1344ae824328b95b187,
        type: 3}
    - target: {fileID: 4678676913250523710, guid: 6cbbc06ceb9a9794299a1e06a17c86b2,
        type: 3}
      propertyPath: m_LocalPosition.x
      value: 0
      objectReference: {fileID: 0}
    - target: {fileID: 4678676913250523710, guid: 6cbbc06ceb9a9794299a1e06a17c86b2,
        type: 3}
      propertyPath: m_LocalPosition.y
      value: 0
      objectReference: {fileID: 0}
    - target: {fileID: 4678676913250523710, guid: 6cbbc06ceb9a9794299a1e06a17c86b2,
        type: 3}
      propertyPath: m_LocalPosition.z
      value: 0
      objectReference: {fileID: 0}
    - target: {fileID: 4678676913250523710, guid: 6cbbc06ceb9a9794299a1e06a17c86b2,
        type: 3}
      propertyPath: m_LocalRotation.x
      value: -0
      objectReference: {fileID: 0}
    - target: {fileID: 4678676913250523710, guid: 6cbbc06ceb9a9794299a1e06a17c86b2,
        type: 3}
      propertyPath: m_LocalRotation.y
      value: -0
      objectReference: {fileID: 0}
    - target: {fileID: 4678676913250523710, guid: 6cbbc06ceb9a9794299a1e06a17c86b2,
        type: 3}
      propertyPath: m_LocalRotation.z
      value: -0
      objectReference: {fileID: 0}
    - target: {fileID: 4678676913250523710, guid: 6cbbc06ceb9a9794299a1e06a17c86b2,
        type: 3}
      propertyPath: m_LocalRotation.w
      value: 1
      objectReference: {fileID: 0}
    - target: {fileID: 4678676913250523710, guid: 6cbbc06ceb9a9794299a1e06a17c86b2,
        type: 3}
      propertyPath: m_RootOrder
      value: 0
      objectReference: {fileID: 0}
    - target: {fileID: 4678676913250523710, guid: 6cbbc06ceb9a9794299a1e06a17c86b2,
        type: 3}
      propertyPath: m_LocalEulerAnglesHint.x
      value: 0
      objectReference: {fileID: 0}
    - target: {fileID: 4678676913250523710, guid: 6cbbc06ceb9a9794299a1e06a17c86b2,
        type: 3}
      propertyPath: m_LocalEulerAnglesHint.y
      value: 0
      objectReference: {fileID: 0}
    - target: {fileID: 4678676913250523710, guid: 6cbbc06ceb9a9794299a1e06a17c86b2,
        type: 3}
      propertyPath: m_LocalEulerAnglesHint.z
      value: 0
      objectReference: {fileID: 0}
    - target: {fileID: 4678676913250523710, guid: 6cbbc06ceb9a9794299a1e06a17c86b2,
        type: 3}
      propertyPath: m_AnchoredPosition.x
      value: 0
      objectReference: {fileID: 0}
    - target: {fileID: 4678676913250523710, guid: 6cbbc06ceb9a9794299a1e06a17c86b2,
        type: 3}
      propertyPath: m_AnchoredPosition.y
      value: 0
      objectReference: {fileID: 0}
    - target: {fileID: 4678676913250523710, guid: 6cbbc06ceb9a9794299a1e06a17c86b2,
        type: 3}
      propertyPath: m_SizeDelta.x
      value: 72
      objectReference: {fileID: 0}
    - target: {fileID: 4678676913250523710, guid: 6cbbc06ceb9a9794299a1e06a17c86b2,
        type: 3}
      propertyPath: m_SizeDelta.y
      value: 72
      objectReference: {fileID: 0}
    - target: {fileID: 4678676913250523710, guid: 6cbbc06ceb9a9794299a1e06a17c86b2,
        type: 3}
      propertyPath: m_AnchorMin.x
      value: 0
      objectReference: {fileID: 0}
    - target: {fileID: 4678676913250523710, guid: 6cbbc06ceb9a9794299a1e06a17c86b2,
        type: 3}
      propertyPath: m_AnchorMin.y
      value: 0
      objectReference: {fileID: 0}
    - target: {fileID: 4678676913250523710, guid: 6cbbc06ceb9a9794299a1e06a17c86b2,
        type: 3}
      propertyPath: m_AnchorMax.x
      value: 0
      objectReference: {fileID: 0}
    - target: {fileID: 4678676913250523710, guid: 6cbbc06ceb9a9794299a1e06a17c86b2,
        type: 3}
      propertyPath: m_AnchorMax.y
      value: 0
      objectReference: {fileID: 0}
    - target: {fileID: 4678676913250523710, guid: 6cbbc06ceb9a9794299a1e06a17c86b2,
        type: 3}
      propertyPath: m_Pivot.x
      value: 0.5
      objectReference: {fileID: 0}
    - target: {fileID: 4678676913250523710, guid: 6cbbc06ceb9a9794299a1e06a17c86b2,
        type: 3}
      propertyPath: m_Pivot.y
      value: 0.5
      objectReference: {fileID: 0}
    - target: {fileID: 7640394630935375313, guid: 6cbbc06ceb9a9794299a1e06a17c86b2,
        type: 3}
      propertyPath: m_OnClick.m_PersistentCalls.m_Calls.Array.size
      value: 0
      objectReference: {fileID: 0}
    - target: {fileID: 7640394630935375313, guid: 6cbbc06ceb9a9794299a1e06a17c86b2,
        type: 3}
      propertyPath: m_OnClick.m_PersistentCalls.m_Calls.Array.data[0].m_Mode
      value: 1
      objectReference: {fileID: 0}
    - target: {fileID: 7640394630935375313, guid: 6cbbc06ceb9a9794299a1e06a17c86b2,
        type: 3}
      propertyPath: m_OnClick.m_PersistentCalls.m_Calls.Array.data[0].m_CallState
      value: 2
      objectReference: {fileID: 0}
    - target: {fileID: 8865474348618771260, guid: 6cbbc06ceb9a9794299a1e06a17c86b2,
        type: 3}
      propertyPath: m_textInfo.characterCount
      value: 4
      objectReference: {fileID: 0}
    - target: {fileID: 8865474348618771260, guid: 6cbbc06ceb9a9794299a1e06a17c86b2,
        type: 3}
      propertyPath: m_textInfo.wordCount
      value: 1
      objectReference: {fileID: 0}
    - target: {fileID: 8865474348618771260, guid: 6cbbc06ceb9a9794299a1e06a17c86b2,
        type: 3}
      propertyPath: m_textInfo.lineCount
      value: 1
      objectReference: {fileID: 0}
    - target: {fileID: 8865474348618771260, guid: 6cbbc06ceb9a9794299a1e06a17c86b2,
        type: 3}
      propertyPath: m_textInfo.pageCount
      value: 1
      objectReference: {fileID: 0}
    - target: {fileID: 8865474348618771260, guid: 6cbbc06ceb9a9794299a1e06a17c86b2,
        type: 3}
      propertyPath: m_text
      value: Back
      objectReference: {fileID: 0}
    m_RemovedComponents: []
  m_SourcePrefab: {fileID: 100100000, guid: 6cbbc06ceb9a9794299a1e06a17c86b2, type: 3}
--- !u!224 &3409454978577183808 stripped
RectTransform:
  m_CorrespondingSourceObject: {fileID: 4678676913250523710, guid: 6cbbc06ceb9a9794299a1e06a17c86b2,
    type: 3}
  m_PrefabInstance: {fileID: 8051643248463703678}
  m_PrefabAsset: {fileID: 0}
--- !u!1001 &8226252946960468331
PrefabInstance:
  m_ObjectHideFlags: 0
  serializedVersion: 2
  m_Modification:
    m_TransformParent: {fileID: 0}
    m_Modifications:
    - target: {fileID: 2057347383211027327, guid: 32ace6ad35e5f564a94594ebaa4fd3b8,
        type: 3}
      propertyPath: inputAction.actionPath
      value: /actions/NarupaIMD/in/Interact
      objectReference: {fileID: 0}
    - target: {fileID: 2057347383211027327, guid: 32ace6ad35e5f564a94594ebaa4fd3b8,
        type: 3}
      propertyPath: inputSource
      value: 2
      objectReference: {fileID: 0}
    - target: {fileID: 6117009491216474528, guid: 32ace6ad35e5f564a94594ebaa4fd3b8,
        type: 3}
      propertyPath: m_AdditionalShaderChannelsFlag
      value: 25
      objectReference: {fileID: 0}
    - target: {fileID: 6884530326833527367, guid: 32ace6ad35e5f564a94594ebaa4fd3b8,
        type: 3}
      propertyPath: m_Name
      value: Break Menu
      objectReference: {fileID: 0}
    - target: {fileID: 7301280809472655302, guid: 32ace6ad35e5f564a94594ebaa4fd3b8,
        type: 3}
      propertyPath: m_LocalPosition.x
      value: 0
      objectReference: {fileID: 0}
    - target: {fileID: 7301280809472655302, guid: 32ace6ad35e5f564a94594ebaa4fd3b8,
        type: 3}
      propertyPath: m_LocalPosition.y
      value: 0
      objectReference: {fileID: 0}
    - target: {fileID: 7301280809472655302, guid: 32ace6ad35e5f564a94594ebaa4fd3b8,
        type: 3}
      propertyPath: m_LocalPosition.z
      value: 0
      objectReference: {fileID: 0}
    - target: {fileID: 7301280809472655302, guid: 32ace6ad35e5f564a94594ebaa4fd3b8,
        type: 3}
      propertyPath: m_LocalRotation.x
      value: 0
      objectReference: {fileID: 0}
    - target: {fileID: 7301280809472655302, guid: 32ace6ad35e5f564a94594ebaa4fd3b8,
        type: 3}
      propertyPath: m_LocalRotation.y
      value: 0
      objectReference: {fileID: 0}
    - target: {fileID: 7301280809472655302, guid: 32ace6ad35e5f564a94594ebaa4fd3b8,
        type: 3}
      propertyPath: m_LocalRotation.z
      value: 0
      objectReference: {fileID: 0}
    - target: {fileID: 7301280809472655302, guid: 32ace6ad35e5f564a94594ebaa4fd3b8,
        type: 3}
      propertyPath: m_LocalRotation.w
      value: 1
      objectReference: {fileID: 0}
    - target: {fileID: 7301280809472655302, guid: 32ace6ad35e5f564a94594ebaa4fd3b8,
        type: 3}
      propertyPath: m_RootOrder
      value: 0
      objectReference: {fileID: 0}
    - target: {fileID: 7301280809472655302, guid: 32ace6ad35e5f564a94594ebaa4fd3b8,
        type: 3}
      propertyPath: m_LocalEulerAnglesHint.x
      value: 0
      objectReference: {fileID: 0}
    - target: {fileID: 7301280809472655302, guid: 32ace6ad35e5f564a94594ebaa4fd3b8,
        type: 3}
      propertyPath: m_LocalEulerAnglesHint.y
      value: 0
      objectReference: {fileID: 0}
    - target: {fileID: 7301280809472655302, guid: 32ace6ad35e5f564a94594ebaa4fd3b8,
        type: 3}
      propertyPath: m_LocalEulerAnglesHint.z
      value: 0
      objectReference: {fileID: 0}
    - target: {fileID: 7301280809472655302, guid: 32ace6ad35e5f564a94594ebaa4fd3b8,
        type: 3}
      propertyPath: m_AnchoredPosition.x
      value: 0
      objectReference: {fileID: 0}
    - target: {fileID: 7301280809472655302, guid: 32ace6ad35e5f564a94594ebaa4fd3b8,
        type: 3}
      propertyPath: m_AnchoredPosition.y
      value: 0
      objectReference: {fileID: 0}
    - target: {fileID: 7301280809472655302, guid: 32ace6ad35e5f564a94594ebaa4fd3b8,
        type: 3}
      propertyPath: m_SizeDelta.x
      value: 512
      objectReference: {fileID: 0}
    - target: {fileID: 7301280809472655302, guid: 32ace6ad35e5f564a94594ebaa4fd3b8,
        type: 3}
      propertyPath: m_SizeDelta.y
      value: 384
      objectReference: {fileID: 0}
    - target: {fileID: 7301280809472655302, guid: 32ace6ad35e5f564a94594ebaa4fd3b8,
        type: 3}
      propertyPath: m_AnchorMin.x
      value: 0
      objectReference: {fileID: 0}
    - target: {fileID: 7301280809472655302, guid: 32ace6ad35e5f564a94594ebaa4fd3b8,
        type: 3}
      propertyPath: m_AnchorMin.y
      value: 0
      objectReference: {fileID: 0}
    - target: {fileID: 7301280809472655302, guid: 32ace6ad35e5f564a94594ebaa4fd3b8,
        type: 3}
      propertyPath: m_AnchorMax.x
      value: 0
      objectReference: {fileID: 0}
    - target: {fileID: 7301280809472655302, guid: 32ace6ad35e5f564a94594ebaa4fd3b8,
        type: 3}
      propertyPath: m_AnchorMax.y
      value: 0
      objectReference: {fileID: 0}
    - target: {fileID: 7301280809472655302, guid: 32ace6ad35e5f564a94594ebaa4fd3b8,
        type: 3}
      propertyPath: m_Pivot.x
      value: 0.5
      objectReference: {fileID: 0}
    - target: {fileID: 7301280809472655302, guid: 32ace6ad35e5f564a94594ebaa4fd3b8,
        type: 3}
      propertyPath: m_Pivot.y
      value: 0.5
      objectReference: {fileID: 0}
    m_RemovedComponents: []
  m_SourcePrefab: {fileID: 100100000, guid: 32ace6ad35e5f564a94594ebaa4fd3b8, type: 3}
--- !u!224 &1691903542784734893 stripped
RectTransform:
  m_CorrespondingSourceObject: {fileID: 7301280809472655302, guid: 32ace6ad35e5f564a94594ebaa4fd3b8,
    type: 3}
  m_PrefabInstance: {fileID: 8226252946960468331}
  m_PrefabAsset: {fileID: 0}
--- !u!1001 &8739854950771511338
PrefabInstance:
  m_ObjectHideFlags: 0
  serializedVersion: 2
  m_Modification:
    m_TransformParent: {fileID: 1060773542299304799}
    m_Modifications:
    - target: {fileID: 1865149173984279355, guid: 6cbbc06ceb9a9794299a1e06a17c86b2,
        type: 3}
      propertyPath: m_Name
      value: Main Menu
      objectReference: {fileID: 0}
    - target: {fileID: 3716610539585478986, guid: 6cbbc06ceb9a9794299a1e06a17c86b2,
        type: 3}
      propertyPath: m_AnchoredPosition.x
      value: 0
      objectReference: {fileID: 0}
    - target: {fileID: 3716610539585478986, guid: 6cbbc06ceb9a9794299a1e06a17c86b2,
        type: 3}
      propertyPath: m_AnchoredPosition.y
      value: -56
      objectReference: {fileID: 0}
    - target: {fileID: 3716610539585478986, guid: 6cbbc06ceb9a9794299a1e06a17c86b2,
        type: 3}
      propertyPath: m_SizeDelta.x
      value: 96
      objectReference: {fileID: 0}
    - target: {fileID: 3794691817542679349, guid: 6cbbc06ceb9a9794299a1e06a17c86b2,
        type: 3}
      propertyPath: m_Sprite
      value: 
      objectReference: {fileID: 21300000, guid: e94105be491c1184bbff10e05628f6f6,
        type: 3}
    - target: {fileID: 4678676913250523710, guid: 6cbbc06ceb9a9794299a1e06a17c86b2,
        type: 3}
      propertyPath: m_LocalPosition.x
      value: 0
      objectReference: {fileID: 0}
    - target: {fileID: 4678676913250523710, guid: 6cbbc06ceb9a9794299a1e06a17c86b2,
        type: 3}
      propertyPath: m_LocalPosition.y
      value: 0
      objectReference: {fileID: 0}
    - target: {fileID: 4678676913250523710, guid: 6cbbc06ceb9a9794299a1e06a17c86b2,
        type: 3}
      propertyPath: m_LocalPosition.z
      value: 0
      objectReference: {fileID: 0}
    - target: {fileID: 4678676913250523710, guid: 6cbbc06ceb9a9794299a1e06a17c86b2,
        type: 3}
      propertyPath: m_LocalRotation.x
      value: -0
      objectReference: {fileID: 0}
    - target: {fileID: 4678676913250523710, guid: 6cbbc06ceb9a9794299a1e06a17c86b2,
        type: 3}
      propertyPath: m_LocalRotation.y
      value: -0
      objectReference: {fileID: 0}
    - target: {fileID: 4678676913250523710, guid: 6cbbc06ceb9a9794299a1e06a17c86b2,
        type: 3}
      propertyPath: m_LocalRotation.z
      value: -0
      objectReference: {fileID: 0}
    - target: {fileID: 4678676913250523710, guid: 6cbbc06ceb9a9794299a1e06a17c86b2,
        type: 3}
      propertyPath: m_LocalRotation.w
      value: 1
      objectReference: {fileID: 0}
    - target: {fileID: 4678676913250523710, guid: 6cbbc06ceb9a9794299a1e06a17c86b2,
        type: 3}
      propertyPath: m_RootOrder
      value: 1
      objectReference: {fileID: 0}
    - target: {fileID: 4678676913250523710, guid: 6cbbc06ceb9a9794299a1e06a17c86b2,
        type: 3}
      propertyPath: m_LocalEulerAnglesHint.x
      value: 0
      objectReference: {fileID: 0}
    - target: {fileID: 4678676913250523710, guid: 6cbbc06ceb9a9794299a1e06a17c86b2,
        type: 3}
      propertyPath: m_LocalEulerAnglesHint.y
      value: 0
      objectReference: {fileID: 0}
    - target: {fileID: 4678676913250523710, guid: 6cbbc06ceb9a9794299a1e06a17c86b2,
        type: 3}
      propertyPath: m_LocalEulerAnglesHint.z
      value: 0
      objectReference: {fileID: 0}
    - target: {fileID: 4678676913250523710, guid: 6cbbc06ceb9a9794299a1e06a17c86b2,
        type: 3}
      propertyPath: m_AnchoredPosition.x
      value: 0
      objectReference: {fileID: 0}
    - target: {fileID: 4678676913250523710, guid: 6cbbc06ceb9a9794299a1e06a17c86b2,
        type: 3}
      propertyPath: m_AnchoredPosition.y
      value: 0
      objectReference: {fileID: 0}
    - target: {fileID: 4678676913250523710, guid: 6cbbc06ceb9a9794299a1e06a17c86b2,
        type: 3}
      propertyPath: m_SizeDelta.x
      value: 72
      objectReference: {fileID: 0}
    - target: {fileID: 4678676913250523710, guid: 6cbbc06ceb9a9794299a1e06a17c86b2,
        type: 3}
      propertyPath: m_SizeDelta.y
      value: 72
      objectReference: {fileID: 0}
    - target: {fileID: 4678676913250523710, guid: 6cbbc06ceb9a9794299a1e06a17c86b2,
        type: 3}
      propertyPath: m_AnchorMin.x
      value: 0
      objectReference: {fileID: 0}
    - target: {fileID: 4678676913250523710, guid: 6cbbc06ceb9a9794299a1e06a17c86b2,
        type: 3}
      propertyPath: m_AnchorMin.y
      value: 0
      objectReference: {fileID: 0}
    - target: {fileID: 4678676913250523710, guid: 6cbbc06ceb9a9794299a1e06a17c86b2,
        type: 3}
      propertyPath: m_AnchorMax.x
      value: 0
      objectReference: {fileID: 0}
    - target: {fileID: 4678676913250523710, guid: 6cbbc06ceb9a9794299a1e06a17c86b2,
        type: 3}
      propertyPath: m_AnchorMax.y
      value: 0
      objectReference: {fileID: 0}
    - target: {fileID: 4678676913250523710, guid: 6cbbc06ceb9a9794299a1e06a17c86b2,
        type: 3}
      propertyPath: m_Pivot.x
      value: 0.5
      objectReference: {fileID: 0}
    - target: {fileID: 4678676913250523710, guid: 6cbbc06ceb9a9794299a1e06a17c86b2,
        type: 3}
      propertyPath: m_Pivot.y
      value: 0.5
      objectReference: {fileID: 0}
    - target: {fileID: 8865474348618771260, guid: 6cbbc06ceb9a9794299a1e06a17c86b2,
        type: 3}
      propertyPath: m_textInfo.characterCount
      value: 9
      objectReference: {fileID: 0}
    - target: {fileID: 8865474348618771260, guid: 6cbbc06ceb9a9794299a1e06a17c86b2,
        type: 3}
      propertyPath: m_textInfo.wordCount
      value: 2
      objectReference: {fileID: 0}
    - target: {fileID: 8865474348618771260, guid: 6cbbc06ceb9a9794299a1e06a17c86b2,
        type: 3}
      propertyPath: m_textInfo.lineCount
      value: 1
      objectReference: {fileID: 0}
    - target: {fileID: 8865474348618771260, guid: 6cbbc06ceb9a9794299a1e06a17c86b2,
        type: 3}
      propertyPath: m_textInfo.pageCount
      value: 1
      objectReference: {fileID: 0}
    - target: {fileID: 8865474348618771260, guid: 6cbbc06ceb9a9794299a1e06a17c86b2,
        type: 3}
      propertyPath: m_text
      value: Main Menu
      objectReference: {fileID: 0}
    - target: {fileID: 8865474348618771260, guid: 6cbbc06ceb9a9794299a1e06a17c86b2,
        type: 3}
      propertyPath: m_textInfo.spaceCount
      value: 1
      objectReference: {fileID: 0}
    m_RemovedComponents: []
  m_SourcePrefab: {fileID: 100100000, guid: 6cbbc06ceb9a9794299a1e06a17c86b2, type: 3}
--- !u!224 &4154513587008866836 stripped
RectTransform:
  m_CorrespondingSourceObject: {fileID: 4678676913250523710, guid: 6cbbc06ceb9a9794299a1e06a17c86b2,
    type: 3}
  m_PrefabInstance: {fileID: 8739854950771511338}
  m_PrefabAsset: {fileID: 0}
