%YAML 1.1
%TAG !u! tag:unity3d.com,2011:
--- !u!1 &4320031787925530759
GameObject:
  m_ObjectHideFlags: 0
  m_CorrespondingSourceObject: {fileID: 0}
  m_PrefabInstance: {fileID: 0}
  m_PrefabAsset: {fileID: 0}
  serializedVersion: 6
  m_Component:
  - component: {fileID: 2469597289359277325}
  - component: {fileID: 6332147551177597581}
  - component: {fileID: 119484442988484058}
  m_Layer: 5
  m_Name: Label
  m_TagString: Untagged
  m_Icon: {fileID: 0}
  m_NavMeshLayer: 0
  m_StaticEditorFlags: 0
  m_IsActive: 1
--- !u!224 &2469597289359277325
RectTransform:
  m_ObjectHideFlags: 0
  m_CorrespondingSourceObject: {fileID: 0}
  m_PrefabInstance: {fileID: 0}
  m_PrefabAsset: {fileID: 0}
  m_GameObject: {fileID: 4320031787925530759}
  m_LocalRotation: {x: -0, y: -0, z: -0, w: 1}
  m_LocalPosition: {x: 0, y: 0, z: 0}
  m_LocalScale: {x: 1, y: 1, z: 1}
  m_Children: []
  m_Father: {fileID: 1691903542784734893}
  m_RootOrder: 0
  m_LocalEulerAnglesHint: {x: 0, y: 0, z: 0}
  m_AnchorMin: {x: 0.5, y: 0.5}
  m_AnchorMax: {x: 0.5, y: 0.5}
  m_AnchoredPosition: {x: 0, y: 113.5933}
  m_SizeDelta: {x: 256, y: 24}
  m_Pivot: {x: 0.5, y: 0.5}
--- !u!222 &6332147551177597581
CanvasRenderer:
  m_ObjectHideFlags: 0
  m_CorrespondingSourceObject: {fileID: 0}
  m_PrefabInstance: {fileID: 0}
  m_PrefabAsset: {fileID: 0}
  m_GameObject: {fileID: 4320031787925530759}
  m_CullTransparentMesh: 0
--- !u!114 &119484442988484058
MonoBehaviour:
  m_ObjectHideFlags: 0
  m_CorrespondingSourceObject: {fileID: 0}
  m_PrefabInstance: {fileID: 0}
  m_PrefabAsset: {fileID: 0}
  m_GameObject: {fileID: 4320031787925530759}
  m_Enabled: 1
  m_EditorHideFlags: 0
  m_Script: {fileID: 11500000, guid: f4688fdb7df04437aeb418b961361dc5, type: 3}
  m_Name: 
  m_EditorClassIdentifier: 
  m_Material: {fileID: 0}
  m_Color: {r: 1, g: 1, b: 1, a: 1}
  m_RaycastTarget: 0
  m_OnCullStateChanged:
    m_PersistentCalls:
      m_Calls: []
  m_text: Connect
  m_isRightToLeft: 0
  m_fontAsset: {fileID: 11400000, guid: 5a19f4193fe2bf64089ade0b38163199, type: 2}
  m_sharedMaterial: {fileID: 21566619404874456, guid: 5a19f4193fe2bf64089ade0b38163199,
    type: 2}
  m_fontSharedMaterials: []
  m_fontMaterial: {fileID: 0}
  m_fontMaterials: []
  m_fontColor32:
    serializedVersion: 2
    rgba: 3707764735
  m_fontColor: {r: 1, g: 1, b: 1, a: 0.8627451}
  m_enableVertexGradient: 0
  m_colorMode: 3
  m_fontColorGradient:
    topLeft: {r: 1, g: 1, b: 1, a: 1}
    topRight: {r: 1, g: 1, b: 1, a: 1}
    bottomLeft: {r: 1, g: 1, b: 1, a: 1}
    bottomRight: {r: 1, g: 1, b: 1, a: 1}
  m_fontColorGradientPreset: {fileID: 0}
  m_spriteAsset: {fileID: 0}
  m_tintAllSprites: 0
  m_overrideHtmlColors: 0
  m_faceColor:
    serializedVersion: 2
    rgba: 4294967295
  m_outlineColor:
    serializedVersion: 2
    rgba: 4278190080
  m_fontSize: 32
  m_fontSizeBase: 32
  m_fontWeight: 400
  m_enableAutoSizing: 0
  m_fontSizeMin: 18
  m_fontSizeMax: 72
  m_fontStyle: 0
  m_textAlignment: 514
  m_characterSpacing: 0
  m_wordSpacing: 0
  m_lineSpacing: 0
  m_lineSpacingMax: 0
  m_paragraphSpacing: 0
  m_charWidthMaxAdj: 0
  m_enableWordWrapping: 1
  m_wordWrappingRatios: 0.4
  m_overflowMode: 0
  m_firstOverflowCharacterIndex: 0
  m_linkedTextComponent: {fileID: 0}
  m_isLinkedTextComponent: 0
  m_isTextTruncated: 0
  m_enableKerning: 1
  m_enableExtraPadding: 0
  checkPaddingRequired: 0
  m_isRichText: 1
  m_parseCtrlCharacters: 1
  m_isOrthographic: 1
  m_isCullingEnabled: 0
  m_ignoreRectMaskCulling: 0
  m_ignoreCulling: 1
  m_horizontalMapping: 0
  m_verticalMapping: 0
  m_uvLineOffset: 0
  m_geometrySortingOrder: 0
  m_VertexBufferAutoSizeReduction: 1
  m_firstVisibleCharacter: 0
  m_useMaxVisibleDescender: 1
  m_pageToDisplay: 1
  m_margin: {x: 0, y: 0, z: 0, w: 0}
  m_textInfo:
    textComponent: {fileID: 119484442988484058}
    characterCount: 7
    spriteCount: 0
    spaceCount: 0
    wordCount: 1
    linkCount: 0
    lineCount: 1
    pageCount: 1
    materialCount: 1
  m_isUsingLegacyAnimationComponent: 0
  m_isVolumetricText: 0
  m_spriteAnimator: {fileID: 0}
  m_hasFontAssetChanged: 0
  m_subTextObjects:
  - {fileID: 0}
  - {fileID: 0}
  - {fileID: 0}
  - {fileID: 0}
  - {fileID: 0}
  - {fileID: 0}
  - {fileID: 0}
  - {fileID: 0}
  m_baseMaterial: {fileID: 0}
  m_maskOffset: {x: 0, y: 0, z: 0, w: 0}
--- !u!1 &5206883492402863689
GameObject:
  m_ObjectHideFlags: 0
  m_CorrespondingSourceObject: {fileID: 0}
  m_PrefabInstance: {fileID: 0}
  m_PrefabAsset: {fileID: 0}
  serializedVersion: 6
  m_Component:
  - component: {fileID: 1804776832139285656}
  - component: {fileID: 2746525323833653862}
  m_Layer: 0
  m_Name: GameObject (1)
  m_TagString: Untagged
  m_Icon: {fileID: 0}
  m_NavMeshLayer: 0
  m_StaticEditorFlags: 0
  m_IsActive: 1
--- !u!224 &1804776832139285656
RectTransform:
  m_ObjectHideFlags: 0
  m_CorrespondingSourceObject: {fileID: 0}
  m_PrefabInstance: {fileID: 0}
  m_PrefabAsset: {fileID: 0}
  m_GameObject: {fileID: 5206883492402863689}
  m_LocalRotation: {x: -0, y: -0, z: -0, w: 1}
  m_LocalPosition: {x: 0, y: 0, z: 0}
  m_LocalScale: {x: 1, y: 1, z: 1}
  m_Children:
  - {fileID: 5400798464249899871}
  - {fileID: 5950150822825882132}
  - {fileID: 3865156548398210370}
  m_Father: {fileID: 1691903542784734893}
  m_RootOrder: 2
  m_LocalEulerAnglesHint: {x: 0, y: 0, z: 0}
  m_AnchorMin: {x: 0.5, y: 0.5}
  m_AnchorMax: {x: 0.5, y: 0.5}
  m_AnchoredPosition: {x: 0, y: -107.4}
  m_SizeDelta: {x: 512, y: 100}
  m_Pivot: {x: 0.5, y: 0.5}
--- !u!114 &2746525323833653862
MonoBehaviour:
  m_ObjectHideFlags: 0
  m_CorrespondingSourceObject: {fileID: 0}
  m_PrefabInstance: {fileID: 0}
  m_PrefabAsset: {fileID: 0}
  m_GameObject: {fileID: 5206883492402863689}
  m_Enabled: 1
  m_EditorHideFlags: 0
  m_Script: {fileID: 11500000, guid: 30649d3a9faa99c48a7b1166b86bf2a0, type: 3}
  m_Name: 
  m_EditorClassIdentifier: 
  m_Padding:
    m_Left: 0
    m_Right: 0
    m_Top: 0
    m_Bottom: 0
  m_ChildAlignment: 4
  m_Spacing: 32
  m_ChildForceExpandWidth: 0
  m_ChildForceExpandHeight: 0
  m_ChildControlWidth: 0
  m_ChildControlHeight: 0
  m_ChildScaleWidth: 0
  m_ChildScaleHeight: 0
--- !u!1 &8351017974155460076
GameObject:
  m_ObjectHideFlags: 0
  m_CorrespondingSourceObject: {fileID: 0}
  m_PrefabInstance: {fileID: 0}
  m_PrefabAsset: {fileID: 0}
  serializedVersion: 6
  m_Component:
  - component: {fileID: 1060773542299304799}
  - component: {fileID: 6856390651414668505}
  m_Layer: 0
  m_Name: GameObject
  m_TagString: Untagged
  m_Icon: {fileID: 0}
  m_NavMeshLayer: 0
  m_StaticEditorFlags: 0
  m_IsActive: 1
--- !u!224 &1060773542299304799
RectTransform:
  m_ObjectHideFlags: 0
  m_CorrespondingSourceObject: {fileID: 0}
  m_PrefabInstance: {fileID: 0}
  m_PrefabAsset: {fileID: 0}
  m_GameObject: {fileID: 8351017974155460076}
  m_LocalRotation: {x: -0, y: -0, z: -0, w: 1}
  m_LocalPosition: {x: 0, y: 0, z: 0}
  m_LocalScale: {x: 1, y: 1, z: 1}
  m_Children:
  - {fileID: 3409454978577183808}
  - {fileID: 4154513587008866836}
  - {fileID: 1601093334701725025}
  m_Father: {fileID: 1691903542784734893}
  m_RootOrder: 1
  m_LocalEulerAnglesHint: {x: 0, y: 0, z: 0}
  m_AnchorMin: {x: 0.5, y: 0.5}
  m_AnchorMax: {x: 0.5, y: 0.5}
  m_AnchoredPosition: {x: 0, y: 41.1}
  m_SizeDelta: {x: 512, y: 100}
  m_Pivot: {x: 0.5, y: 0.5}
--- !u!114 &6856390651414668505
MonoBehaviour:
  m_ObjectHideFlags: 0
  m_CorrespondingSourceObject: {fileID: 0}
  m_PrefabInstance: {fileID: 0}
  m_PrefabAsset: {fileID: 0}
  m_GameObject: {fileID: 8351017974155460076}
  m_Enabled: 1
  m_EditorHideFlags: 0
  m_Script: {fileID: 11500000, guid: 30649d3a9faa99c48a7b1166b86bf2a0, type: 3}
  m_Name: 
  m_EditorClassIdentifier: 
  m_Padding:
    m_Left: 0
    m_Right: 0
    m_Top: 0
    m_Bottom: 0
  m_ChildAlignment: 4
  m_Spacing: 64
  m_ChildForceExpandWidth: 0
  m_ChildForceExpandHeight: 0
  m_ChildControlWidth: 0
  m_ChildControlHeight: 0
  m_ChildScaleWidth: 0
  m_ChildScaleHeight: 0
--- !u!1001 &729163450529968481
PrefabInstance:
  m_ObjectHideFlags: 0
  serializedVersion: 2
  m_Modification:
    m_TransformParent: {fileID: 1804776832139285656}
    m_Modifications:
    - target: {fileID: 1865149173984279355, guid: 6cbbc06ceb9a9794299a1e06a17c86b2,
        type: 3}
      propertyPath: m_Name
      value: Exit Button
      objectReference: {fileID: 0}
    - target: {fileID: 3716610539585478986, guid: 6cbbc06ceb9a9794299a1e06a17c86b2,
        type: 3}
      propertyPath: m_AnchorMin.x
      value: 0.5
      objectReference: {fileID: 0}
    - target: {fileID: 3716610539585478986, guid: 6cbbc06ceb9a9794299a1e06a17c86b2,
        type: 3}
      propertyPath: m_AnchorMin.y
      value: 0.5
      objectReference: {fileID: 0}
    - target: {fileID: 3716610539585478986, guid: 6cbbc06ceb9a9794299a1e06a17c86b2,
        type: 3}
      propertyPath: m_AnchorMax.x
      value: 0.5
      objectReference: {fileID: 0}
    - target: {fileID: 3716610539585478986, guid: 6cbbc06ceb9a9794299a1e06a17c86b2,
        type: 3}
      propertyPath: m_AnchorMax.y
      value: 0.5
      objectReference: {fileID: 0}
    - target: {fileID: 3716610539585478986, guid: 6cbbc06ceb9a9794299a1e06a17c86b2,
        type: 3}
      propertyPath: m_AnchoredPosition.y
      value: -48.2
      objectReference: {fileID: 0}
    - target: {fileID: 3716610539585478986, guid: 6cbbc06ceb9a9794299a1e06a17c86b2,
        type: 3}
      propertyPath: m_SizeDelta.x
      value: 128
      objectReference: {fileID: 0}
    - target: {fileID: 3716610539585478986, guid: 6cbbc06ceb9a9794299a1e06a17c86b2,
        type: 3}
      propertyPath: m_SizeDelta.y
      value: 15.999992
      objectReference: {fileID: 0}
    - target: {fileID: 3794691817542679349, guid: 6cbbc06ceb9a9794299a1e06a17c86b2,
        type: 3}
      propertyPath: m_Sprite
      value: 
      objectReference: {fileID: 21300000, guid: e94105be491c1184bbff10e05628f6f6,
        type: 3}
    - target: {fileID: 4678676913250523710, guid: 6cbbc06ceb9a9794299a1e06a17c86b2,
        type: 3}
      propertyPath: m_LocalPosition.x
      value: 0
      objectReference: {fileID: 0}
    - target: {fileID: 4678676913250523710, guid: 6cbbc06ceb9a9794299a1e06a17c86b2,
        type: 3}
      propertyPath: m_LocalPosition.y
      value: 0
      objectReference: {fileID: 0}
    - target: {fileID: 4678676913250523710, guid: 6cbbc06ceb9a9794299a1e06a17c86b2,
        type: 3}
      propertyPath: m_LocalPosition.z
      value: 0
      objectReference: {fileID: 0}
    - target: {fileID: 4678676913250523710, guid: 6cbbc06ceb9a9794299a1e06a17c86b2,
        type: 3}
      propertyPath: m_LocalRotation.x
      value: -0
      objectReference: {fileID: 0}
    - target: {fileID: 4678676913250523710, guid: 6cbbc06ceb9a9794299a1e06a17c86b2,
        type: 3}
      propertyPath: m_LocalRotation.y
      value: -0
      objectReference: {fileID: 0}
    - target: {fileID: 4678676913250523710, guid: 6cbbc06ceb9a9794299a1e06a17c86b2,
        type: 3}
      propertyPath: m_LocalRotation.z
      value: -0
      objectReference: {fileID: 0}
    - target: {fileID: 4678676913250523710, guid: 6cbbc06ceb9a9794299a1e06a17c86b2,
        type: 3}
      propertyPath: m_LocalRotation.w
      value: 1
      objectReference: {fileID: 0}
    - target: {fileID: 4678676913250523710, guid: 6cbbc06ceb9a9794299a1e06a17c86b2,
        type: 3}
      propertyPath: m_RootOrder
      value: 0
      objectReference: {fileID: 0}
    - target: {fileID: 4678676913250523710, guid: 6cbbc06ceb9a9794299a1e06a17c86b2,
        type: 3}
      propertyPath: m_LocalEulerAnglesHint.x
      value: 0
      objectReference: {fileID: 0}
    - target: {fileID: 4678676913250523710, guid: 6cbbc06ceb9a9794299a1e06a17c86b2,
        type: 3}
      propertyPath: m_LocalEulerAnglesHint.y
      value: 0
      objectReference: {fileID: 0}
    - target: {fileID: 4678676913250523710, guid: 6cbbc06ceb9a9794299a1e06a17c86b2,
        type: 3}
      propertyPath: m_LocalEulerAnglesHint.z
      value: 0
      objectReference: {fileID: 0}
    - target: {fileID: 4678676913250523710, guid: 6cbbc06ceb9a9794299a1e06a17c86b2,
        type: 3}
      propertyPath: m_AnchoredPosition.x
      value: 0
      objectReference: {fileID: 0}
    - target: {fileID: 4678676913250523710, guid: 6cbbc06ceb9a9794299a1e06a17c86b2,
        type: 3}
      propertyPath: m_AnchoredPosition.y
      value: 0
      objectReference: {fileID: 0}
    - target: {fileID: 4678676913250523710, guid: 6cbbc06ceb9a9794299a1e06a17c86b2,
        type: 3}
      propertyPath: m_SizeDelta.x
      value: 64
      objectReference: {fileID: 0}
    - target: {fileID: 4678676913250523710, guid: 6cbbc06ceb9a9794299a1e06a17c86b2,
        type: 3}
      propertyPath: m_SizeDelta.y
      value: 64
      objectReference: {fileID: 0}
    - target: {fileID: 4678676913250523710, guid: 6cbbc06ceb9a9794299a1e06a17c86b2,
        type: 3}
      propertyPath: m_AnchorMin.x
      value: 0
      objectReference: {fileID: 0}
    - target: {fileID: 4678676913250523710, guid: 6cbbc06ceb9a9794299a1e06a17c86b2,
        type: 3}
      propertyPath: m_AnchorMin.y
      value: 0
      objectReference: {fileID: 0}
    - target: {fileID: 4678676913250523710, guid: 6cbbc06ceb9a9794299a1e06a17c86b2,
        type: 3}
      propertyPath: m_AnchorMax.x
      value: 0
      objectReference: {fileID: 0}
    - target: {fileID: 4678676913250523710, guid: 6cbbc06ceb9a9794299a1e06a17c86b2,
        type: 3}
      propertyPath: m_AnchorMax.y
      value: 0
      objectReference: {fileID: 0}
    - target: {fileID: 4678676913250523710, guid: 6cbbc06ceb9a9794299a1e06a17c86b2,
        type: 3}
      propertyPath: m_Pivot.x
      value: 0.5
      objectReference: {fileID: 0}
    - target: {fileID: 4678676913250523710, guid: 6cbbc06ceb9a9794299a1e06a17c86b2,
        type: 3}
      propertyPath: m_Pivot.y
      value: 0.5
      objectReference: {fileID: 0}
    - target: {fileID: 8865474348618771260, guid: 6cbbc06ceb9a9794299a1e06a17c86b2,
        type: 3}
      propertyPath: m_textInfo.characterCount
      value: 4
      objectReference: {fileID: 0}
    - target: {fileID: 8865474348618771260, guid: 6cbbc06ceb9a9794299a1e06a17c86b2,
        type: 3}
      propertyPath: m_textInfo.wordCount
      value: 1
      objectReference: {fileID: 0}
    - target: {fileID: 8865474348618771260, guid: 6cbbc06ceb9a9794299a1e06a17c86b2,
        type: 3}
      propertyPath: m_textInfo.lineCount
      value: 1
      objectReference: {fileID: 0}
    - target: {fileID: 8865474348618771260, guid: 6cbbc06ceb9a9794299a1e06a17c86b2,
        type: 3}
      propertyPath: m_textInfo.pageCount
      value: 1
      objectReference: {fileID: 0}
    - target: {fileID: 8865474348618771260, guid: 6cbbc06ceb9a9794299a1e06a17c86b2,
        type: 3}
      propertyPath: m_text
      value: Exit
      objectReference: {fileID: 0}
    - target: {fileID: 8865474348618771260, guid: 6cbbc06ceb9a9794299a1e06a17c86b2,
        type: 3}
      propertyPath: m_textInfo.spaceCount
      value: 0
      objectReference: {fileID: 0}
    - target: {fileID: 8865474348618771260, guid: 6cbbc06ceb9a9794299a1e06a17c86b2,
        type: 3}
      propertyPath: m_enableAutoSizing
      value: 0
      objectReference: {fileID: 0}
    - target: {fileID: 8865474348618771260, guid: 6cbbc06ceb9a9794299a1e06a17c86b2,
        type: 3}
      propertyPath: m_fontSize
      value: 20
      objectReference: {fileID: 0}
    - target: {fileID: 8865474348618771260, guid: 6cbbc06ceb9a9794299a1e06a17c86b2,
        type: 3}
      propertyPath: m_firstOverflowCharacterIndex
      value: 0
      objectReference: {fileID: 0}
    - target: {fileID: 8865474348618771260, guid: 6cbbc06ceb9a9794299a1e06a17c86b2,
        type: 3}
      propertyPath: m_fontSizeMin
      value: 12
      objectReference: {fileID: 0}
    - target: {fileID: 8865474348618771260, guid: 6cbbc06ceb9a9794299a1e06a17c86b2,
        type: 3}
      propertyPath: m_fontSizeBase
      value: 20
      objectReference: {fileID: 0}
    m_RemovedComponents: []
  m_SourcePrefab: {fileID: 100100000, guid: 6cbbc06ceb9a9794299a1e06a17c86b2, type: 3}
--- !u!224 &5400798464249899871 stripped
RectTransform:
  m_CorrespondingSourceObject: {fileID: 4678676913250523710, guid: 6cbbc06ceb9a9794299a1e06a17c86b2,
    type: 3}
  m_PrefabInstance: {fileID: 729163450529968481}
  m_PrefabAsset: {fileID: 0}
--- !u!1001 &6257125211896418143
PrefabInstance:
  m_ObjectHideFlags: 0
  serializedVersion: 2
  m_Modification:
    m_TransformParent: {fileID: 1060773542299304799}
    m_Modifications:
    - target: {fileID: 1865149173984279355, guid: 6cbbc06ceb9a9794299a1e06a17c86b2,
        type: 3}
      propertyPath: m_Name
      value: Manual Connect Button
      objectReference: {fileID: 0}
    - target: {fileID: 3794691817542679349, guid: 6cbbc06ceb9a9794299a1e06a17c86b2,
        type: 3}
      propertyPath: m_Sprite
      value: 
      objectReference: {fileID: 21300000, guid: 1445f8824cead2f4fb0f4f0719e1bbdf,
        type: 3}
    - target: {fileID: 4678676913250523710, guid: 6cbbc06ceb9a9794299a1e06a17c86b2,
        type: 3}
      propertyPath: m_LocalPosition.x
      value: 0
      objectReference: {fileID: 0}
    - target: {fileID: 4678676913250523710, guid: 6cbbc06ceb9a9794299a1e06a17c86b2,
        type: 3}
      propertyPath: m_LocalPosition.y
      value: 0
      objectReference: {fileID: 0}
    - target: {fileID: 4678676913250523710, guid: 6cbbc06ceb9a9794299a1e06a17c86b2,
        type: 3}
      propertyPath: m_LocalPosition.z
      value: 0
      objectReference: {fileID: 0}
    - target: {fileID: 4678676913250523710, guid: 6cbbc06ceb9a9794299a1e06a17c86b2,
        type: 3}
      propertyPath: m_LocalRotation.x
      value: -0
      objectReference: {fileID: 0}
    - target: {fileID: 4678676913250523710, guid: 6cbbc06ceb9a9794299a1e06a17c86b2,
        type: 3}
      propertyPath: m_LocalRotation.y
      value: -0
      objectReference: {fileID: 0}
    - target: {fileID: 4678676913250523710, guid: 6cbbc06ceb9a9794299a1e06a17c86b2,
        type: 3}
      propertyPath: m_LocalRotation.z
      value: -0
      objectReference: {fileID: 0}
    - target: {fileID: 4678676913250523710, guid: 6cbbc06ceb9a9794299a1e06a17c86b2,
        type: 3}
      propertyPath: m_LocalRotation.w
      value: 1
      objectReference: {fileID: 0}
    - target: {fileID: 4678676913250523710, guid: 6cbbc06ceb9a9794299a1e06a17c86b2,
        type: 3}
      propertyPath: m_RootOrder
      value: 2
      objectReference: {fileID: 0}
    - target: {fileID: 4678676913250523710, guid: 6cbbc06ceb9a9794299a1e06a17c86b2,
        type: 3}
      propertyPath: m_LocalEulerAnglesHint.x
      value: 0
      objectReference: {fileID: 0}
    - target: {fileID: 4678676913250523710, guid: 6cbbc06ceb9a9794299a1e06a17c86b2,
        type: 3}
      propertyPath: m_LocalEulerAnglesHint.y
      value: 0
      objectReference: {fileID: 0}
    - target: {fileID: 4678676913250523710, guid: 6cbbc06ceb9a9794299a1e06a17c86b2,
        type: 3}
      propertyPath: m_LocalEulerAnglesHint.z
      value: 0
      objectReference: {fileID: 0}
    - target: {fileID: 4678676913250523710, guid: 6cbbc06ceb9a9794299a1e06a17c86b2,
        type: 3}
      propertyPath: m_AnchoredPosition.x
      value: 0
      objectReference: {fileID: 0}
    - target: {fileID: 4678676913250523710, guid: 6cbbc06ceb9a9794299a1e06a17c86b2,
        type: 3}
      propertyPath: m_AnchoredPosition.y
      value: 0
      objectReference: {fileID: 0}
    - target: {fileID: 4678676913250523710, guid: 6cbbc06ceb9a9794299a1e06a17c86b2,
        type: 3}
      propertyPath: m_SizeDelta.x
      value: 72
      objectReference: {fileID: 0}
    - target: {fileID: 4678676913250523710, guid: 6cbbc06ceb9a9794299a1e06a17c86b2,
        type: 3}
      propertyPath: m_SizeDelta.y
      value: 72
      objectReference: {fileID: 0}
    - target: {fileID: 4678676913250523710, guid: 6cbbc06ceb9a9794299a1e06a17c86b2,
        type: 3}
      propertyPath: m_AnchorMin.x
      value: 0
      objectReference: {fileID: 0}
    - target: {fileID: 4678676913250523710, guid: 6cbbc06ceb9a9794299a1e06a17c86b2,
        type: 3}
      propertyPath: m_AnchorMin.y
      value: 0
      objectReference: {fileID: 0}
    - target: {fileID: 4678676913250523710, guid: 6cbbc06ceb9a9794299a1e06a17c86b2,
        type: 3}
      propertyPath: m_AnchorMax.x
      value: 0
      objectReference: {fileID: 0}
    - target: {fileID: 4678676913250523710, guid: 6cbbc06ceb9a9794299a1e06a17c86b2,
        type: 3}
      propertyPath: m_AnchorMax.y
      value: 0
      objectReference: {fileID: 0}
    - target: {fileID: 4678676913250523710, guid: 6cbbc06ceb9a9794299a1e06a17c86b2,
        type: 3}
      propertyPath: m_Pivot.x
      value: 0.5
      objectReference: {fileID: 0}
    - target: {fileID: 4678676913250523710, guid: 6cbbc06ceb9a9794299a1e06a17c86b2,
        type: 3}
      propertyPath: m_Pivot.y
      value: 0.5
      objectReference: {fileID: 0}
    - target: {fileID: 8865474348618771260, guid: 6cbbc06ceb9a9794299a1e06a17c86b2,
        type: 3}
      propertyPath: m_textInfo.characterCount
      value: 6
      objectReference: {fileID: 0}
    - target: {fileID: 8865474348618771260, guid: 6cbbc06ceb9a9794299a1e06a17c86b2,
        type: 3}
      propertyPath: m_textInfo.wordCount
      value: 1
      objectReference: {fileID: 0}
    - target: {fileID: 8865474348618771260, guid: 6cbbc06ceb9a9794299a1e06a17c86b2,
        type: 3}
      propertyPath: m_textInfo.lineCount
      value: 1
      objectReference: {fileID: 0}
    - target: {fileID: 8865474348618771260, guid: 6cbbc06ceb9a9794299a1e06a17c86b2,
        type: 3}
      propertyPath: m_textInfo.pageCount
      value: 1
      objectReference: {fileID: 0}
    - target: {fileID: 8865474348618771260, guid: 6cbbc06ceb9a9794299a1e06a17c86b2,
        type: 3}
      propertyPath: m_text
      value: Manual
      objectReference: {fileID: 0}
    - target: {fileID: 8865474348618771260, guid: 6cbbc06ceb9a9794299a1e06a17c86b2,
        type: 3}
      propertyPath: m_textInfo.spaceCount
      value: 0
      objectReference: {fileID: 0}
    - target: {fileID: 8865474348618771260, guid: 6cbbc06ceb9a9794299a1e06a17c86b2,
        type: 3}
      propertyPath: m_enableAutoSizing
      value: 0
      objectReference: {fileID: 0}
    - target: {fileID: 8865474348618771260, guid: 6cbbc06ceb9a9794299a1e06a17c86b2,
        type: 3}
      propertyPath: m_fontSize
      value: 24
      objectReference: {fileID: 0}
    - target: {fileID: 8865474348618771260, guid: 6cbbc06ceb9a9794299a1e06a17c86b2,
        type: 3}
      propertyPath: m_firstOverflowCharacterIndex
      value: 0
      objectReference: {fileID: 0}
    - target: {fileID: 8865474348618771260, guid: 6cbbc06ceb9a9794299a1e06a17c86b2,
        type: 3}
      propertyPath: m_fontSizeMin
      value: 12
      objectReference: {fileID: 0}
    m_RemovedComponents: []
  m_SourcePrefab: {fileID: 100100000, guid: 6cbbc06ceb9a9794299a1e06a17c86b2, type: 3}
--- !u!224 &1601093334701725025 stripped
RectTransform:
  m_CorrespondingSourceObject: {fileID: 4678676913250523710, guid: 6cbbc06ceb9a9794299a1e06a17c86b2,
    type: 3}
  m_PrefabInstance: {fileID: 6257125211896418143}
  m_PrefabAsset: {fileID: 0}
--- !u!1001 &8051643248463703678
PrefabInstance:
  m_ObjectHideFlags: 0
  serializedVersion: 2
  m_Modification:
    m_TransformParent: {fileID: 1060773542299304799}
    m_Modifications:
    - target: {fileID: 1865149173984279355, guid: 6cbbc06ceb9a9794299a1e06a17c86b2,
        type: 3}
      propertyPath: m_Name
      value: Autoconnect Button
      objectReference: {fileID: 0}
    - target: {fileID: 3794691817542679349, guid: 6cbbc06ceb9a9794299a1e06a17c86b2,
        type: 3}
      propertyPath: m_Sprite
      value: 
      objectReference: {fileID: 21300000, guid: ee332e888a9fdb54497d7c16c25732c6,
        type: 3}
    - target: {fileID: 4678676913250523710, guid: 6cbbc06ceb9a9794299a1e06a17c86b2,
        type: 3}
      propertyPath: m_LocalPosition.x
      value: 0
      objectReference: {fileID: 0}
    - target: {fileID: 4678676913250523710, guid: 6cbbc06ceb9a9794299a1e06a17c86b2,
        type: 3}
      propertyPath: m_LocalPosition.y
      value: 0
      objectReference: {fileID: 0}
    - target: {fileID: 4678676913250523710, guid: 6cbbc06ceb9a9794299a1e06a17c86b2,
        type: 3}
      propertyPath: m_LocalPosition.z
      value: 0
      objectReference: {fileID: 0}
    - target: {fileID: 4678676913250523710, guid: 6cbbc06ceb9a9794299a1e06a17c86b2,
        type: 3}
      propertyPath: m_LocalRotation.x
      value: -0
      objectReference: {fileID: 0}
    - target: {fileID: 4678676913250523710, guid: 6cbbc06ceb9a9794299a1e06a17c86b2,
        type: 3}
      propertyPath: m_LocalRotation.y
      value: -0
      objectReference: {fileID: 0}
    - target: {fileID: 4678676913250523710, guid: 6cbbc06ceb9a9794299a1e06a17c86b2,
        type: 3}
      propertyPath: m_LocalRotation.z
      value: -0
      objectReference: {fileID: 0}
    - target: {fileID: 4678676913250523710, guid: 6cbbc06ceb9a9794299a1e06a17c86b2,
        type: 3}
      propertyPath: m_LocalRotation.w
      value: 1
      objectReference: {fileID: 0}
    - target: {fileID: 4678676913250523710, guid: 6cbbc06ceb9a9794299a1e06a17c86b2,
        type: 3}
      propertyPath: m_RootOrder
      value: 0
      objectReference: {fileID: 0}
    - target: {fileID: 4678676913250523710, guid: 6cbbc06ceb9a9794299a1e06a17c86b2,
        type: 3}
      propertyPath: m_LocalEulerAnglesHint.x
      value: 0
      objectReference: {fileID: 0}
    - target: {fileID: 4678676913250523710, guid: 6cbbc06ceb9a9794299a1e06a17c86b2,
        type: 3}
      propertyPath: m_LocalEulerAnglesHint.y
      value: 0
      objectReference: {fileID: 0}
    - target: {fileID: 4678676913250523710, guid: 6cbbc06ceb9a9794299a1e06a17c86b2,
        type: 3}
      propertyPath: m_LocalEulerAnglesHint.z
      value: 0
      objectReference: {fileID: 0}
    - target: {fileID: 4678676913250523710, guid: 6cbbc06ceb9a9794299a1e06a17c86b2,
        type: 3}
      propertyPath: m_AnchoredPosition.x
      value: 0
      objectReference: {fileID: 0}
    - target: {fileID: 4678676913250523710, guid: 6cbbc06ceb9a9794299a1e06a17c86b2,
        type: 3}
      propertyPath: m_AnchoredPosition.y
      value: 0
      objectReference: {fileID: 0}
    - target: {fileID: 4678676913250523710, guid: 6cbbc06ceb9a9794299a1e06a17c86b2,
        type: 3}
      propertyPath: m_SizeDelta.x
      value: 72
      objectReference: {fileID: 0}
    - target: {fileID: 4678676913250523710, guid: 6cbbc06ceb9a9794299a1e06a17c86b2,
        type: 3}
      propertyPath: m_SizeDelta.y
      value: 72
      objectReference: {fileID: 0}
    - target: {fileID: 4678676913250523710, guid: 6cbbc06ceb9a9794299a1e06a17c86b2,
        type: 3}
      propertyPath: m_AnchorMin.x
      value: 0
      objectReference: {fileID: 0}
    - target: {fileID: 4678676913250523710, guid: 6cbbc06ceb9a9794299a1e06a17c86b2,
        type: 3}
      propertyPath: m_AnchorMin.y
      value: 0
      objectReference: {fileID: 0}
    - target: {fileID: 4678676913250523710, guid: 6cbbc06ceb9a9794299a1e06a17c86b2,
        type: 3}
      propertyPath: m_AnchorMax.x
      value: 0
      objectReference: {fileID: 0}
    - target: {fileID: 4678676913250523710, guid: 6cbbc06ceb9a9794299a1e06a17c86b2,
        type: 3}
      propertyPath: m_AnchorMax.y
      value: 0
      objectReference: {fileID: 0}
    - target: {fileID: 4678676913250523710, guid: 6cbbc06ceb9a9794299a1e06a17c86b2,
        type: 3}
      propertyPath: m_Pivot.x
      value: 0.5
      objectReference: {fileID: 0}
    - target: {fileID: 4678676913250523710, guid: 6cbbc06ceb9a9794299a1e06a17c86b2,
        type: 3}
      propertyPath: m_Pivot.y
      value: 0.5
      objectReference: {fileID: 0}
    - target: {fileID: 7640394630935375313, guid: 6cbbc06ceb9a9794299a1e06a17c86b2,
        type: 3}
      propertyPath: m_OnClick.m_PersistentCalls.m_Calls.Array.size
      value: 0
      objectReference: {fileID: 0}
    - target: {fileID: 7640394630935375313, guid: 6cbbc06ceb9a9794299a1e06a17c86b2,
        type: 3}
      propertyPath: m_OnClick.m_PersistentCalls.m_Calls.Array.data[0].m_Mode
      value: 1
      objectReference: {fileID: 0}
    - target: {fileID: 7640394630935375313, guid: 6cbbc06ceb9a9794299a1e06a17c86b2,
        type: 3}
      propertyPath: m_OnClick.m_PersistentCalls.m_Calls.Array.data[0].m_CallState
      value: 2
      objectReference: {fileID: 0}
    - target: {fileID: 8865474348618771260, guid: 6cbbc06ceb9a9794299a1e06a17c86b2,
        type: 3}
      propertyPath: m_textInfo.characterCount
      value: 4
      objectReference: {fileID: 0}
    - target: {fileID: 8865474348618771260, guid: 6cbbc06ceb9a9794299a1e06a17c86b2,
        type: 3}
      propertyPath: m_textInfo.wordCount
      value: 1
      objectReference: {fileID: 0}
    - target: {fileID: 8865474348618771260, guid: 6cbbc06ceb9a9794299a1e06a17c86b2,
        type: 3}
      propertyPath: m_textInfo.lineCount
      value: 1
      objectReference: {fileID: 0}
    - target: {fileID: 8865474348618771260, guid: 6cbbc06ceb9a9794299a1e06a17c86b2,
        type: 3}
      propertyPath: m_textInfo.pageCount
      value: 1
      objectReference: {fileID: 0}
    - target: {fileID: 8865474348618771260, guid: 6cbbc06ceb9a9794299a1e06a17c86b2,
        type: 3}
      propertyPath: m_text
      value: Auto
      objectReference: {fileID: 0}
    m_RemovedComponents: []
  m_SourcePrefab: {fileID: 100100000, guid: 6cbbc06ceb9a9794299a1e06a17c86b2, type: 3}
--- !u!224 &3409454978577183808 stripped
RectTransform:
  m_CorrespondingSourceObject: {fileID: 4678676913250523710, guid: 6cbbc06ceb9a9794299a1e06a17c86b2,
    type: 3}
  m_PrefabInstance: {fileID: 8051643248463703678}
  m_PrefabAsset: {fileID: 0}
--- !u!1001 &8226252946960468331
PrefabInstance:
  m_ObjectHideFlags: 0
  serializedVersion: 2
  m_Modification:
    m_TransformParent: {fileID: 0}
    m_Modifications:
    - target: {fileID: 2057347383211027327, guid: 32ace6ad35e5f564a94594ebaa4fd3b8,
        type: 3}
      propertyPath: inputAction.actionPath
      value: /actions/NarupaIMD/in/Interact
      objectReference: {fileID: 0}
    - target: {fileID: 2057347383211027327, guid: 32ace6ad35e5f564a94594ebaa4fd3b8,
        type: 3}
      propertyPath: inputSource
      value: 2
      objectReference: {fileID: 0}
    - target: {fileID: 6117009491216474528, guid: 32ace6ad35e5f564a94594ebaa4fd3b8,
        type: 3}
      propertyPath: m_AdditionalShaderChannelsFlag
      value: 25
      objectReference: {fileID: 0}
    - target: {fileID: 6884530326833527367, guid: 32ace6ad35e5f564a94594ebaa4fd3b8,
        type: 3}
      propertyPath: m_Name
      value: Main Menu
      objectReference: {fileID: 0}
    - target: {fileID: 7301280809472655302, guid: 32ace6ad35e5f564a94594ebaa4fd3b8,
        type: 3}
      propertyPath: m_LocalPosition.x
      value: 0
      objectReference: {fileID: 0}
    - target: {fileID: 7301280809472655302, guid: 32ace6ad35e5f564a94594ebaa4fd3b8,
        type: 3}
      propertyPath: m_LocalPosition.y
      value: 0
      objectReference: {fileID: 0}
    - target: {fileID: 7301280809472655302, guid: 32ace6ad35e5f564a94594ebaa4fd3b8,
        type: 3}
      propertyPath: m_LocalPosition.z
      value: 0
      objectReference: {fileID: 0}
    - target: {fileID: 7301280809472655302, guid: 32ace6ad35e5f564a94594ebaa4fd3b8,
        type: 3}
      propertyPath: m_LocalRotation.x
      value: 0
      objectReference: {fileID: 0}
    - target: {fileID: 7301280809472655302, guid: 32ace6ad35e5f564a94594ebaa4fd3b8,
        type: 3}
      propertyPath: m_LocalRotation.y
      value: 0
      objectReference: {fileID: 0}
    - target: {fileID: 7301280809472655302, guid: 32ace6ad35e5f564a94594ebaa4fd3b8,
        type: 3}
      propertyPath: m_LocalRotation.z
      value: 0
      objectReference: {fileID: 0}
    - target: {fileID: 7301280809472655302, guid: 32ace6ad35e5f564a94594ebaa4fd3b8,
        type: 3}
      propertyPath: m_LocalRotation.w
      value: 1
      objectReference: {fileID: 0}
    - target: {fileID: 7301280809472655302, guid: 32ace6ad35e5f564a94594ebaa4fd3b8,
        type: 3}
      propertyPath: m_RootOrder
      value: 0
      objectReference: {fileID: 0}
    - target: {fileID: 7301280809472655302, guid: 32ace6ad35e5f564a94594ebaa4fd3b8,
        type: 3}
      propertyPath: m_LocalEulerAnglesHint.x
      value: 0
      objectReference: {fileID: 0}
    - target: {fileID: 7301280809472655302, guid: 32ace6ad35e5f564a94594ebaa4fd3b8,
        type: 3}
      propertyPath: m_LocalEulerAnglesHint.y
      value: 0
      objectReference: {fileID: 0}
    - target: {fileID: 7301280809472655302, guid: 32ace6ad35e5f564a94594ebaa4fd3b8,
        type: 3}
      propertyPath: m_LocalEulerAnglesHint.z
      value: 0
      objectReference: {fileID: 0}
    - target: {fileID: 7301280809472655302, guid: 32ace6ad35e5f564a94594ebaa4fd3b8,
        type: 3}
      propertyPath: m_AnchoredPosition.x
      value: 0
      objectReference: {fileID: 0}
    - target: {fileID: 7301280809472655302, guid: 32ace6ad35e5f564a94594ebaa4fd3b8,
        type: 3}
      propertyPath: m_AnchoredPosition.y
      value: 0
      objectReference: {fileID: 0}
    - target: {fileID: 7301280809472655302, guid: 32ace6ad35e5f564a94594ebaa4fd3b8,
        type: 3}
      propertyPath: m_SizeDelta.x
      value: 512
      objectReference: {fileID: 0}
    - target: {fileID: 7301280809472655302, guid: 32ace6ad35e5f564a94594ebaa4fd3b8,
        type: 3}
      propertyPath: m_SizeDelta.y
      value: 384
      objectReference: {fileID: 0}
    - target: {fileID: 7301280809472655302, guid: 32ace6ad35e5f564a94594ebaa4fd3b8,
        type: 3}
      propertyPath: m_AnchorMin.x
      value: 0
      objectReference: {fileID: 0}
    - target: {fileID: 7301280809472655302, guid: 32ace6ad35e5f564a94594ebaa4fd3b8,
        type: 3}
      propertyPath: m_AnchorMin.y
      value: 0
      objectReference: {fileID: 0}
    - target: {fileID: 7301280809472655302, guid: 32ace6ad35e5f564a94594ebaa4fd3b8,
        type: 3}
      propertyPath: m_AnchorMax.x
      value: 0
      objectReference: {fileID: 0}
    - target: {fileID: 7301280809472655302, guid: 32ace6ad35e5f564a94594ebaa4fd3b8,
        type: 3}
      propertyPath: m_AnchorMax.y
      value: 0
      objectReference: {fileID: 0}
    - target: {fileID: 7301280809472655302, guid: 32ace6ad35e5f564a94594ebaa4fd3b8,
        type: 3}
      propertyPath: m_Pivot.x
      value: 0.5
      objectReference: {fileID: 0}
    - target: {fileID: 7301280809472655302, guid: 32ace6ad35e5f564a94594ebaa4fd3b8,
        type: 3}
      propertyPath: m_Pivot.y
      value: 0.5
      objectReference: {fileID: 0}
    m_RemovedComponents: []
  m_SourcePrefab: {fileID: 100100000, guid: 32ace6ad35e5f564a94594ebaa4fd3b8, type: 3}
--- !u!224 &1691903542784734893 stripped
RectTransform:
  m_CorrespondingSourceObject: {fileID: 7301280809472655302, guid: 32ace6ad35e5f564a94594ebaa4fd3b8,
    type: 3}
  m_PrefabInstance: {fileID: 8226252946960468331}
  m_PrefabAsset: {fileID: 0}
--- !u!1001 &8452751531967678332
PrefabInstance:
  m_ObjectHideFlags: 0
  serializedVersion: 2
  m_Modification:
    m_TransformParent: {fileID: 1804776832139285656}
    m_Modifications:
    - target: {fileID: 1865149173984279355, guid: 6cbbc06ceb9a9794299a1e06a17c86b2,
        type: 3}
      propertyPath: m_Name
      value: About Button
      objectReference: {fileID: 0}
    - target: {fileID: 3716610539585478986, guid: 6cbbc06ceb9a9794299a1e06a17c86b2,
        type: 3}
      propertyPath: m_AnchorMin.x
      value: 0.5
      objectReference: {fileID: 0}
    - target: {fileID: 3716610539585478986, guid: 6cbbc06ceb9a9794299a1e06a17c86b2,
        type: 3}
      propertyPath: m_AnchorMin.y
      value: 0.5
      objectReference: {fileID: 0}
    - target: {fileID: 3716610539585478986, guid: 6cbbc06ceb9a9794299a1e06a17c86b2,
        type: 3}
      propertyPath: m_AnchorMax.x
      value: 0.5
      objectReference: {fileID: 0}
    - target: {fileID: 3716610539585478986, guid: 6cbbc06ceb9a9794299a1e06a17c86b2,
        type: 3}
      propertyPath: m_AnchorMax.y
      value: 0.5
      objectReference: {fileID: 0}
    - target: {fileID: 3716610539585478986, guid: 6cbbc06ceb9a9794299a1e06a17c86b2,
        type: 3}
      propertyPath: m_AnchoredPosition.y
      value: -48.2
      objectReference: {fileID: 0}
    - target: {fileID: 3716610539585478986, guid: 6cbbc06ceb9a9794299a1e06a17c86b2,
        type: 3}
      propertyPath: m_SizeDelta.x
      value: 128
      objectReference: {fileID: 0}
    - target: {fileID: 3716610539585478986, guid: 6cbbc06ceb9a9794299a1e06a17c86b2,
        type: 3}
      propertyPath: m_SizeDelta.y
      value: 15.999992
      objectReference: {fileID: 0}
    - target: {fileID: 3794691817542679349, guid: 6cbbc06ceb9a9794299a1e06a17c86b2,
        type: 3}
      propertyPath: m_Sprite
      value: 
      objectReference: {fileID: 21300000, guid: 9e158c98232579844b4602878ae2bdcf,
        type: 3}
    - target: {fileID: 4678676913250523710, guid: 6cbbc06ceb9a9794299a1e06a17c86b2,
        type: 3}
      propertyPath: m_LocalPosition.x
      value: 0
      objectReference: {fileID: 0}
    - target: {fileID: 4678676913250523710, guid: 6cbbc06ceb9a9794299a1e06a17c86b2,
        type: 3}
      propertyPath: m_LocalPosition.y
      value: 0
      objectReference: {fileID: 0}
    - target: {fileID: 4678676913250523710, guid: 6cbbc06ceb9a9794299a1e06a17c86b2,
        type: 3}
      propertyPath: m_LocalPosition.z
      value: 0
      objectReference: {fileID: 0}
    - target: {fileID: 4678676913250523710, guid: 6cbbc06ceb9a9794299a1e06a17c86b2,
        type: 3}
      propertyPath: m_LocalRotation.x
      value: -0
      objectReference: {fileID: 0}
    - target: {fileID: 4678676913250523710, guid: 6cbbc06ceb9a9794299a1e06a17c86b2,
        type: 3}
      propertyPath: m_LocalRotation.y
      value: -0
      objectReference: {fileID: 0}
    - target: {fileID: 4678676913250523710, guid: 6cbbc06ceb9a9794299a1e06a17c86b2,
        type: 3}
      propertyPath: m_LocalRotation.z
      value: -0
      objectReference: {fileID: 0}
    - target: {fileID: 4678676913250523710, guid: 6cbbc06ceb9a9794299a1e06a17c86b2,
        type: 3}
      propertyPath: m_LocalRotation.w
      value: 1
      objectReference: {fileID: 0}
    - target: {fileID: 4678676913250523710, guid: 6cbbc06ceb9a9794299a1e06a17c86b2,
        type: 3}
      propertyPath: m_RootOrder
      value: 2
      objectReference: {fileID: 0}
    - target: {fileID: 4678676913250523710, guid: 6cbbc06ceb9a9794299a1e06a17c86b2,
        type: 3}
      propertyPath: m_LocalEulerAnglesHint.x
      value: 0
      objectReference: {fileID: 0}
    - target: {fileID: 4678676913250523710, guid: 6cbbc06ceb9a9794299a1e06a17c86b2,
        type: 3}
      propertyPath: m_LocalEulerAnglesHint.y
      value: 0
      objectReference: {fileID: 0}
    - target: {fileID: 4678676913250523710, guid: 6cbbc06ceb9a9794299a1e06a17c86b2,
        type: 3}
      propertyPath: m_LocalEulerAnglesHint.z
      value: 0
      objectReference: {fileID: 0}
    - target: {fileID: 4678676913250523710, guid: 6cbbc06ceb9a9794299a1e06a17c86b2,
        type: 3}
      propertyPath: m_AnchoredPosition.x
      value: 0
      objectReference: {fileID: 0}
    - target: {fileID: 4678676913250523710, guid: 6cbbc06ceb9a9794299a1e06a17c86b2,
        type: 3}
      propertyPath: m_AnchoredPosition.y
      value: 0
      objectReference: {fileID: 0}
    - target: {fileID: 4678676913250523710, guid: 6cbbc06ceb9a9794299a1e06a17c86b2,
        type: 3}
      propertyPath: m_SizeDelta.x
      value: 64
      objectReference: {fileID: 0}
    - target: {fileID: 4678676913250523710, guid: 6cbbc06ceb9a9794299a1e06a17c86b2,
        type: 3}
      propertyPath: m_SizeDelta.y
      value: 64
      objectReference: {fileID: 0}
    - target: {fileID: 4678676913250523710, guid: 6cbbc06ceb9a9794299a1e06a17c86b2,
        type: 3}
      propertyPath: m_AnchorMin.x
      value: 0
      objectReference: {fileID: 0}
    - target: {fileID: 4678676913250523710, guid: 6cbbc06ceb9a9794299a1e06a17c86b2,
        type: 3}
      propertyPath: m_AnchorMin.y
      value: 0
      objectReference: {fileID: 0}
    - target: {fileID: 4678676913250523710, guid: 6cbbc06ceb9a9794299a1e06a17c86b2,
        type: 3}
      propertyPath: m_AnchorMax.x
      value: 0
      objectReference: {fileID: 0}
    - target: {fileID: 4678676913250523710, guid: 6cbbc06ceb9a9794299a1e06a17c86b2,
        type: 3}
      propertyPath: m_AnchorMax.y
      value: 0
      objectReference: {fileID: 0}
    - target: {fileID: 4678676913250523710, guid: 6cbbc06ceb9a9794299a1e06a17c86b2,
        type: 3}
      propertyPath: m_Pivot.x
      value: 0.5
      objectReference: {fileID: 0}
    - target: {fileID: 4678676913250523710, guid: 6cbbc06ceb9a9794299a1e06a17c86b2,
        type: 3}
      propertyPath: m_Pivot.y
      value: 0.5
      objectReference: {fileID: 0}
    - target: {fileID: 8865474348618771260, guid: 6cbbc06ceb9a9794299a1e06a17c86b2,
        type: 3}
      propertyPath: m_textInfo.characterCount
      value: 5
      objectReference: {fileID: 0}
    - target: {fileID: 8865474348618771260, guid: 6cbbc06ceb9a9794299a1e06a17c86b2,
        type: 3}
      propertyPath: m_textInfo.wordCount
      value: 1
      objectReference: {fileID: 0}
    - target: {fileID: 8865474348618771260, guid: 6cbbc06ceb9a9794299a1e06a17c86b2,
        type: 3}
      propertyPath: m_textInfo.lineCount
      value: 1
      objectReference: {fileID: 0}
    - target: {fileID: 8865474348618771260, guid: 6cbbc06ceb9a9794299a1e06a17c86b2,
        type: 3}
      propertyPath: m_textInfo.pageCount
      value: 1
      objectReference: {fileID: 0}
    - target: {fileID: 8865474348618771260, guid: 6cbbc06ceb9a9794299a1e06a17c86b2,
        type: 3}
      propertyPath: m_text
      value: About
      objectReference: {fileID: 0}
    - target: {fileID: 8865474348618771260, guid: 6cbbc06ceb9a9794299a1e06a17c86b2,
        type: 3}
      propertyPath: m_textInfo.spaceCount
      value: 0
      objectReference: {fileID: 0}
    - target: {fileID: 8865474348618771260, guid: 6cbbc06ceb9a9794299a1e06a17c86b2,
        type: 3}
      propertyPath: m_enableAutoSizing
      value: 0
      objectReference: {fileID: 0}
    - target: {fileID: 8865474348618771260, guid: 6cbbc06ceb9a9794299a1e06a17c86b2,
        type: 3}
      propertyPath: m_fontSize
      value: 20
      objectReference: {fileID: 0}
    - target: {fileID: 8865474348618771260, guid: 6cbbc06ceb9a9794299a1e06a17c86b2,
        type: 3}
      propertyPath: m_firstOverflowCharacterIndex
      value: 0
      objectReference: {fileID: 0}
    - target: {fileID: 8865474348618771260, guid: 6cbbc06ceb9a9794299a1e06a17c86b2,
        type: 3}
      propertyPath: m_fontSizeMin
      value: 12
      objectReference: {fileID: 0}
    - target: {fileID: 8865474348618771260, guid: 6cbbc06ceb9a9794299a1e06a17c86b2,
        type: 3}
      propertyPath: m_fontSizeBase
      value: 20
      objectReference: {fileID: 0}
    m_RemovedComponents: []
  m_SourcePrefab: {fileID: 100100000, guid: 6cbbc06ceb9a9794299a1e06a17c86b2, type: 3}
--- !u!224 &3865156548398210370 stripped
RectTransform:
  m_CorrespondingSourceObject: {fileID: 4678676913250523710, guid: 6cbbc06ceb9a9794299a1e06a17c86b2,
    type: 3}
  m_PrefabInstance: {fileID: 8452751531967678332}
  m_PrefabAsset: {fileID: 0}
--- !u!1001 &8739854950771511338
PrefabInstance:
  m_ObjectHideFlags: 0
  serializedVersion: 2
  m_Modification:
    m_TransformParent: {fileID: 1060773542299304799}
    m_Modifications:
    - target: {fileID: 1865149173984279355, guid: 6cbbc06ceb9a9794299a1e06a17c86b2,
        type: 3}
      propertyPath: m_Name
      value: Discover Server Button
      objectReference: {fileID: 0}
    - target: {fileID: 3794691817542679349, guid: 6cbbc06ceb9a9794299a1e06a17c86b2,
        type: 3}
      propertyPath: m_Sprite
      value: 
      objectReference: {fileID: 21300000, guid: abea2a2d310bc274ca4f4647e1b98146,
        type: 3}
    - target: {fileID: 4678676913250523710, guid: 6cbbc06ceb9a9794299a1e06a17c86b2,
        type: 3}
      propertyPath: m_LocalPosition.x
      value: 0
      objectReference: {fileID: 0}
    - target: {fileID: 4678676913250523710, guid: 6cbbc06ceb9a9794299a1e06a17c86b2,
        type: 3}
      propertyPath: m_LocalPosition.y
      value: 0
      objectReference: {fileID: 0}
    - target: {fileID: 4678676913250523710, guid: 6cbbc06ceb9a9794299a1e06a17c86b2,
        type: 3}
      propertyPath: m_LocalPosition.z
      value: 0
      objectReference: {fileID: 0}
    - target: {fileID: 4678676913250523710, guid: 6cbbc06ceb9a9794299a1e06a17c86b2,
        type: 3}
      propertyPath: m_LocalRotation.x
      value: -0
      objectReference: {fileID: 0}
    - target: {fileID: 4678676913250523710, guid: 6cbbc06ceb9a9794299a1e06a17c86b2,
        type: 3}
      propertyPath: m_LocalRotation.y
      value: -0
      objectReference: {fileID: 0}
    - target: {fileID: 4678676913250523710, guid: 6cbbc06ceb9a9794299a1e06a17c86b2,
        type: 3}
      propertyPath: m_LocalRotation.z
      value: -0
      objectReference: {fileID: 0}
    - target: {fileID: 4678676913250523710, guid: 6cbbc06ceb9a9794299a1e06a17c86b2,
        type: 3}
      propertyPath: m_LocalRotation.w
      value: 1
      objectReference: {fileID: 0}
    - target: {fileID: 4678676913250523710, guid: 6cbbc06ceb9a9794299a1e06a17c86b2,
        type: 3}
      propertyPath: m_RootOrder
      value: 1
      objectReference: {fileID: 0}
    - target: {fileID: 4678676913250523710, guid: 6cbbc06ceb9a9794299a1e06a17c86b2,
        type: 3}
      propertyPath: m_LocalEulerAnglesHint.x
      value: 0
      objectReference: {fileID: 0}
    - target: {fileID: 4678676913250523710, guid: 6cbbc06ceb9a9794299a1e06a17c86b2,
        type: 3}
      propertyPath: m_LocalEulerAnglesHint.y
      value: 0
      objectReference: {fileID: 0}
    - target: {fileID: 4678676913250523710, guid: 6cbbc06ceb9a9794299a1e06a17c86b2,
        type: 3}
      propertyPath: m_LocalEulerAnglesHint.z
      value: 0
      objectReference: {fileID: 0}
    - target: {fileID: 4678676913250523710, guid: 6cbbc06ceb9a9794299a1e06a17c86b2,
        type: 3}
      propertyPath: m_AnchoredPosition.x
      value: 0
      objectReference: {fileID: 0}
    - target: {fileID: 4678676913250523710, guid: 6cbbc06ceb9a9794299a1e06a17c86b2,
        type: 3}
      propertyPath: m_AnchoredPosition.y
      value: 0
      objectReference: {fileID: 0}
    - target: {fileID: 4678676913250523710, guid: 6cbbc06ceb9a9794299a1e06a17c86b2,
        type: 3}
      propertyPath: m_SizeDelta.x
      value: 72
      objectReference: {fileID: 0}
    - target: {fileID: 4678676913250523710, guid: 6cbbc06ceb9a9794299a1e06a17c86b2,
        type: 3}
      propertyPath: m_SizeDelta.y
      value: 72
      objectReference: {fileID: 0}
    - target: {fileID: 4678676913250523710, guid: 6cbbc06ceb9a9794299a1e06a17c86b2,
        type: 3}
      propertyPath: m_AnchorMin.x
      value: 0
      objectReference: {fileID: 0}
    - target: {fileID: 4678676913250523710, guid: 6cbbc06ceb9a9794299a1e06a17c86b2,
        type: 3}
      propertyPath: m_AnchorMin.y
      value: 0
      objectReference: {fileID: 0}
    - target: {fileID: 4678676913250523710, guid: 6cbbc06ceb9a9794299a1e06a17c86b2,
        type: 3}
      propertyPath: m_AnchorMax.x
      value: 0
      objectReference: {fileID: 0}
    - target: {fileID: 4678676913250523710, guid: 6cbbc06ceb9a9794299a1e06a17c86b2,
        type: 3}
      propertyPath: m_AnchorMax.y
      value: 0
      objectReference: {fileID: 0}
    - target: {fileID: 4678676913250523710, guid: 6cbbc06ceb9a9794299a1e06a17c86b2,
        type: 3}
      propertyPath: m_Pivot.x
      value: 0.5
      objectReference: {fileID: 0}
    - target: {fileID: 4678676913250523710, guid: 6cbbc06ceb9a9794299a1e06a17c86b2,
        type: 3}
      propertyPath: m_Pivot.y
      value: 0.5
      objectReference: {fileID: 0}
    - target: {fileID: 8865474348618771260, guid: 6cbbc06ceb9a9794299a1e06a17c86b2,
        type: 3}
      propertyPath: m_textInfo.characterCount
      value: 8
      objectReference: {fileID: 0}
    - target: {fileID: 8865474348618771260, guid: 6cbbc06ceb9a9794299a1e06a17c86b2,
        type: 3}
      propertyPath: m_textInfo.wordCount
      value: 1
      objectReference: {fileID: 0}
    - target: {fileID: 8865474348618771260, guid: 6cbbc06ceb9a9794299a1e06a17c86b2,
        type: 3}
      propertyPath: m_textInfo.lineCount
      value: 1
      objectReference: {fileID: 0}
    - target: {fileID: 8865474348618771260, guid: 6cbbc06ceb9a9794299a1e06a17c86b2,
        type: 3}
      propertyPath: m_textInfo.pageCount
      value: 1
      objectReference: {fileID: 0}
    - target: {fileID: 8865474348618771260, guid: 6cbbc06ceb9a9794299a1e06a17c86b2,
        type: 3}
      propertyPath: m_text
      value: Discover
      objectReference: {fileID: 0}
    m_RemovedComponents: []
  m_SourcePrefab: {fileID: 100100000, guid: 6cbbc06ceb9a9794299a1e06a17c86b2, type: 3}
--- !u!224 &4154513587008866836 stripped
RectTransform:
  m_CorrespondingSourceObject: {fileID: 4678676913250523710, guid: 6cbbc06ceb9a9794299a1e06a17c86b2,
    type: 3}
  m_PrefabInstance: {fileID: 8739854950771511338}
  m_PrefabAsset: {fileID: 0}
--- !u!1001 &8863165906745451665
PrefabInstance:
  m_ObjectHideFlags: 0
  serializedVersion: 2
  m_Modification:
    m_TransformParent: {fileID: 1804776832139285656}
    m_Modifications:
    - target: {fileID: 2995849000346883717, guid: 035816e598fb6c741a93868e818b71da,
        type: 3}
      propertyPath: m_LocalPosition.x
      value: 0
      objectReference: {fileID: 0}
    - target: {fileID: 2995849000346883717, guid: 035816e598fb6c741a93868e818b71da,
        type: 3}
      propertyPath: m_LocalPosition.y
      value: 0
      objectReference: {fileID: 0}
    - target: {fileID: 2995849000346883717, guid: 035816e598fb6c741a93868e818b71da,
        type: 3}
      propertyPath: m_LocalPosition.z
      value: 0
      objectReference: {fileID: 0}
    - target: {fileID: 2995849000346883717, guid: 035816e598fb6c741a93868e818b71da,
        type: 3}
      propertyPath: m_LocalRotation.x
      value: 0
      objectReference: {fileID: 0}
    - target: {fileID: 2995849000346883717, guid: 035816e598fb6c741a93868e818b71da,
        type: 3}
      propertyPath: m_LocalRotation.y
      value: 0
      objectReference: {fileID: 0}
    - target: {fileID: 2995849000346883717, guid: 035816e598fb6c741a93868e818b71da,
        type: 3}
      propertyPath: m_LocalRotation.z
      value: 0
      objectReference: {fileID: 0}
    - target: {fileID: 2995849000346883717, guid: 035816e598fb6c741a93868e818b71da,
        type: 3}
      propertyPath: m_LocalRotation.w
      value: 1
      objectReference: {fileID: 0}
    - target: {fileID: 2995849000346883717, guid: 035816e598fb6c741a93868e818b71da,
        type: 3}
      propertyPath: m_RootOrder
      value: 1
      objectReference: {fileID: 0}
    - target: {fileID: 2995849000346883717, guid: 035816e598fb6c741a93868e818b71da,
        type: 3}
      propertyPath: m_LocalEulerAnglesHint.x
      value: 0
      objectReference: {fileID: 0}
    - target: {fileID: 2995849000346883717, guid: 035816e598fb6c741a93868e818b71da,
        type: 3}
      propertyPath: m_LocalEulerAnglesHint.y
      value: 0
      objectReference: {fileID: 0}
    - target: {fileID: 2995849000346883717, guid: 035816e598fb6c741a93868e818b71da,
        type: 3}
      propertyPath: m_LocalEulerAnglesHint.z
      value: 0
      objectReference: {fileID: 0}
    - target: {fileID: 2995849000346883717, guid: 035816e598fb6c741a93868e818b71da,
        type: 3}
      propertyPath: m_AnchoredPosition.x
      value: 0
      objectReference: {fileID: 0}
    - target: {fileID: 2995849000346883717, guid: 035816e598fb6c741a93868e818b71da,
        type: 3}
      propertyPath: m_AnchoredPosition.y
      value: 0
      objectReference: {fileID: 0}
    - target: {fileID: 2995849000346883717, guid: 035816e598fb6c741a93868e818b71da,
        type: 3}
      propertyPath: m_AnchorMin.x
      value: 0
      objectReference: {fileID: 0}
    - target: {fileID: 2995849000346883717, guid: 035816e598fb6c741a93868e818b71da,
        type: 3}
      propertyPath: m_AnchorMin.y
      value: 0
      objectReference: {fileID: 0}
    - target: {fileID: 2995849000346883717, guid: 035816e598fb6c741a93868e818b71da,
        type: 3}
      propertyPath: m_AnchorMax.x
      value: 0
      objectReference: {fileID: 0}
    - target: {fileID: 2995849000346883717, guid: 035816e598fb6c741a93868e818b71da,
        type: 3}
      propertyPath: m_AnchorMax.y
      value: 0
      objectReference: {fileID: 0}
    - target: {fileID: 2995849000346883717, guid: 035816e598fb6c741a93868e818b71da,
        type: 3}
      propertyPath: m_Pivot.x
      value: 0.5
      objectReference: {fileID: 0}
    - target: {fileID: 2995849000346883717, guid: 035816e598fb6c741a93868e818b71da,
        type: 3}
      propertyPath: m_Pivot.y
      value: 0.5
      objectReference: {fileID: 0}
    - target: {fileID: 5445117640613744940, guid: 035816e598fb6c741a93868e818b71da,
        type: 3}
      propertyPath: m_Name
      value: User Color Picker
      objectReference: {fileID: 0}
    m_RemovedComponents: []
  m_SourcePrefab: {fileID: 100100000, guid: 035816e598fb6c741a93868e818b71da, type: 3}
--- !u!224 &5950150822825882132 stripped
RectTransform:
  m_CorrespondingSourceObject: {fileID: 2995849000346883717, guid: 035816e598fb6c741a93868e818b71da,
    type: 3}
  m_PrefabInstance: {fileID: 8863165906745451665}
  m_PrefabAsset: {fileID: 0}
