%YAML 1.1
%TAG !u! tag:unity3d.com,2011:
--- !u!1 &1129414697988583687
GameObject:
  m_ObjectHideFlags: 0
  m_CorrespondingSourceObject: {fileID: 0}
  m_PrefabInstance: {fileID: 0}
  m_PrefabAsset: {fileID: 0}
  serializedVersion: 6
  m_Component:
  - component: {fileID: 8037060560292551138}
  - component: {fileID: 4228702584605748739}
  - component: {fileID: 4458682778785097482}
  m_Layer: 5
  m_Name: Color
  m_TagString: Untagged
  m_Icon: {fileID: 0}
  m_NavMeshLayer: 0
  m_StaticEditorFlags: 0
  m_IsActive: 1
--- !u!224 &8037060560292551138
RectTransform:
  m_ObjectHideFlags: 0
  m_CorrespondingSourceObject: {fileID: 0}
  m_PrefabInstance: {fileID: 0}
  m_PrefabAsset: {fileID: 0}
  m_GameObject: {fileID: 1129414697988583687}
  m_LocalRotation: {x: -0, y: -0, z: -0, w: 1}
  m_LocalPosition: {x: 0, y: 0, z: -2}
  m_LocalScale: {x: 1, y: 1, z: 1}
  m_Children: []
  m_Father: {fileID: 1727303414529123165}
  m_RootOrder: 0
  m_LocalEulerAnglesHint: {x: 0, y: 0, z: 0}
  m_AnchorMin: {x: 0, y: 0}
  m_AnchorMax: {x: 1, y: 1}
  m_AnchoredPosition: {x: 0, y: 0}
  m_SizeDelta: {x: -4, y: -4}
  m_Pivot: {x: 0.5, y: 0.5}
--- !u!222 &4228702584605748739
CanvasRenderer:
  m_ObjectHideFlags: 0
  m_CorrespondingSourceObject: {fileID: 0}
  m_PrefabInstance: {fileID: 0}
  m_PrefabAsset: {fileID: 0}
  m_GameObject: {fileID: 1129414697988583687}
  m_CullTransparentMesh: 0
--- !u!114 &4458682778785097482
MonoBehaviour:
  m_ObjectHideFlags: 0
  m_CorrespondingSourceObject: {fileID: 0}
  m_PrefabInstance: {fileID: 0}
  m_PrefabAsset: {fileID: 0}
  m_GameObject: {fileID: 1129414697988583687}
  m_Enabled: 1
  m_EditorHideFlags: 0
  m_Script: {fileID: 11500000, guid: fe87c0e1cc204ed48ad3b37840f39efc, type: 3}
  m_Name: 
  m_EditorClassIdentifier: 
  m_Material: {fileID: 0}
  m_Color: {r: 1, g: 0.7607844, b: 0.050980397, a: 1}
  m_RaycastTarget: 0
  m_OnCullStateChanged:
    m_PersistentCalls:
      m_Calls: []
  m_Sprite: {fileID: 21300000, guid: bb08bd65f2dfbb54e99db59bd3f0bdb6, type: 3}
  m_Type: 0
  m_PreserveAspect: 0
  m_FillCenter: 1
  m_FillMethod: 4
  m_FillAmount: 1
  m_FillClockwise: 1
  m_FillOrigin: 0
  m_UseSpriteMesh: 0
  m_PixelsPerUnitMultiplier: 1
--- !u!1 &1573416025940063560
GameObject:
  m_ObjectHideFlags: 0
  m_CorrespondingSourceObject: {fileID: 0}
  m_PrefabInstance: {fileID: 0}
  m_PrefabAsset: {fileID: 0}
  serializedVersion: 6
  m_Component:
  - component: {fileID: 958408994768168736}
  m_Layer: 0
  m_Name: GameObject (2)
  m_TagString: Untagged
  m_Icon: {fileID: 0}
  m_NavMeshLayer: 0
  m_StaticEditorFlags: 0
  m_IsActive: 1
--- !u!224 &958408994768168736
RectTransform:
  m_ObjectHideFlags: 0
  m_CorrespondingSourceObject: {fileID: 0}
  m_PrefabInstance: {fileID: 0}
  m_PrefabAsset: {fileID: 0}
  m_GameObject: {fileID: 1573416025940063560}
  m_LocalRotation: {x: 0, y: 0, z: 0, w: 1}
  m_LocalPosition: {x: 0, y: 0, z: 0}
  m_LocalScale: {x: 1, y: 1, z: 1}
  m_Children: []
  m_Father: {fileID: 8160197654570126340}
  m_RootOrder: 8
  m_LocalEulerAnglesHint: {x: 0, y: 0, z: 0}
  m_AnchorMin: {x: 0, y: 1}
  m_AnchorMax: {x: 0, y: 1}
  m_AnchoredPosition: {x: 103, y: -61}
  m_SizeDelta: {x: 38, y: 38}
  m_Pivot: {x: 0.5, y: 0.5}
--- !u!1 &1761311291106321210
GameObject:
  m_ObjectHideFlags: 0
  m_CorrespondingSourceObject: {fileID: 0}
  m_PrefabInstance: {fileID: 0}
  m_PrefabAsset: {fileID: 0}
  serializedVersion: 6
  m_Component:
  - component: {fileID: 9223347565419256390}
  m_Layer: 0
  m_Name: GameObject (3)
  m_TagString: Untagged
  m_Icon: {fileID: 0}
  m_NavMeshLayer: 0
  m_StaticEditorFlags: 0
  m_IsActive: 1
--- !u!224 &9223347565419256390
RectTransform:
  m_ObjectHideFlags: 0
  m_CorrespondingSourceObject: {fileID: 0}
  m_PrefabInstance: {fileID: 0}
  m_PrefabAsset: {fileID: 0}
  m_GameObject: {fileID: 1761311291106321210}
  m_LocalRotation: {x: 0, y: 0, z: 0, w: 1}
  m_LocalPosition: {x: 0, y: 0, z: 0}
  m_LocalScale: {x: 1, y: 1, z: 1}
  m_Children: []
  m_Father: {fileID: 8160197654570126340}
  m_RootOrder: 9
  m_LocalEulerAnglesHint: {x: 0, y: 0, z: 0}
  m_AnchorMin: {x: 0, y: 1}
  m_AnchorMax: {x: 0, y: 1}
  m_AnchoredPosition: {x: 145, y: -61}
  m_SizeDelta: {x: 38, y: 38}
  m_Pivot: {x: 0.5, y: 0.5}
--- !u!1 &1956543127725529951
GameObject:
  m_ObjectHideFlags: 0
  m_CorrespondingSourceObject: {fileID: 0}
  m_PrefabInstance: {fileID: 0}
  m_PrefabAsset: {fileID: 0}
  serializedVersion: 6
  m_Component:
  - component: {fileID: 8160197654570126340}
  m_Layer: 0
  m_Name: Presets
  m_TagString: Untagged
  m_Icon: {fileID: 0}
  m_NavMeshLayer: 0
  m_StaticEditorFlags: 0
  m_IsActive: 1
--- !u!224 &8160197654570126340
RectTransform:
  m_ObjectHideFlags: 0
  m_CorrespondingSourceObject: {fileID: 0}
  m_PrefabInstance: {fileID: 0}
  m_PrefabAsset: {fileID: 0}
  m_GameObject: {fileID: 1956543127725529951}
  m_LocalRotation: {x: 0, y: 0, z: 0, w: 1}
  m_LocalPosition: {x: 0, y: 0, z: 0}
  m_LocalScale: {x: 1, y: 1, z: 1}
  m_Children:
  - {fileID: 3709809782797785533}
  - {fileID: 89666217726731734}
  - {fileID: 7785298340389736428}
  - {fileID: 4383772960686386809}
  - {fileID: 399394588149125925}
  - {fileID: 9031673357204125897}
  - {fileID: 6386578135435760435}
  - {fileID: 3001637324152063339}
  - {fileID: 958408994768168736}
  - {fileID: 9223347565419256390}
  - {fileID: 3999779226357308437}
  - {fileID: 8303937342397655978}
  m_Father: {fileID: 2995849000346883717}
  m_RootOrder: 2
  m_LocalEulerAnglesHint: {x: 0, y: 0, z: 0}
  m_AnchorMin: {x: 0, y: 0}
  m_AnchorMax: {x: 1, y: 1}
  m_AnchoredPosition: {x: 0, y: 0}
  m_SizeDelta: {x: 0, y: 0}
  m_Pivot: {x: 0.5, y: 0.5}
--- !u!1 &2319356458869574522
GameObject:
  m_ObjectHideFlags: 0
  m_CorrespondingSourceObject: {fileID: 0}
  m_PrefabInstance: {fileID: 0}
  m_PrefabAsset: {fileID: 0}
  serializedVersion: 6
  m_Component:
  - component: {fileID: 6049404988517668797}
  - component: {fileID: 1373942017706891263}
  - component: {fileID: 2177215401253471771}
  m_Layer: 5
  m_Name: Color
  m_TagString: Untagged
  m_Icon: {fileID: 0}
  m_NavMeshLayer: 0
  m_StaticEditorFlags: 0
  m_IsActive: 1
--- !u!224 &6049404988517668797
RectTransform:
  m_ObjectHideFlags: 0
  m_CorrespondingSourceObject: {fileID: 0}
  m_PrefabInstance: {fileID: 0}
  m_PrefabAsset: {fileID: 0}
  m_GameObject: {fileID: 2319356458869574522}
  m_LocalRotation: {x: -0, y: -0, z: -0, w: 1}
  m_LocalPosition: {x: 0, y: 0, z: -2}
  m_LocalScale: {x: 1, y: 1, z: 1}
  m_Children: []
  m_Father: {fileID: 5391896122801824587}
  m_RootOrder: 0
  m_LocalEulerAnglesHint: {x: 0, y: 0, z: 0}
  m_AnchorMin: {x: 0, y: 0}
  m_AnchorMax: {x: 1, y: 1}
  m_AnchoredPosition: {x: 0, y: 0}
  m_SizeDelta: {x: -4, y: -4}
  m_Pivot: {x: 0.5, y: 0.5}
--- !u!222 &1373942017706891263
CanvasRenderer:
  m_ObjectHideFlags: 0
  m_CorrespondingSourceObject: {fileID: 0}
  m_PrefabInstance: {fileID: 0}
  m_PrefabAsset: {fileID: 0}
  m_GameObject: {fileID: 2319356458869574522}
  m_CullTransparentMesh: 0
--- !u!114 &2177215401253471771
MonoBehaviour:
  m_ObjectHideFlags: 0
  m_CorrespondingSourceObject: {fileID: 0}
  m_PrefabInstance: {fileID: 0}
  m_PrefabAsset: {fileID: 0}
  m_GameObject: {fileID: 2319356458869574522}
  m_Enabled: 1
  m_EditorHideFlags: 0
  m_Script: {fileID: 11500000, guid: fe87c0e1cc204ed48ad3b37840f39efc, type: 3}
  m_Name: 
  m_EditorClassIdentifier: 
  m_Material: {fileID: 0}
  m_Color: {r: 0.9176471, g: 0, b: 0.28627452, a: 1}
  m_RaycastTarget: 0
  m_OnCullStateChanged:
    m_PersistentCalls:
      m_Calls: []
  m_Sprite: {fileID: 21300000, guid: bb08bd65f2dfbb54e99db59bd3f0bdb6, type: 3}
  m_Type: 0
  m_PreserveAspect: 0
  m_FillCenter: 1
  m_FillMethod: 4
  m_FillAmount: 1
  m_FillClockwise: 1
  m_FillOrigin: 0
  m_UseSpriteMesh: 0
  m_PixelsPerUnitMultiplier: 1
--- !u!1 &3593460148575468328
GameObject:
  m_ObjectHideFlags: 0
  m_CorrespondingSourceObject: {fileID: 0}
  m_PrefabInstance: {fileID: 0}
  m_PrefabAsset: {fileID: 0}
  serializedVersion: 6
  m_Component:
  - component: {fileID: 6797599934917989471}
  - component: {fileID: 7196181939498896304}
  - component: {fileID: 2532149028190882743}
  m_Layer: 5
  m_Name: Color
  m_TagString: Untagged
  m_Icon: {fileID: 0}
  m_NavMeshLayer: 0
  m_StaticEditorFlags: 0
  m_IsActive: 1
--- !u!224 &6797599934917989471
RectTransform:
  m_ObjectHideFlags: 0
  m_CorrespondingSourceObject: {fileID: 0}
  m_PrefabInstance: {fileID: 0}
  m_PrefabAsset: {fileID: 0}
  m_GameObject: {fileID: 3593460148575468328}
  m_LocalRotation: {x: -0, y: -0, z: -0, w: 1}
  m_LocalPosition: {x: 0, y: 0, z: -2}
  m_LocalScale: {x: 1, y: 1, z: 1}
  m_Children: []
  m_Father: {fileID: 8708591363337006203}
  m_RootOrder: 0
  m_LocalEulerAnglesHint: {x: 0, y: 0, z: 0}
  m_AnchorMin: {x: 0, y: 0}
  m_AnchorMax: {x: 1, y: 1}
  m_AnchoredPosition: {x: 0, y: 0}
  m_SizeDelta: {x: -4, y: -4}
  m_Pivot: {x: 0.5, y: 0.5}
--- !u!222 &7196181939498896304
CanvasRenderer:
  m_ObjectHideFlags: 0
  m_CorrespondingSourceObject: {fileID: 0}
  m_PrefabInstance: {fileID: 0}
  m_PrefabAsset: {fileID: 0}
  m_GameObject: {fileID: 3593460148575468328}
  m_CullTransparentMesh: 0
--- !u!114 &2532149028190882743
MonoBehaviour:
  m_ObjectHideFlags: 0
  m_CorrespondingSourceObject: {fileID: 0}
  m_PrefabInstance: {fileID: 0}
  m_PrefabAsset: {fileID: 0}
  m_GameObject: {fileID: 3593460148575468328}
  m_Enabled: 1
  m_EditorHideFlags: 0
  m_Script: {fileID: 11500000, guid: fe87c0e1cc204ed48ad3b37840f39efc, type: 3}
  m_Name: 
  m_EditorClassIdentifier: 
  m_Material: {fileID: 0}
  m_Color: {r: 0.75294125, g: 0.2509804, b: 0.8980393, a: 1}
  m_RaycastTarget: 0
  m_OnCullStateChanged:
    m_PersistentCalls:
      m_Calls: []
  m_Sprite: {fileID: 21300000, guid: bb08bd65f2dfbb54e99db59bd3f0bdb6, type: 3}
  m_Type: 0
  m_PreserveAspect: 0
  m_FillCenter: 1
  m_FillMethod: 4
  m_FillAmount: 1
  m_FillClockwise: 1
  m_FillOrigin: 0
  m_UseSpriteMesh: 0
  m_PixelsPerUnitMultiplier: 1
--- !u!1 &4293317111901686333
GameObject:
  m_ObjectHideFlags: 0
  m_CorrespondingSourceObject: {fileID: 0}
  m_PrefabInstance: {fileID: 0}
  m_PrefabAsset: {fileID: 0}
  serializedVersion: 6
  m_Component:
  - component: {fileID: 7785298340389736428}
  m_Layer: 0
  m_Name: GameObject
  m_TagString: Untagged
  m_Icon: {fileID: 0}
  m_NavMeshLayer: 0
  m_StaticEditorFlags: 0
  m_IsActive: 1
--- !u!224 &7785298340389736428
RectTransform:
  m_ObjectHideFlags: 0
  m_CorrespondingSourceObject: {fileID: 0}
  m_PrefabInstance: {fileID: 0}
  m_PrefabAsset: {fileID: 0}
  m_GameObject: {fileID: 4293317111901686333}
  m_LocalRotation: {x: 0, y: 0, z: 0, w: 1}
  m_LocalPosition: {x: 0, y: 0, z: 0}
  m_LocalScale: {x: 1, y: 1, z: 1}
  m_Children: []
  m_Father: {fileID: 8160197654570126340}
  m_RootOrder: 2
  m_LocalEulerAnglesHint: {x: 0, y: 0, z: 0}
  m_AnchorMin: {x: 0, y: 1}
  m_AnchorMax: {x: 0, y: 1}
  m_AnchoredPosition: {x: 103, y: -19}
  m_SizeDelta: {x: 38, y: 38}
  m_Pivot: {x: 0.5, y: 0.5}
--- !u!1 &5071171148919026052
GameObject:
  m_ObjectHideFlags: 0
  m_CorrespondingSourceObject: {fileID: 0}
  m_PrefabInstance: {fileID: 0}
  m_PrefabAsset: {fileID: 0}
  serializedVersion: 6
  m_Component:
  - component: {fileID: 5458246150765088110}
  - component: {fileID: 4972004778476047925}
  - component: {fileID: 7294478615286633491}
  m_Layer: 5
  m_Name: Color
  m_TagString: Untagged
  m_Icon: {fileID: 0}
  m_NavMeshLayer: 0
  m_StaticEditorFlags: 0
  m_IsActive: 1
--- !u!224 &5458246150765088110
RectTransform:
  m_ObjectHideFlags: 0
  m_CorrespondingSourceObject: {fileID: 0}
  m_PrefabInstance: {fileID: 0}
  m_PrefabAsset: {fileID: 0}
  m_GameObject: {fileID: 5071171148919026052}
  m_LocalRotation: {x: -0, y: -0, z: -0, w: 1}
  m_LocalPosition: {x: 0, y: 0, z: -2}
  m_LocalScale: {x: 1, y: 1, z: 1}
  m_Children: []
  m_Father: {fileID: 3607313649120430247}
  m_RootOrder: 0
  m_LocalEulerAnglesHint: {x: 0, y: 0, z: 0}
  m_AnchorMin: {x: 0, y: 0}
  m_AnchorMax: {x: 1, y: 1}
  m_AnchoredPosition: {x: 0, y: 0}
  m_SizeDelta: {x: -4, y: -4}
  m_Pivot: {x: 0.5, y: 0.5}
--- !u!222 &4972004778476047925
CanvasRenderer:
  m_ObjectHideFlags: 0
  m_CorrespondingSourceObject: {fileID: 0}
  m_PrefabInstance: {fileID: 0}
  m_PrefabAsset: {fileID: 0}
  m_GameObject: {fileID: 5071171148919026052}
  m_CullTransparentMesh: 0
--- !u!114 &7294478615286633491
MonoBehaviour:
  m_ObjectHideFlags: 0
  m_CorrespondingSourceObject: {fileID: 0}
  m_PrefabInstance: {fileID: 0}
  m_PrefabAsset: {fileID: 0}
  m_GameObject: {fileID: 5071171148919026052}
  m_Enabled: 1
  m_EditorHideFlags: 0
  m_Script: {fileID: 11500000, guid: fe87c0e1cc204ed48ad3b37840f39efc, type: 3}
  m_Name: 
  m_EditorClassIdentifier: 
  m_Material: {fileID: 0}
  m_Color: {r: 0, g: 0.8196079, b: 0.3372549, a: 1}
  m_RaycastTarget: 0
  m_OnCullStateChanged:
    m_PersistentCalls:
      m_Calls: []
  m_Sprite: {fileID: 21300000, guid: bb08bd65f2dfbb54e99db59bd3f0bdb6, type: 3}
  m_Type: 0
  m_PreserveAspect: 0
  m_FillCenter: 1
  m_FillMethod: 4
  m_FillAmount: 1
  m_FillClockwise: 1
  m_FillOrigin: 0
  m_UseSpriteMesh: 0
  m_PixelsPerUnitMultiplier: 1
--- !u!1 &5150306173412950918
GameObject:
  m_ObjectHideFlags: 0
  m_CorrespondingSourceObject: {fileID: 0}
  m_PrefabInstance: {fileID: 0}
  m_PrefabAsset: {fileID: 0}
  serializedVersion: 6
  m_Component:
  - component: {fileID: 7450017763383782305}
  - component: {fileID: 2243964618657432191}
  - component: {fileID: 448368318405891545}
  m_Layer: 5
  m_Name: Color
  m_TagString: Untagged
  m_Icon: {fileID: 0}
  m_NavMeshLayer: 0
  m_StaticEditorFlags: 0
  m_IsActive: 1
--- !u!224 &7450017763383782305
RectTransform:
  m_ObjectHideFlags: 0
  m_CorrespondingSourceObject: {fileID: 0}
  m_PrefabInstance: {fileID: 0}
  m_PrefabAsset: {fileID: 0}
  m_GameObject: {fileID: 5150306173412950918}
  m_LocalRotation: {x: -0, y: -0, z: -0, w: 1}
  m_LocalPosition: {x: 0, y: 0, z: -2}
  m_LocalScale: {x: 1, y: 1, z: 1}
  m_Children: []
  m_Father: {fileID: 7421587531895698693}
  m_RootOrder: 0
  m_LocalEulerAnglesHint: {x: 0, y: 0, z: 0}
  m_AnchorMin: {x: 0, y: 0}
  m_AnchorMax: {x: 1, y: 1}
  m_AnchoredPosition: {x: 0, y: 0}
  m_SizeDelta: {x: -4, y: -4}
  m_Pivot: {x: 0.5, y: 0.5}
--- !u!222 &2243964618657432191
CanvasRenderer:
  m_ObjectHideFlags: 0
  m_CorrespondingSourceObject: {fileID: 0}
  m_PrefabInstance: {fileID: 0}
  m_PrefabAsset: {fileID: 0}
  m_GameObject: {fileID: 5150306173412950918}
  m_CullTransparentMesh: 0
--- !u!114 &448368318405891545
MonoBehaviour:
  m_ObjectHideFlags: 0
  m_CorrespondingSourceObject: {fileID: 0}
  m_PrefabInstance: {fileID: 0}
  m_PrefabAsset: {fileID: 0}
  m_GameObject: {fileID: 5150306173412950918}
  m_Enabled: 1
  m_EditorHideFlags: 0
  m_Script: {fileID: 11500000, guid: fe87c0e1cc204ed48ad3b37840f39efc, type: 3}
  m_Name: 
  m_EditorClassIdentifier: 
  m_Material: {fileID: 0}
  m_Color: {r: 0.13333334, g: 0.44705886, b: 0.8862746, a: 1}
  m_RaycastTarget: 0
  m_OnCullStateChanged:
    m_PersistentCalls:
      m_Calls: []
  m_Sprite: {fileID: 21300000, guid: bb08bd65f2dfbb54e99db59bd3f0bdb6, type: 3}
  m_Type: 0
  m_PreserveAspect: 0
  m_FillCenter: 1
  m_FillMethod: 4
  m_FillAmount: 1
  m_FillClockwise: 1
  m_FillOrigin: 0
  m_UseSpriteMesh: 0
  m_PixelsPerUnitMultiplier: 1
--- !u!1 &5445117640613744940
GameObject:
  m_ObjectHideFlags: 0
  m_CorrespondingSourceObject: {fileID: 0}
  m_PrefabInstance: {fileID: 0}
  m_PrefabAsset: {fileID: 0}
  serializedVersion: 6
  m_Component:
  - component: {fileID: 2995849000346883717}
  - component: {fileID: 237288147162008931}
  - component: {fileID: 3950169718981263475}
  m_Layer: 0
  m_Name: User Color Picker
  m_TagString: Untagged
  m_Icon: {fileID: 0}
  m_NavMeshLayer: 0
  m_StaticEditorFlags: 0
  m_IsActive: 1
--- !u!224 &2995849000346883717
RectTransform:
  m_ObjectHideFlags: 0
  m_CorrespondingSourceObject: {fileID: 0}
  m_PrefabInstance: {fileID: 0}
  m_PrefabAsset: {fileID: 0}
  m_GameObject: {fileID: 5445117640613744940}
  m_LocalRotation: {x: 0, y: 0, z: 0, w: 1}
  m_LocalPosition: {x: 0, y: 0, z: 0}
  m_LocalScale: {x: 1, y: 1, z: 1}
  m_Children:
  - {fileID: 429057124150083584}
  - {fileID: 626321575459681955}
  - {fileID: 8160197654570126340}
  m_Father: {fileID: 0}
  m_RootOrder: 0
  m_LocalEulerAnglesHint: {x: 0, y: 0, z: 0}
  m_AnchorMin: {x: 0, y: 0}
  m_AnchorMax: {x: 0, y: 0}
  m_AnchoredPosition: {x: 0, y: 0}
  m_SizeDelta: {x: 270, y: 80}
  m_Pivot: {x: 0.5, y: 0.5}
--- !u!114 &237288147162008931
MonoBehaviour:
  m_ObjectHideFlags: 0
  m_CorrespondingSourceObject: {fileID: 0}
  m_PrefabInstance: {fileID: 0}
  m_PrefabAsset: {fileID: 0}
  m_GameObject: {fileID: 5445117640613744940}
  m_Enabled: 1
  m_EditorHideFlags: 0
  m_Script: {fileID: 11500000, guid: 5ae4285206cded247bee25c117d9ef82, type: 3}
  m_Name: 
  m_EditorClassIdentifier: 
  userIcon: {fileID: 6974613371558727921}
  presetButtonParent: {fileID: 1956543127725529951}
--- !u!114 &3950169718981263475
MonoBehaviour:
  m_ObjectHideFlags: 0
  m_CorrespondingSourceObject: {fileID: 0}
  m_PrefabInstance: {fileID: 0}
  m_PrefabAsset: {fileID: 0}
  m_GameObject: {fileID: 5445117640613744940}
  m_Enabled: 1
  m_EditorHideFlags: 0
  m_Script: {fileID: 11500000, guid: 90c87809a7e04aa38290d0d5a2aeaede, type: 3}
  m_Name: 
  m_EditorClassIdentifier: 
  text: {fileID: 3698763748470933409}
--- !u!1 &6023122366197055381
GameObject:
  m_ObjectHideFlags: 0
  m_CorrespondingSourceObject: {fileID: 0}
  m_PrefabInstance: {fileID: 0}
  m_PrefabAsset: {fileID: 0}
  serializedVersion: 6
  m_Component:
  - component: {fileID: 429057124150083584}
  - component: {fileID: 128511667579427093}
  - component: {fileID: 6974613371558727921}
  m_Layer: 0
  m_Name: User Icon
  m_TagString: Untagged
  m_Icon: {fileID: 0}
  m_NavMeshLayer: 0
  m_StaticEditorFlags: 0
  m_IsActive: 1
--- !u!224 &429057124150083584
RectTransform:
  m_ObjectHideFlags: 0
  m_CorrespondingSourceObject: {fileID: 0}
  m_PrefabInstance: {fileID: 0}
  m_PrefabAsset: {fileID: 0}
  m_GameObject: {fileID: 6023122366197055381}
  m_LocalRotation: {x: 0, y: 0, z: 0, w: 1}
  m_LocalPosition: {x: 0, y: 0, z: 0}
  m_LocalScale: {x: 1, y: 1, z: 1}
  m_Children: []
  m_Father: {fileID: 2995849000346883717}
  m_RootOrder: 0
  m_LocalEulerAnglesHint: {x: 0, y: 0, z: 0}
  m_AnchorMin: {x: 0.5, y: 0.5}
  m_AnchorMax: {x: 0.5, y: 0.5}
  m_AnchoredPosition: {x: 0, y: 11.1}
  m_SizeDelta: {x: 72, y: 72}
  m_Pivot: {x: 0.5, y: 0.5}
--- !u!222 &128511667579427093
CanvasRenderer:
  m_ObjectHideFlags: 0
  m_CorrespondingSourceObject: {fileID: 0}
  m_PrefabInstance: {fileID: 0}
  m_PrefabAsset: {fileID: 0}
  m_GameObject: {fileID: 6023122366197055381}
  m_CullTransparentMesh: 0
--- !u!114 &6974613371558727921
MonoBehaviour:
  m_ObjectHideFlags: 0
  m_CorrespondingSourceObject: {fileID: 0}
  m_PrefabInstance: {fileID: 0}
  m_PrefabAsset: {fileID: 0}
  m_GameObject: {fileID: 6023122366197055381}
  m_Enabled: 1
  m_EditorHideFlags: 0
  m_Script: {fileID: 11500000, guid: fe87c0e1cc204ed48ad3b37840f39efc, type: 3}
  m_Name: 
  m_EditorClassIdentifier: 
  m_Material: {fileID: 0}
  m_Color: {r: 1, g: 0.4, b: 0, a: 1}
  m_RaycastTarget: 1
  m_OnCullStateChanged:
    m_PersistentCalls:
      m_Calls: []
  m_Sprite: {fileID: 21300000, guid: 0bff6a66a5b7d37458fe46e2dec2deda, type: 3}
  m_Type: 0
  m_PreserveAspect: 0
  m_FillCenter: 1
  m_FillMethod: 4
  m_FillAmount: 1
  m_FillClockwise: 1
  m_FillOrigin: 0
  m_UseSpriteMesh: 0
  m_PixelsPerUnitMultiplier: 1
--- !u!1 &6621081454909131791
GameObject:
  m_ObjectHideFlags: 0
  m_CorrespondingSourceObject: {fileID: 0}
  m_PrefabInstance: {fileID: 0}
  m_PrefabAsset: {fileID: 0}
  serializedVersion: 6
  m_Component:
  - component: {fileID: 6843405195674560429}
  - component: {fileID: 3739659105960209187}
  - component: {fileID: 3815965698522202729}
  m_Layer: 5
  m_Name: Color
  m_TagString: Untagged
  m_Icon: {fileID: 0}
  m_NavMeshLayer: 0
  m_StaticEditorFlags: 0
  m_IsActive: 1
--- !u!224 &6843405195674560429
RectTransform:
  m_ObjectHideFlags: 0
  m_CorrespondingSourceObject: {fileID: 0}
  m_PrefabInstance: {fileID: 0}
  m_PrefabAsset: {fileID: 0}
  m_GameObject: {fileID: 6621081454909131791}
  m_LocalRotation: {x: -0, y: -0, z: -0, w: 1}
  m_LocalPosition: {x: 0, y: 0, z: -2}
  m_LocalScale: {x: 1, y: 1, z: 1}
  m_Children: []
  m_Father: {fileID: 8944949168079727059}
  m_RootOrder: 0
  m_LocalEulerAnglesHint: {x: 0, y: 0, z: 0}
  m_AnchorMin: {x: 0, y: 0}
  m_AnchorMax: {x: 1, y: 1}
  m_AnchoredPosition: {x: 0, y: 0}
  m_SizeDelta: {x: -4, y: -4}
  m_Pivot: {x: 0.5, y: 0.5}
--- !u!222 &3739659105960209187
CanvasRenderer:
  m_ObjectHideFlags: 0
  m_CorrespondingSourceObject: {fileID: 0}
  m_PrefabInstance: {fileID: 0}
  m_PrefabAsset: {fileID: 0}
  m_GameObject: {fileID: 6621081454909131791}
  m_CullTransparentMesh: 0
--- !u!114 &3815965698522202729
MonoBehaviour:
  m_ObjectHideFlags: 0
  m_CorrespondingSourceObject: {fileID: 0}
  m_PrefabInstance: {fileID: 0}
  m_PrefabAsset: {fileID: 0}
  m_GameObject: {fileID: 6621081454909131791}
  m_Enabled: 1
  m_EditorHideFlags: 0
  m_Script: {fileID: 11500000, guid: fe87c0e1cc204ed48ad3b37840f39efc, type: 3}
  m_Name: 
  m_EditorClassIdentifier: 
  m_Material: {fileID: 0}
  m_Color: {r: 1, g: 0.40000004, b: 0, a: 1}
  m_RaycastTarget: 0
  m_OnCullStateChanged:
    m_PersistentCalls:
      m_Calls: []
  m_Sprite: {fileID: 21300000, guid: bb08bd65f2dfbb54e99db59bd3f0bdb6, type: 3}
  m_Type: 0
  m_PreserveAspect: 0
  m_FillCenter: 1
  m_FillMethod: 4
  m_FillAmount: 1
  m_FillClockwise: 1
  m_FillOrigin: 0
  m_UseSpriteMesh: 0
  m_PixelsPerUnitMultiplier: 1
--- !u!1 &7402754661761544787
GameObject:
  m_ObjectHideFlags: 0
  m_CorrespondingSourceObject: {fileID: 0}
  m_PrefabInstance: {fileID: 0}
  m_PrefabAsset: {fileID: 0}
  serializedVersion: 6
  m_Component:
  - component: {fileID: 4383772960686386809}
  m_Layer: 0
  m_Name: GameObject (1)
  m_TagString: Untagged
  m_Icon: {fileID: 0}
  m_NavMeshLayer: 0
  m_StaticEditorFlags: 0
  m_IsActive: 1
--- !u!224 &4383772960686386809
RectTransform:
  m_ObjectHideFlags: 0
  m_CorrespondingSourceObject: {fileID: 0}
  m_PrefabInstance: {fileID: 0}
  m_PrefabAsset: {fileID: 0}
  m_GameObject: {fileID: 7402754661761544787}
  m_LocalRotation: {x: 0, y: 0, z: 0, w: 1}
  m_LocalPosition: {x: 0, y: 0, z: 0}
  m_LocalScale: {x: 1, y: 1, z: 1}
  m_Children: []
  m_Father: {fileID: 8160197654570126340}
  m_RootOrder: 3
  m_LocalEulerAnglesHint: {x: 0, y: 0, z: 0}
  m_AnchorMin: {x: 0, y: 1}
  m_AnchorMax: {x: 0, y: 1}
  m_AnchoredPosition: {x: 145, y: -19}
  m_SizeDelta: {x: 38, y: 38}
  m_Pivot: {x: 0.5, y: 0.5}
--- !u!1 &8107942804037559987
GameObject:
  m_ObjectHideFlags: 0
  m_CorrespondingSourceObject: {fileID: 0}
  m_PrefabInstance: {fileID: 0}
  m_PrefabAsset: {fileID: 0}
  serializedVersion: 6
  m_Component:
  - component: {fileID: 2294484121161161803}
  - component: {fileID: 1284022082434846128}
  - component: {fileID: 5302209465695916439}
  m_Layer: 5
  m_Name: Color
  m_TagString: Untagged
  m_Icon: {fileID: 0}
  m_NavMeshLayer: 0
  m_StaticEditorFlags: 0
  m_IsActive: 1
--- !u!224 &2294484121161161803
RectTransform:
  m_ObjectHideFlags: 0
  m_CorrespondingSourceObject: {fileID: 0}
  m_PrefabInstance: {fileID: 0}
  m_PrefabAsset: {fileID: 0}
  m_GameObject: {fileID: 8107942804037559987}
  m_LocalRotation: {x: -0, y: -0, z: -0, w: 1}
  m_LocalPosition: {x: 0, y: 0, z: -2}
  m_LocalScale: {x: 1, y: 1, z: 1}
  m_Children: []
  m_Father: {fileID: 5649692361094813112}
  m_RootOrder: 0
  m_LocalEulerAnglesHint: {x: 0, y: 0, z: 0}
  m_AnchorMin: {x: 0, y: 0}
  m_AnchorMax: {x: 1, y: 1}
  m_AnchoredPosition: {x: 0, y: 0}
  m_SizeDelta: {x: -4, y: -4}
  m_Pivot: {x: 0.5, y: 0.5}
--- !u!222 &1284022082434846128
CanvasRenderer:
  m_ObjectHideFlags: 0
  m_CorrespondingSourceObject: {fileID: 0}
  m_PrefabInstance: {fileID: 0}
  m_PrefabAsset: {fileID: 0}
  m_GameObject: {fileID: 8107942804037559987}
  m_CullTransparentMesh: 0
--- !u!114 &5302209465695916439
MonoBehaviour:
  m_ObjectHideFlags: 0
  m_CorrespondingSourceObject: {fileID: 0}
  m_PrefabInstance: {fileID: 0}
  m_PrefabAsset: {fileID: 0}
  m_GameObject: {fileID: 8107942804037559987}
  m_Enabled: 1
  m_EditorHideFlags: 0
  m_Script: {fileID: 11500000, guid: fe87c0e1cc204ed48ad3b37840f39efc, type: 3}
  m_Name: 
  m_EditorClassIdentifier: 
  m_Material: {fileID: 0}
  m_Color: {r: 0.050980397, g: 0.7137255, b: 0.87843144, a: 1}
  m_RaycastTarget: 0
  m_OnCullStateChanged:
    m_PersistentCalls:
      m_Calls: []
  m_Sprite: {fileID: 21300000, guid: bb08bd65f2dfbb54e99db59bd3f0bdb6, type: 3}
  m_Type: 0
  m_PreserveAspect: 0
  m_FillCenter: 1
  m_FillMethod: 4
  m_FillAmount: 1
  m_FillClockwise: 1
  m_FillOrigin: 0
  m_UseSpriteMesh: 0
  m_PixelsPerUnitMultiplier: 1
--- !u!1 &8384459475758123458
GameObject:
  m_ObjectHideFlags: 0
  m_CorrespondingSourceObject: {fileID: 0}
  m_PrefabInstance: {fileID: 0}
  m_PrefabAsset: {fileID: 0}
  serializedVersion: 6
  m_Component:
  - component: {fileID: 6790872333918566506}
  - component: {fileID: 5973692857359939335}
  - component: {fileID: 6240127811675077823}
  m_Layer: 5
  m_Name: Color
  m_TagString: Untagged
  m_Icon: {fileID: 0}
  m_NavMeshLayer: 0
  m_StaticEditorFlags: 0
  m_IsActive: 1
--- !u!224 &6790872333918566506
RectTransform:
  m_ObjectHideFlags: 0
  m_CorrespondingSourceObject: {fileID: 0}
  m_PrefabInstance: {fileID: 0}
  m_PrefabAsset: {fileID: 0}
  m_GameObject: {fileID: 8384459475758123458}
  m_LocalRotation: {x: -0, y: -0, z: -0, w: 1}
  m_LocalPosition: {x: 0, y: 0, z: -2}
  m_LocalScale: {x: 1, y: 1, z: 1}
  m_Children: []
  m_Father: {fileID: 4351797425007598532}
  m_RootOrder: 0
  m_LocalEulerAnglesHint: {x: 0, y: 0, z: 0}
  m_AnchorMin: {x: 0, y: 0}
  m_AnchorMax: {x: 1, y: 1}
  m_AnchoredPosition: {x: 0, y: 0}
  m_SizeDelta: {x: -4, y: -4}
  m_Pivot: {x: 0.5, y: 0.5}
--- !u!222 &5973692857359939335
CanvasRenderer:
  m_ObjectHideFlags: 0
  m_CorrespondingSourceObject: {fileID: 0}
  m_PrefabInstance: {fileID: 0}
  m_PrefabAsset: {fileID: 0}
  m_GameObject: {fileID: 8384459475758123458}
  m_CullTransparentMesh: 0
--- !u!114 &6240127811675077823
MonoBehaviour:
  m_ObjectHideFlags: 0
  m_CorrespondingSourceObject: {fileID: 0}
  m_PrefabInstance: {fileID: 0}
  m_PrefabAsset: {fileID: 0}
  m_GameObject: {fileID: 8384459475758123458}
  m_Enabled: 1
  m_EditorHideFlags: 0
  m_Script: {fileID: 11500000, guid: fe87c0e1cc204ed48ad3b37840f39efc, type: 3}
  m_Name: 
  m_EditorClassIdentifier: 
  m_Material: {fileID: 0}
  m_Color: {r: 0.54901963, g: 0.58431375, b: 0.6039216, a: 1}
  m_RaycastTarget: 0
  m_OnCullStateChanged:
    m_PersistentCalls:
      m_Calls: []
  m_Sprite: {fileID: 21300000, guid: bb08bd65f2dfbb54e99db59bd3f0bdb6, type: 3}
  m_Type: 0
  m_PreserveAspect: 0
  m_FillCenter: 1
  m_FillMethod: 4
  m_FillAmount: 1
  m_FillClockwise: 1
  m_FillOrigin: 0
  m_UseSpriteMesh: 0
  m_PixelsPerUnitMultiplier: 1
--- !u!1001 &1750863583856724237
PrefabInstance:
  m_ObjectHideFlags: 0
  serializedVersion: 2
  m_Modification:
    m_TransformParent: {fileID: 8160197654570126340}
    m_Modifications:
    - target: {fileID: 1131754165901552208, guid: 6cbbc06ceb9a9794299a1e06a17c86b2,
        type: 3}
      propertyPath: m_AnchoredPosition.x
      value: 0
      objectReference: {fileID: 0}
    - target: {fileID: 1131754165901552208, guid: 6cbbc06ceb9a9794299a1e06a17c86b2,
        type: 3}
      propertyPath: m_SizeDelta.x
      value: -8
      objectReference: {fileID: 0}
    - target: {fileID: 1131754165901552208, guid: 6cbbc06ceb9a9794299a1e06a17c86b2,
        type: 3}
      propertyPath: m_AnchoredPosition.y
      value: 0
      objectReference: {fileID: 0}
    - target: {fileID: 1131754165901552208, guid: 6cbbc06ceb9a9794299a1e06a17c86b2,
        type: 3}
      propertyPath: m_SizeDelta.y
      value: -8
      objectReference: {fileID: 0}
    - target: {fileID: 1865149173984279355, guid: 6cbbc06ceb9a9794299a1e06a17c86b2,
        type: 3}
      propertyPath: m_Name
      value: Preset (5)
      objectReference: {fileID: 0}
    - target: {fileID: 3794691817542679349, guid: 6cbbc06ceb9a9794299a1e06a17c86b2,
        type: 3}
      propertyPath: m_Sprite
      value: 
      objectReference: {fileID: 21300000, guid: bb08bd65f2dfbb54e99db59bd3f0bdb6,
        type: 3}
    - target: {fileID: 4678676913250523710, guid: 6cbbc06ceb9a9794299a1e06a17c86b2,
        type: 3}
      propertyPath: m_LocalPosition.x
      value: 0
      objectReference: {fileID: 0}
    - target: {fileID: 4678676913250523710, guid: 6cbbc06ceb9a9794299a1e06a17c86b2,
        type: 3}
      propertyPath: m_LocalPosition.y
      value: 0
      objectReference: {fileID: 0}
    - target: {fileID: 4678676913250523710, guid: 6cbbc06ceb9a9794299a1e06a17c86b2,
        type: 3}
      propertyPath: m_LocalPosition.z
      value: 0
      objectReference: {fileID: 0}
    - target: {fileID: 4678676913250523710, guid: 6cbbc06ceb9a9794299a1e06a17c86b2,
        type: 3}
      propertyPath: m_LocalRotation.x
      value: 0
      objectReference: {fileID: 0}
    - target: {fileID: 4678676913250523710, guid: 6cbbc06ceb9a9794299a1e06a17c86b2,
        type: 3}
      propertyPath: m_LocalRotation.y
      value: 0
      objectReference: {fileID: 0}
    - target: {fileID: 4678676913250523710, guid: 6cbbc06ceb9a9794299a1e06a17c86b2,
        type: 3}
      propertyPath: m_LocalRotation.z
      value: 0
      objectReference: {fileID: 0}
    - target: {fileID: 4678676913250523710, guid: 6cbbc06ceb9a9794299a1e06a17c86b2,
        type: 3}
      propertyPath: m_LocalRotation.w
      value: 1
      objectReference: {fileID: 0}
    - target: {fileID: 4678676913250523710, guid: 6cbbc06ceb9a9794299a1e06a17c86b2,
        type: 3}
      propertyPath: m_RootOrder
      value: 6
      objectReference: {fileID: 0}
    - target: {fileID: 4678676913250523710, guid: 6cbbc06ceb9a9794299a1e06a17c86b2,
        type: 3}
      propertyPath: m_LocalEulerAnglesHint.x
      value: 0
      objectReference: {fileID: 0}
    - target: {fileID: 4678676913250523710, guid: 6cbbc06ceb9a9794299a1e06a17c86b2,
        type: 3}
      propertyPath: m_LocalEulerAnglesHint.y
      value: 0
      objectReference: {fileID: 0}
    - target: {fileID: 4678676913250523710, guid: 6cbbc06ceb9a9794299a1e06a17c86b2,
        type: 3}
      propertyPath: m_LocalEulerAnglesHint.z
      value: 0
      objectReference: {fileID: 0}
    - target: {fileID: 4678676913250523710, guid: 6cbbc06ceb9a9794299a1e06a17c86b2,
        type: 3}
      propertyPath: m_AnchoredPosition.x
      value: -114
      objectReference: {fileID: 0}
    - target: {fileID: 4678676913250523710, guid: 6cbbc06ceb9a9794299a1e06a17c86b2,
        type: 3}
      propertyPath: m_AnchoredPosition.y
      value: -16
      objectReference: {fileID: 0}
    - target: {fileID: 4678676913250523710, guid: 6cbbc06ceb9a9794299a1e06a17c86b2,
        type: 3}
      propertyPath: m_SizeDelta.x
      value: 38
      objectReference: {fileID: 0}
    - target: {fileID: 4678676913250523710, guid: 6cbbc06ceb9a9794299a1e06a17c86b2,
        type: 3}
      propertyPath: m_SizeDelta.y
      value: 38
      objectReference: {fileID: 0}
    - target: {fileID: 4678676913250523710, guid: 6cbbc06ceb9a9794299a1e06a17c86b2,
        type: 3}
      propertyPath: m_AnchorMin.x
      value: 0.5
      objectReference: {fileID: 0}
    - target: {fileID: 4678676913250523710, guid: 6cbbc06ceb9a9794299a1e06a17c86b2,
        type: 3}
      propertyPath: m_AnchorMin.y
      value: 0.5
      objectReference: {fileID: 0}
    - target: {fileID: 4678676913250523710, guid: 6cbbc06ceb9a9794299a1e06a17c86b2,
        type: 3}
      propertyPath: m_AnchorMax.x
      value: 0.5
      objectReference: {fileID: 0}
    - target: {fileID: 4678676913250523710, guid: 6cbbc06ceb9a9794299a1e06a17c86b2,
        type: 3}
      propertyPath: m_AnchorMax.y
      value: 0.5
      objectReference: {fileID: 0}
    - target: {fileID: 4678676913250523710, guid: 6cbbc06ceb9a9794299a1e06a17c86b2,
        type: 3}
      propertyPath: m_Pivot.x
      value: 0.5
      objectReference: {fileID: 0}
    - target: {fileID: 4678676913250523710, guid: 6cbbc06ceb9a9794299a1e06a17c86b2,
        type: 3}
      propertyPath: m_Pivot.y
      value: 0.5
      objectReference: {fileID: 0}
    - target: {fileID: 8572292734608390408, guid: 6cbbc06ceb9a9794299a1e06a17c86b2,
        type: 3}
      propertyPath: m_IsActive
      value: 0
      objectReference: {fileID: 0}
    - target: {fileID: 8865474348618771260, guid: 6cbbc06ceb9a9794299a1e06a17c86b2,
        type: 3}
      propertyPath: m_textInfo.characterCount
      value: 0
      objectReference: {fileID: 0}
    - target: {fileID: 8865474348618771260, guid: 6cbbc06ceb9a9794299a1e06a17c86b2,
        type: 3}
      propertyPath: m_textInfo.wordCount
      value: 0
      objectReference: {fileID: 0}
    - target: {fileID: 8865474348618771260, guid: 6cbbc06ceb9a9794299a1e06a17c86b2,
        type: 3}
      propertyPath: m_textInfo.lineCount
      value: 0
      objectReference: {fileID: 0}
    - target: {fileID: 8865474348618771260, guid: 6cbbc06ceb9a9794299a1e06a17c86b2,
        type: 3}
      propertyPath: m_textInfo.pageCount
      value: 0
      objectReference: {fileID: 0}
    m_RemovedComponents: []
  m_SourcePrefab: {fileID: 100100000, guid: 6cbbc06ceb9a9794299a1e06a17c86b2, type: 3}
--- !u!224 &6386578135435760435 stripped
RectTransform:
  m_CorrespondingSourceObject: {fileID: 4678676913250523710, guid: 6cbbc06ceb9a9794299a1e06a17c86b2,
    type: 3}
  m_PrefabInstance: {fileID: 1750863583856724237}
  m_PrefabAsset: {fileID: 0}
--- !u!224 &1727303414529123165 stripped
RectTransform:
  m_CorrespondingSourceObject: {fileID: 1131754165901552208, guid: 6cbbc06ceb9a9794299a1e06a17c86b2,
    type: 3}
  m_PrefabInstance: {fileID: 1750863583856724237}
  m_PrefabAsset: {fileID: 0}
--- !u!1001 &3733621364211904916
PrefabInstance:
  m_ObjectHideFlags: 0
  serializedVersion: 2
  m_Modification:
    m_TransformParent: {fileID: 8160197654570126340}
    m_Modifications:
    - target: {fileID: 1131754165901552208, guid: 6cbbc06ceb9a9794299a1e06a17c86b2,
        type: 3}
      propertyPath: m_AnchoredPosition.x
      value: 0
      objectReference: {fileID: 0}
    - target: {fileID: 1131754165901552208, guid: 6cbbc06ceb9a9794299a1e06a17c86b2,
        type: 3}
      propertyPath: m_SizeDelta.x
      value: -8
      objectReference: {fileID: 0}
    - target: {fileID: 1131754165901552208, guid: 6cbbc06ceb9a9794299a1e06a17c86b2,
        type: 3}
      propertyPath: m_AnchoredPosition.y
      value: 0
      objectReference: {fileID: 0}
    - target: {fileID: 1131754165901552208, guid: 6cbbc06ceb9a9794299a1e06a17c86b2,
        type: 3}
      propertyPath: m_SizeDelta.y
      value: -8
      objectReference: {fileID: 0}
    - target: {fileID: 1865149173984279355, guid: 6cbbc06ceb9a9794299a1e06a17c86b2,
        type: 3}
      propertyPath: m_Name
      value: Preset (8)
      objectReference: {fileID: 0}
    - target: {fileID: 3794691817542679349, guid: 6cbbc06ceb9a9794299a1e06a17c86b2,
        type: 3}
      propertyPath: m_Sprite
      value: 
      objectReference: {fileID: 21300000, guid: bb08bd65f2dfbb54e99db59bd3f0bdb6,
        type: 3}
    - target: {fileID: 4678676913250523710, guid: 6cbbc06ceb9a9794299a1e06a17c86b2,
        type: 3}
      propertyPath: m_LocalPosition.x
      value: 0
      objectReference: {fileID: 0}
    - target: {fileID: 4678676913250523710, guid: 6cbbc06ceb9a9794299a1e06a17c86b2,
        type: 3}
      propertyPath: m_LocalPosition.y
      value: 0
      objectReference: {fileID: 0}
    - target: {fileID: 4678676913250523710, guid: 6cbbc06ceb9a9794299a1e06a17c86b2,
        type: 3}
      propertyPath: m_LocalPosition.z
      value: 0
      objectReference: {fileID: 0}
    - target: {fileID: 4678676913250523710, guid: 6cbbc06ceb9a9794299a1e06a17c86b2,
        type: 3}
      propertyPath: m_LocalRotation.x
      value: 0
      objectReference: {fileID: 0}
    - target: {fileID: 4678676913250523710, guid: 6cbbc06ceb9a9794299a1e06a17c86b2,
        type: 3}
      propertyPath: m_LocalRotation.y
      value: 0
      objectReference: {fileID: 0}
    - target: {fileID: 4678676913250523710, guid: 6cbbc06ceb9a9794299a1e06a17c86b2,
        type: 3}
      propertyPath: m_LocalRotation.z
      value: 0
      objectReference: {fileID: 0}
    - target: {fileID: 4678676913250523710, guid: 6cbbc06ceb9a9794299a1e06a17c86b2,
        type: 3}
      propertyPath: m_LocalRotation.w
      value: 1
      objectReference: {fileID: 0}
    - target: {fileID: 4678676913250523710, guid: 6cbbc06ceb9a9794299a1e06a17c86b2,
        type: 3}
      propertyPath: m_RootOrder
      value: 11
      objectReference: {fileID: 0}
    - target: {fileID: 4678676913250523710, guid: 6cbbc06ceb9a9794299a1e06a17c86b2,
        type: 3}
      propertyPath: m_LocalEulerAnglesHint.x
      value: 0
      objectReference: {fileID: 0}
    - target: {fileID: 4678676913250523710, guid: 6cbbc06ceb9a9794299a1e06a17c86b2,
        type: 3}
      propertyPath: m_LocalEulerAnglesHint.y
      value: 0
      objectReference: {fileID: 0}
    - target: {fileID: 4678676913250523710, guid: 6cbbc06ceb9a9794299a1e06a17c86b2,
        type: 3}
      propertyPath: m_LocalEulerAnglesHint.z
      value: 0
      objectReference: {fileID: 0}
    - target: {fileID: 4678676913250523710, guid: 6cbbc06ceb9a9794299a1e06a17c86b2,
        type: 3}
      propertyPath: m_AnchoredPosition.x
      value: 114
      objectReference: {fileID: 0}
    - target: {fileID: 4678676913250523710, guid: 6cbbc06ceb9a9794299a1e06a17c86b2,
        type: 3}
      propertyPath: m_AnchoredPosition.y
      value: -16
      objectReference: {fileID: 0}
    - target: {fileID: 4678676913250523710, guid: 6cbbc06ceb9a9794299a1e06a17c86b2,
        type: 3}
      propertyPath: m_SizeDelta.x
      value: 38
      objectReference: {fileID: 0}
    - target: {fileID: 4678676913250523710, guid: 6cbbc06ceb9a9794299a1e06a17c86b2,
        type: 3}
      propertyPath: m_SizeDelta.y
      value: 38
      objectReference: {fileID: 0}
    - target: {fileID: 4678676913250523710, guid: 6cbbc06ceb9a9794299a1e06a17c86b2,
        type: 3}
      propertyPath: m_AnchorMin.x
      value: 0.5
      objectReference: {fileID: 0}
    - target: {fileID: 4678676913250523710, guid: 6cbbc06ceb9a9794299a1e06a17c86b2,
        type: 3}
      propertyPath: m_AnchorMin.y
      value: 0.5
      objectReference: {fileID: 0}
    - target: {fileID: 4678676913250523710, guid: 6cbbc06ceb9a9794299a1e06a17c86b2,
        type: 3}
      propertyPath: m_AnchorMax.x
      value: 0.5
      objectReference: {fileID: 0}
    - target: {fileID: 4678676913250523710, guid: 6cbbc06ceb9a9794299a1e06a17c86b2,
        type: 3}
      propertyPath: m_AnchorMax.y
      value: 0.5
      objectReference: {fileID: 0}
    - target: {fileID: 4678676913250523710, guid: 6cbbc06ceb9a9794299a1e06a17c86b2,
        type: 3}
      propertyPath: m_Pivot.x
      value: 0.5
      objectReference: {fileID: 0}
    - target: {fileID: 4678676913250523710, guid: 6cbbc06ceb9a9794299a1e06a17c86b2,
        type: 3}
      propertyPath: m_Pivot.y
      value: 0.5
      objectReference: {fileID: 0}
    - target: {fileID: 8572292734608390408, guid: 6cbbc06ceb9a9794299a1e06a17c86b2,
        type: 3}
      propertyPath: m_IsActive
      value: 0
      objectReference: {fileID: 0}
    - target: {fileID: 8865474348618771260, guid: 6cbbc06ceb9a9794299a1e06a17c86b2,
        type: 3}
      propertyPath: m_textInfo.characterCount
      value: 0
      objectReference: {fileID: 0}
    - target: {fileID: 8865474348618771260, guid: 6cbbc06ceb9a9794299a1e06a17c86b2,
        type: 3}
      propertyPath: m_textInfo.wordCount
      value: 0
      objectReference: {fileID: 0}
    - target: {fileID: 8865474348618771260, guid: 6cbbc06ceb9a9794299a1e06a17c86b2,
        type: 3}
      propertyPath: m_textInfo.lineCount
      value: 0
      objectReference: {fileID: 0}
    - target: {fileID: 8865474348618771260, guid: 6cbbc06ceb9a9794299a1e06a17c86b2,
        type: 3}
      propertyPath: m_textInfo.pageCount
      value: 0
      objectReference: {fileID: 0}
    m_RemovedComponents: []
  m_SourcePrefab: {fileID: 100100000, guid: 6cbbc06ceb9a9794299a1e06a17c86b2, type: 3}
--- !u!224 &8303937342397655978 stripped
RectTransform:
  m_CorrespondingSourceObject: {fileID: 4678676913250523710, guid: 6cbbc06ceb9a9794299a1e06a17c86b2,
    type: 3}
  m_PrefabInstance: {fileID: 3733621364211904916}
  m_PrefabAsset: {fileID: 0}
--- !u!224 &4351797425007598532 stripped
RectTransform:
  m_CorrespondingSourceObject: {fileID: 1131754165901552208, guid: 6cbbc06ceb9a9794299a1e06a17c86b2,
    type: 3}
  m_PrefabInstance: {fileID: 3733621364211904916}
  m_PrefabAsset: {fileID: 0}
--- !u!1001 &4448163128053375735
PrefabInstance:
  m_ObjectHideFlags: 0
  serializedVersion: 2
  m_Modification:
    m_TransformParent: {fileID: 8160197654570126340}
    m_Modifications:
    - target: {fileID: 1131754165901552208, guid: 6cbbc06ceb9a9794299a1e06a17c86b2,
        type: 3}
      propertyPath: m_AnchoredPosition.x
      value: 0
      objectReference: {fileID: 0}
    - target: {fileID: 1131754165901552208, guid: 6cbbc06ceb9a9794299a1e06a17c86b2,
        type: 3}
      propertyPath: m_SizeDelta.x
      value: -8
      objectReference: {fileID: 0}
    - target: {fileID: 1131754165901552208, guid: 6cbbc06ceb9a9794299a1e06a17c86b2,
        type: 3}
      propertyPath: m_AnchoredPosition.y
      value: 0
      objectReference: {fileID: 0}
    - target: {fileID: 1131754165901552208, guid: 6cbbc06ceb9a9794299a1e06a17c86b2,
        type: 3}
      propertyPath: m_SizeDelta.y
      value: -8
      objectReference: {fileID: 0}
    - target: {fileID: 1865149173984279355, guid: 6cbbc06ceb9a9794299a1e06a17c86b2,
        type: 3}
      propertyPath: m_Name
      value: Preset (4)
      objectReference: {fileID: 0}
    - target: {fileID: 3794691817542679349, guid: 6cbbc06ceb9a9794299a1e06a17c86b2,
        type: 3}
      propertyPath: m_Sprite
      value: 
      objectReference: {fileID: 21300000, guid: bb08bd65f2dfbb54e99db59bd3f0bdb6,
        type: 3}
    - target: {fileID: 4678676913250523710, guid: 6cbbc06ceb9a9794299a1e06a17c86b2,
        type: 3}
      propertyPath: m_LocalPosition.x
      value: 0
      objectReference: {fileID: 0}
    - target: {fileID: 4678676913250523710, guid: 6cbbc06ceb9a9794299a1e06a17c86b2,
        type: 3}
      propertyPath: m_LocalPosition.y
      value: 0
      objectReference: {fileID: 0}
    - target: {fileID: 4678676913250523710, guid: 6cbbc06ceb9a9794299a1e06a17c86b2,
        type: 3}
      propertyPath: m_LocalPosition.z
      value: 0
      objectReference: {fileID: 0}
    - target: {fileID: 4678676913250523710, guid: 6cbbc06ceb9a9794299a1e06a17c86b2,
        type: 3}
      propertyPath: m_LocalRotation.x
      value: 0
      objectReference: {fileID: 0}
    - target: {fileID: 4678676913250523710, guid: 6cbbc06ceb9a9794299a1e06a17c86b2,
        type: 3}
      propertyPath: m_LocalRotation.y
      value: 0
      objectReference: {fileID: 0}
    - target: {fileID: 4678676913250523710, guid: 6cbbc06ceb9a9794299a1e06a17c86b2,
        type: 3}
      propertyPath: m_LocalRotation.z
      value: 0
      objectReference: {fileID: 0}
    - target: {fileID: 4678676913250523710, guid: 6cbbc06ceb9a9794299a1e06a17c86b2,
        type: 3}
      propertyPath: m_LocalRotation.w
      value: 1
      objectReference: {fileID: 0}
    - target: {fileID: 4678676913250523710, guid: 6cbbc06ceb9a9794299a1e06a17c86b2,
        type: 3}
      propertyPath: m_RootOrder
      value: 5
      objectReference: {fileID: 0}
    - target: {fileID: 4678676913250523710, guid: 6cbbc06ceb9a9794299a1e06a17c86b2,
        type: 3}
      propertyPath: m_LocalEulerAnglesHint.x
      value: 0
      objectReference: {fileID: 0}
    - target: {fileID: 4678676913250523710, guid: 6cbbc06ceb9a9794299a1e06a17c86b2,
        type: 3}
      propertyPath: m_LocalEulerAnglesHint.y
      value: 0
      objectReference: {fileID: 0}
    - target: {fileID: 4678676913250523710, guid: 6cbbc06ceb9a9794299a1e06a17c86b2,
        type: 3}
      propertyPath: m_LocalEulerAnglesHint.z
      value: 0
      objectReference: {fileID: 0}
    - target: {fileID: 4678676913250523710, guid: 6cbbc06ceb9a9794299a1e06a17c86b2,
        type: 3}
      propertyPath: m_AnchoredPosition.x
      value: 92
      objectReference: {fileID: 0}
    - target: {fileID: 4678676913250523710, guid: 6cbbc06ceb9a9794299a1e06a17c86b2,
        type: 3}
      propertyPath: m_AnchoredPosition.y
      value: 21
      objectReference: {fileID: 0}
    - target: {fileID: 4678676913250523710, guid: 6cbbc06ceb9a9794299a1e06a17c86b2,
        type: 3}
      propertyPath: m_SizeDelta.x
      value: 38
      objectReference: {fileID: 0}
    - target: {fileID: 4678676913250523710, guid: 6cbbc06ceb9a9794299a1e06a17c86b2,
        type: 3}
      propertyPath: m_SizeDelta.y
      value: 38
      objectReference: {fileID: 0}
    - target: {fileID: 4678676913250523710, guid: 6cbbc06ceb9a9794299a1e06a17c86b2,
        type: 3}
      propertyPath: m_AnchorMin.x
      value: 0.5
      objectReference: {fileID: 0}
    - target: {fileID: 4678676913250523710, guid: 6cbbc06ceb9a9794299a1e06a17c86b2,
        type: 3}
      propertyPath: m_AnchorMin.y
      value: 0.5
      objectReference: {fileID: 0}
    - target: {fileID: 4678676913250523710, guid: 6cbbc06ceb9a9794299a1e06a17c86b2,
        type: 3}
      propertyPath: m_AnchorMax.x
      value: 0.5
      objectReference: {fileID: 0}
    - target: {fileID: 4678676913250523710, guid: 6cbbc06ceb9a9794299a1e06a17c86b2,
        type: 3}
      propertyPath: m_AnchorMax.y
      value: 0.5
      objectReference: {fileID: 0}
    - target: {fileID: 4678676913250523710, guid: 6cbbc06ceb9a9794299a1e06a17c86b2,
        type: 3}
      propertyPath: m_Pivot.x
      value: 0.5
      objectReference: {fileID: 0}
    - target: {fileID: 4678676913250523710, guid: 6cbbc06ceb9a9794299a1e06a17c86b2,
        type: 3}
      propertyPath: m_Pivot.y
      value: 0.5
      objectReference: {fileID: 0}
    - target: {fileID: 8572292734608390408, guid: 6cbbc06ceb9a9794299a1e06a17c86b2,
        type: 3}
      propertyPath: m_IsActive
      value: 0
      objectReference: {fileID: 0}
    - target: {fileID: 8865474348618771260, guid: 6cbbc06ceb9a9794299a1e06a17c86b2,
        type: 3}
      propertyPath: m_textInfo.characterCount
      value: 0
      objectReference: {fileID: 0}
    - target: {fileID: 8865474348618771260, guid: 6cbbc06ceb9a9794299a1e06a17c86b2,
        type: 3}
      propertyPath: m_textInfo.wordCount
      value: 0
      objectReference: {fileID: 0}
    - target: {fileID: 8865474348618771260, guid: 6cbbc06ceb9a9794299a1e06a17c86b2,
        type: 3}
      propertyPath: m_textInfo.lineCount
      value: 0
      objectReference: {fileID: 0}
    - target: {fileID: 8865474348618771260, guid: 6cbbc06ceb9a9794299a1e06a17c86b2,
        type: 3}
      propertyPath: m_textInfo.pageCount
      value: 0
      objectReference: {fileID: 0}
    m_RemovedComponents: []
  m_SourcePrefab: {fileID: 100100000, guid: 6cbbc06ceb9a9794299a1e06a17c86b2, type: 3}
--- !u!224 &3607313649120430247 stripped
RectTransform:
  m_CorrespondingSourceObject: {fileID: 1131754165901552208, guid: 6cbbc06ceb9a9794299a1e06a17c86b2,
    type: 3}
  m_PrefabInstance: {fileID: 4448163128053375735}
  m_PrefabAsset: {fileID: 0}
--- !u!224 &9031673357204125897 stripped
RectTransform:
  m_CorrespondingSourceObject: {fileID: 4678676913250523710, guid: 6cbbc06ceb9a9794299a1e06a17c86b2,
    type: 3}
  m_PrefabInstance: {fileID: 4448163128053375735}
  m_PrefabAsset: {fileID: 0}
--- !u!1001 &4743259275049713640
PrefabInstance:
  m_ObjectHideFlags: 0
  serializedVersion: 2
  m_Modification:
    m_TransformParent: {fileID: 8160197654570126340}
    m_Modifications:
    - target: {fileID: 1131754165901552208, guid: 6cbbc06ceb9a9794299a1e06a17c86b2,
        type: 3}
      propertyPath: m_AnchoredPosition.x
      value: 0
      objectReference: {fileID: 0}
    - target: {fileID: 1131754165901552208, guid: 6cbbc06ceb9a9794299a1e06a17c86b2,
        type: 3}
      propertyPath: m_SizeDelta.x
      value: -8
      objectReference: {fileID: 0}
    - target: {fileID: 1131754165901552208, guid: 6cbbc06ceb9a9794299a1e06a17c86b2,
        type: 3}
      propertyPath: m_AnchoredPosition.y
      value: 0
      objectReference: {fileID: 0}
    - target: {fileID: 1131754165901552208, guid: 6cbbc06ceb9a9794299a1e06a17c86b2,
        type: 3}
      propertyPath: m_SizeDelta.y
      value: -8
      objectReference: {fileID: 0}
    - target: {fileID: 1865149173984279355, guid: 6cbbc06ceb9a9794299a1e06a17c86b2,
        type: 3}
      propertyPath: m_Name
      value: Preset (2)
      objectReference: {fileID: 0}
    - target: {fileID: 3794691817542679349, guid: 6cbbc06ceb9a9794299a1e06a17c86b2,
        type: 3}
      propertyPath: m_Sprite
      value: 
      objectReference: {fileID: 21300000, guid: bb08bd65f2dfbb54e99db59bd3f0bdb6,
        type: 3}
    - target: {fileID: 4678676913250523710, guid: 6cbbc06ceb9a9794299a1e06a17c86b2,
        type: 3}
      propertyPath: m_LocalPosition.x
      value: 0
      objectReference: {fileID: 0}
    - target: {fileID: 4678676913250523710, guid: 6cbbc06ceb9a9794299a1e06a17c86b2,
        type: 3}
      propertyPath: m_LocalPosition.y
      value: 0
      objectReference: {fileID: 0}
    - target: {fileID: 4678676913250523710, guid: 6cbbc06ceb9a9794299a1e06a17c86b2,
        type: 3}
      propertyPath: m_LocalPosition.z
      value: 0
      objectReference: {fileID: 0}
    - target: {fileID: 4678676913250523710, guid: 6cbbc06ceb9a9794299a1e06a17c86b2,
        type: 3}
      propertyPath: m_LocalRotation.x
      value: 0
      objectReference: {fileID: 0}
    - target: {fileID: 4678676913250523710, guid: 6cbbc06ceb9a9794299a1e06a17c86b2,
        type: 3}
      propertyPath: m_LocalRotation.y
      value: 0
      objectReference: {fileID: 0}
    - target: {fileID: 4678676913250523710, guid: 6cbbc06ceb9a9794299a1e06a17c86b2,
        type: 3}
      propertyPath: m_LocalRotation.z
      value: 0
      objectReference: {fileID: 0}
    - target: {fileID: 4678676913250523710, guid: 6cbbc06ceb9a9794299a1e06a17c86b2,
        type: 3}
      propertyPath: m_LocalRotation.w
      value: 1
      objectReference: {fileID: 0}
    - target: {fileID: 4678676913250523710, guid: 6cbbc06ceb9a9794299a1e06a17c86b2,
        type: 3}
      propertyPath: m_RootOrder
      value: 1
      objectReference: {fileID: 0}
    - target: {fileID: 4678676913250523710, guid: 6cbbc06ceb9a9794299a1e06a17c86b2,
        type: 3}
      propertyPath: m_LocalEulerAnglesHint.x
      value: 0
      objectReference: {fileID: 0}
    - target: {fileID: 4678676913250523710, guid: 6cbbc06ceb9a9794299a1e06a17c86b2,
        type: 3}
      propertyPath: m_LocalEulerAnglesHint.y
      value: 0
      objectReference: {fileID: 0}
    - target: {fileID: 4678676913250523710, guid: 6cbbc06ceb9a9794299a1e06a17c86b2,
        type: 3}
      propertyPath: m_LocalEulerAnglesHint.z
      value: 0
      objectReference: {fileID: 0}
    - target: {fileID: 4678676913250523710, guid: 6cbbc06ceb9a9794299a1e06a17c86b2,
        type: 3}
      propertyPath: m_AnchoredPosition.x
      value: -48
      objectReference: {fileID: 0}
    - target: {fileID: 4678676913250523710, guid: 6cbbc06ceb9a9794299a1e06a17c86b2,
        type: 3}
      propertyPath: m_AnchoredPosition.y
      value: 21
      objectReference: {fileID: 0}
    - target: {fileID: 4678676913250523710, guid: 6cbbc06ceb9a9794299a1e06a17c86b2,
        type: 3}
      propertyPath: m_SizeDelta.x
      value: 38
      objectReference: {fileID: 0}
    - target: {fileID: 4678676913250523710, guid: 6cbbc06ceb9a9794299a1e06a17c86b2,
        type: 3}
      propertyPath: m_SizeDelta.y
      value: 38
      objectReference: {fileID: 0}
    - target: {fileID: 4678676913250523710, guid: 6cbbc06ceb9a9794299a1e06a17c86b2,
        type: 3}
      propertyPath: m_AnchorMin.x
      value: 0.5
      objectReference: {fileID: 0}
    - target: {fileID: 4678676913250523710, guid: 6cbbc06ceb9a9794299a1e06a17c86b2,
        type: 3}
      propertyPath: m_AnchorMin.y
      value: 0.5
      objectReference: {fileID: 0}
    - target: {fileID: 4678676913250523710, guid: 6cbbc06ceb9a9794299a1e06a17c86b2,
        type: 3}
      propertyPath: m_AnchorMax.x
      value: 0.5
      objectReference: {fileID: 0}
    - target: {fileID: 4678676913250523710, guid: 6cbbc06ceb9a9794299a1e06a17c86b2,
        type: 3}
      propertyPath: m_AnchorMax.y
      value: 0.5
      objectReference: {fileID: 0}
    - target: {fileID: 4678676913250523710, guid: 6cbbc06ceb9a9794299a1e06a17c86b2,
        type: 3}
      propertyPath: m_Pivot.x
      value: 0.5
      objectReference: {fileID: 0}
    - target: {fileID: 4678676913250523710, guid: 6cbbc06ceb9a9794299a1e06a17c86b2,
        type: 3}
      propertyPath: m_Pivot.y
      value: 0.5
      objectReference: {fileID: 0}
    - target: {fileID: 8572292734608390408, guid: 6cbbc06ceb9a9794299a1e06a17c86b2,
        type: 3}
      propertyPath: m_IsActive
      value: 0
      objectReference: {fileID: 0}
    - target: {fileID: 8865474348618771260, guid: 6cbbc06ceb9a9794299a1e06a17c86b2,
        type: 3}
      propertyPath: m_textInfo.characterCount
      value: 0
      objectReference: {fileID: 0}
    - target: {fileID: 8865474348618771260, guid: 6cbbc06ceb9a9794299a1e06a17c86b2,
        type: 3}
      propertyPath: m_textInfo.wordCount
      value: 0
      objectReference: {fileID: 0}
    - target: {fileID: 8865474348618771260, guid: 6cbbc06ceb9a9794299a1e06a17c86b2,
        type: 3}
      propertyPath: m_textInfo.lineCount
      value: 0
      objectReference: {fileID: 0}
    - target: {fileID: 8865474348618771260, guid: 6cbbc06ceb9a9794299a1e06a17c86b2,
        type: 3}
      propertyPath: m_textInfo.pageCount
      value: 0
      objectReference: {fileID: 0}
    m_RemovedComponents: []
  m_SourcePrefab: {fileID: 100100000, guid: 6cbbc06ceb9a9794299a1e06a17c86b2, type: 3}
--- !u!224 &5649692361094813112 stripped
RectTransform:
  m_CorrespondingSourceObject: {fileID: 1131754165901552208, guid: 6cbbc06ceb9a9794299a1e06a17c86b2,
    type: 3}
  m_PrefabInstance: {fileID: 4743259275049713640}
  m_PrefabAsset: {fileID: 0}
--- !u!224 &89666217726731734 stripped
RectTransform:
  m_CorrespondingSourceObject: {fileID: 4678676913250523710, guid: 6cbbc06ceb9a9794299a1e06a17c86b2,
    type: 3}
  m_PrefabInstance: {fileID: 4743259275049713640}
  m_PrefabAsset: {fileID: 0}
--- !u!1001 &5000984182794078491
PrefabInstance:
  m_ObjectHideFlags: 0
  serializedVersion: 2
  m_Modification:
    m_TransformParent: {fileID: 8160197654570126340}
    m_Modifications:
    - target: {fileID: 1131754165901552208, guid: 6cbbc06ceb9a9794299a1e06a17c86b2,
        type: 3}
      propertyPath: m_AnchoredPosition.x
      value: 0
      objectReference: {fileID: 0}
    - target: {fileID: 1131754165901552208, guid: 6cbbc06ceb9a9794299a1e06a17c86b2,
        type: 3}
      propertyPath: m_SizeDelta.x
      value: -8
      objectReference: {fileID: 0}
    - target: {fileID: 1131754165901552208, guid: 6cbbc06ceb9a9794299a1e06a17c86b2,
        type: 3}
      propertyPath: m_AnchoredPosition.y
      value: 0
      objectReference: {fileID: 0}
    - target: {fileID: 1131754165901552208, guid: 6cbbc06ceb9a9794299a1e06a17c86b2,
        type: 3}
      propertyPath: m_SizeDelta.y
      value: -8
      objectReference: {fileID: 0}
    - target: {fileID: 1865149173984279355, guid: 6cbbc06ceb9a9794299a1e06a17c86b2,
        type: 3}
      propertyPath: m_Name
      value: Preset (3)
      objectReference: {fileID: 0}
    - target: {fileID: 3794691817542679349, guid: 6cbbc06ceb9a9794299a1e06a17c86b2,
        type: 3}
      propertyPath: m_Sprite
      value: 
      objectReference: {fileID: 21300000, guid: bb08bd65f2dfbb54e99db59bd3f0bdb6,
        type: 3}
    - target: {fileID: 4678676913250523710, guid: 6cbbc06ceb9a9794299a1e06a17c86b2,
        type: 3}
      propertyPath: m_LocalPosition.x
      value: 0
      objectReference: {fileID: 0}
    - target: {fileID: 4678676913250523710, guid: 6cbbc06ceb9a9794299a1e06a17c86b2,
        type: 3}
      propertyPath: m_LocalPosition.y
      value: 0
      objectReference: {fileID: 0}
    - target: {fileID: 4678676913250523710, guid: 6cbbc06ceb9a9794299a1e06a17c86b2,
        type: 3}
      propertyPath: m_LocalPosition.z
      value: 0
      objectReference: {fileID: 0}
    - target: {fileID: 4678676913250523710, guid: 6cbbc06ceb9a9794299a1e06a17c86b2,
        type: 3}
      propertyPath: m_LocalRotation.x
      value: 0
      objectReference: {fileID: 0}
    - target: {fileID: 4678676913250523710, guid: 6cbbc06ceb9a9794299a1e06a17c86b2,
        type: 3}
      propertyPath: m_LocalRotation.y
      value: 0
      objectReference: {fileID: 0}
    - target: {fileID: 4678676913250523710, guid: 6cbbc06ceb9a9794299a1e06a17c86b2,
        type: 3}
      propertyPath: m_LocalRotation.z
      value: 0
      objectReference: {fileID: 0}
    - target: {fileID: 4678676913250523710, guid: 6cbbc06ceb9a9794299a1e06a17c86b2,
        type: 3}
      propertyPath: m_LocalRotation.w
      value: 1
      objectReference: {fileID: 0}
    - target: {fileID: 4678676913250523710, guid: 6cbbc06ceb9a9794299a1e06a17c86b2,
        type: 3}
      propertyPath: m_RootOrder
      value: 4
      objectReference: {fileID: 0}
    - target: {fileID: 4678676913250523710, guid: 6cbbc06ceb9a9794299a1e06a17c86b2,
        type: 3}
      propertyPath: m_LocalEulerAnglesHint.x
      value: 0
      objectReference: {fileID: 0}
    - target: {fileID: 4678676913250523710, guid: 6cbbc06ceb9a9794299a1e06a17c86b2,
        type: 3}
      propertyPath: m_LocalEulerAnglesHint.y
      value: 0
      objectReference: {fileID: 0}
    - target: {fileID: 4678676913250523710, guid: 6cbbc06ceb9a9794299a1e06a17c86b2,
        type: 3}
      propertyPath: m_LocalEulerAnglesHint.z
      value: 0
      objectReference: {fileID: 0}
    - target: {fileID: 4678676913250523710, guid: 6cbbc06ceb9a9794299a1e06a17c86b2,
        type: 3}
      propertyPath: m_AnchoredPosition.x
      value: 48
      objectReference: {fileID: 0}
    - target: {fileID: 4678676913250523710, guid: 6cbbc06ceb9a9794299a1e06a17c86b2,
        type: 3}
      propertyPath: m_AnchoredPosition.y
      value: 21
      objectReference: {fileID: 0}
    - target: {fileID: 4678676913250523710, guid: 6cbbc06ceb9a9794299a1e06a17c86b2,
        type: 3}
      propertyPath: m_SizeDelta.x
      value: 38
      objectReference: {fileID: 0}
    - target: {fileID: 4678676913250523710, guid: 6cbbc06ceb9a9794299a1e06a17c86b2,
        type: 3}
      propertyPath: m_SizeDelta.y
      value: 38
      objectReference: {fileID: 0}
    - target: {fileID: 4678676913250523710, guid: 6cbbc06ceb9a9794299a1e06a17c86b2,
        type: 3}
      propertyPath: m_AnchorMin.x
      value: 0.5
      objectReference: {fileID: 0}
    - target: {fileID: 4678676913250523710, guid: 6cbbc06ceb9a9794299a1e06a17c86b2,
        type: 3}
      propertyPath: m_AnchorMin.y
      value: 0.5
      objectReference: {fileID: 0}
    - target: {fileID: 4678676913250523710, guid: 6cbbc06ceb9a9794299a1e06a17c86b2,
        type: 3}
      propertyPath: m_AnchorMax.x
      value: 0.5
      objectReference: {fileID: 0}
    - target: {fileID: 4678676913250523710, guid: 6cbbc06ceb9a9794299a1e06a17c86b2,
        type: 3}
      propertyPath: m_AnchorMax.y
      value: 0.5
      objectReference: {fileID: 0}
    - target: {fileID: 4678676913250523710, guid: 6cbbc06ceb9a9794299a1e06a17c86b2,
        type: 3}
      propertyPath: m_Pivot.x
      value: 0.5
      objectReference: {fileID: 0}
    - target: {fileID: 4678676913250523710, guid: 6cbbc06ceb9a9794299a1e06a17c86b2,
        type: 3}
      propertyPath: m_Pivot.y
      value: 0.5
      objectReference: {fileID: 0}
    - target: {fileID: 8572292734608390408, guid: 6cbbc06ceb9a9794299a1e06a17c86b2,
        type: 3}
      propertyPath: m_IsActive
      value: 0
      objectReference: {fileID: 0}
    - target: {fileID: 8865474348618771260, guid: 6cbbc06ceb9a9794299a1e06a17c86b2,
        type: 3}
      propertyPath: m_textInfo.characterCount
      value: 0
      objectReference: {fileID: 0}
    - target: {fileID: 8865474348618771260, guid: 6cbbc06ceb9a9794299a1e06a17c86b2,
        type: 3}
      propertyPath: m_textInfo.wordCount
      value: 0
      objectReference: {fileID: 0}
    - target: {fileID: 8865474348618771260, guid: 6cbbc06ceb9a9794299a1e06a17c86b2,
        type: 3}
      propertyPath: m_textInfo.lineCount
      value: 0
      objectReference: {fileID: 0}
    - target: {fileID: 8865474348618771260, guid: 6cbbc06ceb9a9794299a1e06a17c86b2,
        type: 3}
      propertyPath: m_textInfo.pageCount
      value: 0
      objectReference: {fileID: 0}
    m_RemovedComponents: []
  m_SourcePrefab: {fileID: 100100000, guid: 6cbbc06ceb9a9794299a1e06a17c86b2, type: 3}
--- !u!224 &399394588149125925 stripped
RectTransform:
  m_CorrespondingSourceObject: {fileID: 4678676913250523710, guid: 6cbbc06ceb9a9794299a1e06a17c86b2,
    type: 3}
  m_PrefabInstance: {fileID: 5000984182794078491}
  m_PrefabAsset: {fileID: 0}
--- !u!224 &5391896122801824587 stripped
RectTransform:
  m_CorrespondingSourceObject: {fileID: 1131754165901552208, guid: 6cbbc06ceb9a9794299a1e06a17c86b2,
    type: 3}
  m_PrefabInstance: {fileID: 5000984182794078491}
  m_PrefabAsset: {fileID: 0}
--- !u!1001 &5214284338152189085
PrefabInstance:
  m_ObjectHideFlags: 0
  serializedVersion: 2
  m_Modification:
    m_TransformParent: {fileID: 2995849000346883717}
    m_Modifications:
    - target: {fileID: 1865149173984279355, guid: f80853092f7773849b0f9de99a6fda6f,
        type: 3}
      propertyPath: m_Name
      value: Text Input
      objectReference: {fileID: 0}
    - target: {fileID: 3716610539585478986, guid: f80853092f7773849b0f9de99a6fda6f,
        type: 3}
      propertyPath: m_AnchoredPosition.x
      value: 0
      objectReference: {fileID: 0}
    - target: {fileID: 3716610539585478986, guid: f80853092f7773849b0f9de99a6fda6f,
        type: 3}
      propertyPath: m_SizeDelta.x
      value: 0
      objectReference: {fileID: 0}
    - target: {fileID: 3716610539585478986, guid: f80853092f7773849b0f9de99a6fda6f,
        type: 3}
      propertyPath: m_AnchorMax.y
      value: 1
      objectReference: {fileID: 0}
    - target: {fileID: 3716610539585478986, guid: f80853092f7773849b0f9de99a6fda6f,
        type: 3}
      propertyPath: m_AnchoredPosition.y
      value: 0
      objectReference: {fileID: 0}
    - target: {fileID: 3716610539585478986, guid: f80853092f7773849b0f9de99a6fda6f,
        type: 3}
      propertyPath: m_SizeDelta.y
      value: -8
      objectReference: {fileID: 0}
    - target: {fileID: 4678676913250523710, guid: f80853092f7773849b0f9de99a6fda6f,
        type: 3}
      propertyPath: m_LocalPosition.x
      value: 0
      objectReference: {fileID: 0}
    - target: {fileID: 4678676913250523710, guid: f80853092f7773849b0f9de99a6fda6f,
        type: 3}
      propertyPath: m_LocalPosition.y
      value: 0
      objectReference: {fileID: 0}
    - target: {fileID: 4678676913250523710, guid: f80853092f7773849b0f9de99a6fda6f,
        type: 3}
      propertyPath: m_LocalPosition.z
      value: 0
      objectReference: {fileID: 0}
    - target: {fileID: 4678676913250523710, guid: f80853092f7773849b0f9de99a6fda6f,
        type: 3}
      propertyPath: m_LocalRotation.x
      value: 0
      objectReference: {fileID: 0}
    - target: {fileID: 4678676913250523710, guid: f80853092f7773849b0f9de99a6fda6f,
        type: 3}
      propertyPath: m_LocalRotation.y
      value: 0
      objectReference: {fileID: 0}
    - target: {fileID: 4678676913250523710, guid: f80853092f7773849b0f9de99a6fda6f,
        type: 3}
      propertyPath: m_LocalRotation.z
      value: 0
      objectReference: {fileID: 0}
    - target: {fileID: 4678676913250523710, guid: f80853092f7773849b0f9de99a6fda6f,
        type: 3}
      propertyPath: m_LocalRotation.w
      value: 1
      objectReference: {fileID: 0}
    - target: {fileID: 4678676913250523710, guid: f80853092f7773849b0f9de99a6fda6f,
        type: 3}
      propertyPath: m_RootOrder
      value: 1
      objectReference: {fileID: 0}
    - target: {fileID: 4678676913250523710, guid: f80853092f7773849b0f9de99a6fda6f,
        type: 3}
      propertyPath: m_LocalEulerAnglesHint.x
      value: 0
      objectReference: {fileID: 0}
    - target: {fileID: 4678676913250523710, guid: f80853092f7773849b0f9de99a6fda6f,
        type: 3}
      propertyPath: m_LocalEulerAnglesHint.y
      value: 0
      objectReference: {fileID: 0}
    - target: {fileID: 4678676913250523710, guid: f80853092f7773849b0f9de99a6fda6f,
        type: 3}
      propertyPath: m_LocalEulerAnglesHint.z
      value: 0
      objectReference: {fileID: 0}
    - target: {fileID: 4678676913250523710, guid: f80853092f7773849b0f9de99a6fda6f,
        type: 3}
      propertyPath: m_AnchoredPosition.x
      value: 0
      objectReference: {fileID: 0}
    - target: {fileID: 4678676913250523710, guid: f80853092f7773849b0f9de99a6fda6f,
        type: 3}
      propertyPath: m_AnchoredPosition.y
      value: -26.1
      objectReference: {fileID: 0}
    - target: {fileID: 4678676913250523710, guid: f80853092f7773849b0f9de99a6fda6f,
        type: 3}
      propertyPath: m_SizeDelta.x
      value: 83.9
      objectReference: {fileID: 0}
    - target: {fileID: 4678676913250523710, guid: f80853092f7773849b0f9de99a6fda6f,
        type: 3}
      propertyPath: m_SizeDelta.y
      value: 24
      objectReference: {fileID: 0}
    - target: {fileID: 4678676913250523710, guid: f80853092f7773849b0f9de99a6fda6f,
        type: 3}
      propertyPath: m_AnchorMin.x
      value: 0.5
      objectReference: {fileID: 0}
    - target: {fileID: 4678676913250523710, guid: f80853092f7773849b0f9de99a6fda6f,
        type: 3}
      propertyPath: m_AnchorMin.y
      value: 0.5
      objectReference: {fileID: 0}
    - target: {fileID: 4678676913250523710, guid: f80853092f7773849b0f9de99a6fda6f,
        type: 3}
      propertyPath: m_AnchorMax.x
      value: 0.5
      objectReference: {fileID: 0}
    - target: {fileID: 4678676913250523710, guid: f80853092f7773849b0f9de99a6fda6f,
        type: 3}
      propertyPath: m_AnchorMax.y
      value: 0.5
      objectReference: {fileID: 0}
    - target: {fileID: 4678676913250523710, guid: f80853092f7773849b0f9de99a6fda6f,
        type: 3}
      propertyPath: m_Pivot.x
      value: 0.5
      objectReference: {fileID: 0}
    - target: {fileID: 4678676913250523710, guid: f80853092f7773849b0f9de99a6fda6f,
        type: 3}
      propertyPath: m_Pivot.y
      value: 0.5
      objectReference: {fileID: 0}
    - target: {fileID: 6889362254512242533, guid: f80853092f7773849b0f9de99a6fda6f,
        type: 3}
      propertyPath: m_IsActive
      value: 0
      objectReference: {fileID: 0}
    - target: {fileID: 7329113136387813182, guid: f80853092f7773849b0f9de99a6fda6f,
        type: 3}
      propertyPath: textChanged.m_PersistentCalls.m_Calls.Array.size
      value: 1
      objectReference: {fileID: 0}
    - target: {fileID: 7329113136387813182, guid: f80853092f7773849b0f9de99a6fda6f,
        type: 3}
      propertyPath: button
      value: 
      objectReference: {fileID: 2473876514043969868}
    - target: {fileID: 7329113136387813182, guid: f80853092f7773849b0f9de99a6fda6f,
        type: 3}
      propertyPath: text
      value: 
      objectReference: {fileID: 3698763748470933409}
    - target: {fileID: 7329113136387813182, guid: f80853092f7773849b0f9de99a6fda6f,
        type: 3}
      propertyPath: textChanged.m_PersistentCalls.m_Calls.Array.data[0].m_Mode
      value: 0
      objectReference: {fileID: 0}
    - target: {fileID: 7329113136387813182, guid: f80853092f7773849b0f9de99a6fda6f,
        type: 3}
      propertyPath: textChanged.m_PersistentCalls.m_Calls.Array.data[0].m_CallState
      value: 2
      objectReference: {fileID: 0}
    - target: {fileID: 7329113136387813182, guid: f80853092f7773849b0f9de99a6fda6f,
        type: 3}
      propertyPath: textChanged.m_PersistentCalls.m_Calls.Array.data[0].m_Target
      value: 
      objectReference: {fileID: 3950169718981263475}
    - target: {fileID: 7329113136387813182, guid: f80853092f7773849b0f9de99a6fda6f,
        type: 3}
      propertyPath: textChanged.m_PersistentCalls.m_Calls.Array.data[0].m_MethodName
      value: SetPlayerName
      objectReference: {fileID: 0}
    - target: {fileID: 7329113136387813182, guid: f80853092f7773849b0f9de99a6fda6f,
        type: 3}
      propertyPath: textChanged.m_PersistentCalls.m_Calls.Array.data[0].m_Arguments.m_ObjectArgumentAssemblyTypeName
      value: UnityEngine.Object, UnityEngine
      objectReference: {fileID: 0}
    - target: {fileID: 8142062345457763529, guid: f80853092f7773849b0f9de99a6fda6f,
        type: 3}
      propertyPath: m_SizeDelta.x
      value: 16
      objectReference: {fileID: 0}
    - target: {fileID: 8142062345457763529, guid: f80853092f7773849b0f9de99a6fda6f,
        type: 3}
      propertyPath: m_SizeDelta.y
      value: 16
      objectReference: {fileID: 0}
    - target: {fileID: 8142062345457763529, guid: f80853092f7773849b0f9de99a6fda6f,
        type: 3}
      propertyPath: m_AnchoredPosition.x
      value: 11.3
      objectReference: {fileID: 0}
    - target: {fileID: 8865474348618771260, guid: f80853092f7773849b0f9de99a6fda6f,
        type: 3}
      propertyPath: m_textInfo.characterCount
      value: 6
      objectReference: {fileID: 0}
    - target: {fileID: 8865474348618771260, guid: f80853092f7773849b0f9de99a6fda6f,
        type: 3}
      propertyPath: m_textInfo.wordCount
      value: 1
      objectReference: {fileID: 0}
    - target: {fileID: 8865474348618771260, guid: f80853092f7773849b0f9de99a6fda6f,
        type: 3}
      propertyPath: m_textInfo.lineCount
      value: 1
      objectReference: {fileID: 0}
    - target: {fileID: 8865474348618771260, guid: f80853092f7773849b0f9de99a6fda6f,
        type: 3}
      propertyPath: m_textInfo.pageCount
      value: 1
      objectReference: {fileID: 0}
    - target: {fileID: 8865474348618771260, guid: f80853092f7773849b0f9de99a6fda6f,
        type: 3}
      propertyPath: m_fontSize
      value: 13.1
      objectReference: {fileID: 0}
    - target: {fileID: 8865474348618771260, guid: f80853092f7773849b0f9de99a6fda6f,
        type: 3}
      propertyPath: m_fontSizeBase
      value: 16
      objectReference: {fileID: 0}
    - target: {fileID: 8865474348618771260, guid: f80853092f7773849b0f9de99a6fda6f,
        type: 3}
      propertyPath: m_firstOverflowCharacterIndex
      value: -1
      objectReference: {fileID: 0}
    - target: {fileID: 8865474348618771260, guid: f80853092f7773849b0f9de99a6fda6f,
        type: 3}
      propertyPath: m_margin.z
      value: -0.08469391
      objectReference: {fileID: 0}
    - target: {fileID: 8865474348618771260, guid: f80853092f7773849b0f9de99a6fda6f,
        type: 3}
      propertyPath: m_margin.x
      value: 0.17295074
      objectReference: {fileID: 0}
    - target: {fileID: 8865474348618771260, guid: f80853092f7773849b0f9de99a6fda6f,
        type: 3}
      propertyPath: m_fontStyle
      value: 0
      objectReference: {fileID: 0}
    - target: {fileID: 8865474348618771260, guid: f80853092f7773849b0f9de99a6fda6f,
        type: 3}
      propertyPath: m_textAlignment
      value: 514
      objectReference: {fileID: 0}
    - target: {fileID: 8865474348618771260, guid: f80853092f7773849b0f9de99a6fda6f,
        type: 3}
      propertyPath: m_enableAutoSizing
      value: 1
      objectReference: {fileID: 0}
    - target: {fileID: 8865474348618771260, guid: f80853092f7773849b0f9de99a6fda6f,
        type: 3}
      propertyPath: m_fontSizeMin
      value: 12
      objectReference: {fileID: 0}
    m_RemovedComponents: []
  m_SourcePrefab: {fileID: 100100000, guid: f80853092f7773849b0f9de99a6fda6f, type: 3}
--- !u!114 &3698763748470933409 stripped
MonoBehaviour:
  m_CorrespondingSourceObject: {fileID: 8865474348618771260, guid: f80853092f7773849b0f9de99a6fda6f,
    type: 3}
  m_PrefabInstance: {fileID: 5214284338152189085}
  m_PrefabAsset: {fileID: 0}
  m_GameObject: {fileID: 0}
  m_Enabled: 1
  m_EditorHideFlags: 0
  m_Script: {fileID: 11500000, guid: f4688fdb7df04437aeb418b961361dc5, type: 3}
  m_Name: 
  m_EditorClassIdentifier: 
--- !u!224 &626321575459681955 stripped
RectTransform:
  m_CorrespondingSourceObject: {fileID: 4678676913250523710, guid: f80853092f7773849b0f9de99a6fda6f,
    type: 3}
  m_PrefabInstance: {fileID: 5214284338152189085}
  m_PrefabAsset: {fileID: 0}
--- !u!114 &2473876514043969868 stripped
MonoBehaviour:
  m_CorrespondingSourceObject: {fileID: 7640394630935375313, guid: f80853092f7773849b0f9de99a6fda6f,
    type: 3}
  m_PrefabInstance: {fileID: 5214284338152189085}
  m_PrefabAsset: {fileID: 0}
  m_GameObject: {fileID: 0}
  m_Enabled: 1
  m_EditorHideFlags: 0
  m_Script: {fileID: 11500000, guid: 4e29b1a8efbd4b44bb3f3716e73f07ff, type: 3}
  m_Name: 
  m_EditorClassIdentifier: 
--- !u!1001 &7586888492798254933
PrefabInstance:
  m_ObjectHideFlags: 0
  serializedVersion: 2
  m_Modification:
    m_TransformParent: {fileID: 8160197654570126340}
    m_Modifications:
    - target: {fileID: 1131754165901552208, guid: 6cbbc06ceb9a9794299a1e06a17c86b2,
        type: 3}
      propertyPath: m_AnchoredPosition.x
      value: 0
      objectReference: {fileID: 0}
    - target: {fileID: 1131754165901552208, guid: 6cbbc06ceb9a9794299a1e06a17c86b2,
        type: 3}
      propertyPath: m_SizeDelta.x
      value: -8
      objectReference: {fileID: 0}
    - target: {fileID: 1131754165901552208, guid: 6cbbc06ceb9a9794299a1e06a17c86b2,
        type: 3}
      propertyPath: m_AnchoredPosition.y
      value: 0
      objectReference: {fileID: 0}
    - target: {fileID: 1131754165901552208, guid: 6cbbc06ceb9a9794299a1e06a17c86b2,
        type: 3}
      propertyPath: m_SizeDelta.y
      value: -8
      objectReference: {fileID: 0}
    - target: {fileID: 1865149173984279355, guid: 6cbbc06ceb9a9794299a1e06a17c86b2,
        type: 3}
      propertyPath: m_Name
      value: Preset (6)
      objectReference: {fileID: 0}
    - target: {fileID: 3794691817542679349, guid: 6cbbc06ceb9a9794299a1e06a17c86b2,
        type: 3}
      propertyPath: m_Sprite
      value: 
      objectReference: {fileID: 21300000, guid: bb08bd65f2dfbb54e99db59bd3f0bdb6,
        type: 3}
    - target: {fileID: 4678676913250523710, guid: 6cbbc06ceb9a9794299a1e06a17c86b2,
        type: 3}
      propertyPath: m_LocalPosition.x
      value: 0
      objectReference: {fileID: 0}
    - target: {fileID: 4678676913250523710, guid: 6cbbc06ceb9a9794299a1e06a17c86b2,
        type: 3}
      propertyPath: m_LocalPosition.y
      value: 0
      objectReference: {fileID: 0}
    - target: {fileID: 4678676913250523710, guid: 6cbbc06ceb9a9794299a1e06a17c86b2,
        type: 3}
      propertyPath: m_LocalPosition.z
      value: 0
      objectReference: {fileID: 0}
    - target: {fileID: 4678676913250523710, guid: 6cbbc06ceb9a9794299a1e06a17c86b2,
        type: 3}
      propertyPath: m_LocalRotation.x
      value: 0
      objectReference: {fileID: 0}
    - target: {fileID: 4678676913250523710, guid: 6cbbc06ceb9a9794299a1e06a17c86b2,
        type: 3}
      propertyPath: m_LocalRotation.y
      value: 0
      objectReference: {fileID: 0}
    - target: {fileID: 4678676913250523710, guid: 6cbbc06ceb9a9794299a1e06a17c86b2,
        type: 3}
      propertyPath: m_LocalRotation.z
      value: 0
      objectReference: {fileID: 0}
    - target: {fileID: 4678676913250523710, guid: 6cbbc06ceb9a9794299a1e06a17c86b2,
        type: 3}
      propertyPath: m_LocalRotation.w
      value: 1
      objectReference: {fileID: 0}
    - target: {fileID: 4678676913250523710, guid: 6cbbc06ceb9a9794299a1e06a17c86b2,
        type: 3}
      propertyPath: m_RootOrder
      value: 7
      objectReference: {fileID: 0}
    - target: {fileID: 4678676913250523710, guid: 6cbbc06ceb9a9794299a1e06a17c86b2,
        type: 3}
      propertyPath: m_LocalEulerAnglesHint.x
      value: 0
      objectReference: {fileID: 0}
    - target: {fileID: 4678676913250523710, guid: 6cbbc06ceb9a9794299a1e06a17c86b2,
        type: 3}
      propertyPath: m_LocalEulerAnglesHint.y
      value: 0
      objectReference: {fileID: 0}
    - target: {fileID: 4678676913250523710, guid: 6cbbc06ceb9a9794299a1e06a17c86b2,
        type: 3}
      propertyPath: m_LocalEulerAnglesHint.z
      value: 0
      objectReference: {fileID: 0}
    - target: {fileID: 4678676913250523710, guid: 6cbbc06ceb9a9794299a1e06a17c86b2,
        type: 3}
      propertyPath: m_AnchoredPosition.x
      value: -70
      objectReference: {fileID: 0}
    - target: {fileID: 4678676913250523710, guid: 6cbbc06ceb9a9794299a1e06a17c86b2,
        type: 3}
      propertyPath: m_AnchoredPosition.y
      value: -16
      objectReference: {fileID: 0}
    - target: {fileID: 4678676913250523710, guid: 6cbbc06ceb9a9794299a1e06a17c86b2,
        type: 3}
      propertyPath: m_SizeDelta.x
      value: 38
      objectReference: {fileID: 0}
    - target: {fileID: 4678676913250523710, guid: 6cbbc06ceb9a9794299a1e06a17c86b2,
        type: 3}
      propertyPath: m_SizeDelta.y
      value: 38
      objectReference: {fileID: 0}
    - target: {fileID: 4678676913250523710, guid: 6cbbc06ceb9a9794299a1e06a17c86b2,
        type: 3}
      propertyPath: m_AnchorMin.x
      value: 0.5
      objectReference: {fileID: 0}
    - target: {fileID: 4678676913250523710, guid: 6cbbc06ceb9a9794299a1e06a17c86b2,
        type: 3}
      propertyPath: m_AnchorMin.y
      value: 0.5
      objectReference: {fileID: 0}
    - target: {fileID: 4678676913250523710, guid: 6cbbc06ceb9a9794299a1e06a17c86b2,
        type: 3}
      propertyPath: m_AnchorMax.x
      value: 0.5
      objectReference: {fileID: 0}
    - target: {fileID: 4678676913250523710, guid: 6cbbc06ceb9a9794299a1e06a17c86b2,
        type: 3}
      propertyPath: m_AnchorMax.y
      value: 0.5
      objectReference: {fileID: 0}
    - target: {fileID: 4678676913250523710, guid: 6cbbc06ceb9a9794299a1e06a17c86b2,
        type: 3}
      propertyPath: m_Pivot.x
      value: 0.5
      objectReference: {fileID: 0}
    - target: {fileID: 4678676913250523710, guid: 6cbbc06ceb9a9794299a1e06a17c86b2,
        type: 3}
      propertyPath: m_Pivot.y
      value: 0.5
      objectReference: {fileID: 0}
    - target: {fileID: 8572292734608390408, guid: 6cbbc06ceb9a9794299a1e06a17c86b2,
        type: 3}
      propertyPath: m_IsActive
      value: 0
      objectReference: {fileID: 0}
    - target: {fileID: 8865474348618771260, guid: 6cbbc06ceb9a9794299a1e06a17c86b2,
        type: 3}
      propertyPath: m_textInfo.characterCount
      value: 0
      objectReference: {fileID: 0}
    - target: {fileID: 8865474348618771260, guid: 6cbbc06ceb9a9794299a1e06a17c86b2,
        type: 3}
      propertyPath: m_textInfo.wordCount
      value: 0
      objectReference: {fileID: 0}
    - target: {fileID: 8865474348618771260, guid: 6cbbc06ceb9a9794299a1e06a17c86b2,
        type: 3}
      propertyPath: m_textInfo.lineCount
      value: 0
      objectReference: {fileID: 0}
    - target: {fileID: 8865474348618771260, guid: 6cbbc06ceb9a9794299a1e06a17c86b2,
        type: 3}
      propertyPath: m_textInfo.pageCount
      value: 0
      objectReference: {fileID: 0}
    m_RemovedComponents: []
  m_SourcePrefab: {fileID: 100100000, guid: 6cbbc06ceb9a9794299a1e06a17c86b2, type: 3}
--- !u!224 &3001637324152063339 stripped
RectTransform:
  m_CorrespondingSourceObject: {fileID: 4678676913250523710, guid: 6cbbc06ceb9a9794299a1e06a17c86b2,
    type: 3}
  m_PrefabInstance: {fileID: 7586888492798254933}
  m_PrefabAsset: {fileID: 0}
--- !u!224 &7421587531895698693 stripped
RectTransform:
  m_CorrespondingSourceObject: {fileID: 1131754165901552208, guid: 6cbbc06ceb9a9794299a1e06a17c86b2,
    type: 3}
  m_PrefabInstance: {fileID: 7586888492798254933}
  m_PrefabAsset: {fileID: 0}
--- !u!1001 &8328874843188495235
PrefabInstance:
  m_ObjectHideFlags: 0
  serializedVersion: 2
  m_Modification:
    m_TransformParent: {fileID: 8160197654570126340}
    m_Modifications:
    - target: {fileID: 1131754165901552208, guid: 6cbbc06ceb9a9794299a1e06a17c86b2,
        type: 3}
      propertyPath: m_AnchoredPosition.x
      value: 0
      objectReference: {fileID: 0}
    - target: {fileID: 1131754165901552208, guid: 6cbbc06ceb9a9794299a1e06a17c86b2,
        type: 3}
      propertyPath: m_SizeDelta.x
      value: -8
      objectReference: {fileID: 0}
    - target: {fileID: 1131754165901552208, guid: 6cbbc06ceb9a9794299a1e06a17c86b2,
        type: 3}
      propertyPath: m_AnchoredPosition.y
      value: 0
      objectReference: {fileID: 0}
    - target: {fileID: 1131754165901552208, guid: 6cbbc06ceb9a9794299a1e06a17c86b2,
        type: 3}
      propertyPath: m_SizeDelta.y
      value: -8
      objectReference: {fileID: 0}
    - target: {fileID: 1865149173984279355, guid: 6cbbc06ceb9a9794299a1e06a17c86b2,
        type: 3}
      propertyPath: m_Name
      value: Preset (1)
      objectReference: {fileID: 0}
    - target: {fileID: 3794691817542679349, guid: 6cbbc06ceb9a9794299a1e06a17c86b2,
        type: 3}
      propertyPath: m_Sprite
      value: 
      objectReference: {fileID: 21300000, guid: bb08bd65f2dfbb54e99db59bd3f0bdb6,
        type: 3}
    - target: {fileID: 4678676913250523710, guid: 6cbbc06ceb9a9794299a1e06a17c86b2,
        type: 3}
      propertyPath: m_LocalPosition.x
      value: 0
      objectReference: {fileID: 0}
    - target: {fileID: 4678676913250523710, guid: 6cbbc06ceb9a9794299a1e06a17c86b2,
        type: 3}
      propertyPath: m_LocalPosition.y
      value: 0
      objectReference: {fileID: 0}
    - target: {fileID: 4678676913250523710, guid: 6cbbc06ceb9a9794299a1e06a17c86b2,
        type: 3}
      propertyPath: m_LocalPosition.z
      value: 0
      objectReference: {fileID: 0}
    - target: {fileID: 4678676913250523710, guid: 6cbbc06ceb9a9794299a1e06a17c86b2,
        type: 3}
      propertyPath: m_LocalRotation.x
      value: 0
      objectReference: {fileID: 0}
    - target: {fileID: 4678676913250523710, guid: 6cbbc06ceb9a9794299a1e06a17c86b2,
        type: 3}
      propertyPath: m_LocalRotation.y
      value: 0
      objectReference: {fileID: 0}
    - target: {fileID: 4678676913250523710, guid: 6cbbc06ceb9a9794299a1e06a17c86b2,
        type: 3}
      propertyPath: m_LocalRotation.z
      value: 0
      objectReference: {fileID: 0}
    - target: {fileID: 4678676913250523710, guid: 6cbbc06ceb9a9794299a1e06a17c86b2,
        type: 3}
      propertyPath: m_LocalRotation.w
      value: 1
      objectReference: {fileID: 0}
    - target: {fileID: 4678676913250523710, guid: 6cbbc06ceb9a9794299a1e06a17c86b2,
        type: 3}
      propertyPath: m_RootOrder
      value: 0
      objectReference: {fileID: 0}
    - target: {fileID: 4678676913250523710, guid: 6cbbc06ceb9a9794299a1e06a17c86b2,
        type: 3}
      propertyPath: m_LocalEulerAnglesHint.x
      value: 0
      objectReference: {fileID: 0}
    - target: {fileID: 4678676913250523710, guid: 6cbbc06ceb9a9794299a1e06a17c86b2,
        type: 3}
      propertyPath: m_LocalEulerAnglesHint.y
      value: 0
      objectReference: {fileID: 0}
    - target: {fileID: 4678676913250523710, guid: 6cbbc06ceb9a9794299a1e06a17c86b2,
        type: 3}
      propertyPath: m_LocalEulerAnglesHint.z
      value: 0
      objectReference: {fileID: 0}
    - target: {fileID: 4678676913250523710, guid: 6cbbc06ceb9a9794299a1e06a17c86b2,
        type: 3}
      propertyPath: m_AnchoredPosition.x
      value: -92
      objectReference: {fileID: 0}
    - target: {fileID: 4678676913250523710, guid: 6cbbc06ceb9a9794299a1e06a17c86b2,
        type: 3}
      propertyPath: m_AnchoredPosition.y
      value: 21
      objectReference: {fileID: 0}
    - target: {fileID: 4678676913250523710, guid: 6cbbc06ceb9a9794299a1e06a17c86b2,
        type: 3}
      propertyPath: m_SizeDelta.x
      value: 38
      objectReference: {fileID: 0}
    - target: {fileID: 4678676913250523710, guid: 6cbbc06ceb9a9794299a1e06a17c86b2,
        type: 3}
      propertyPath: m_SizeDelta.y
      value: 38
      objectReference: {fileID: 0}
    - target: {fileID: 4678676913250523710, guid: 6cbbc06ceb9a9794299a1e06a17c86b2,
        type: 3}
      propertyPath: m_AnchorMin.x
      value: 0.5
      objectReference: {fileID: 0}
    - target: {fileID: 4678676913250523710, guid: 6cbbc06ceb9a9794299a1e06a17c86b2,
        type: 3}
      propertyPath: m_AnchorMin.y
      value: 0.5
      objectReference: {fileID: 0}
    - target: {fileID: 4678676913250523710, guid: 6cbbc06ceb9a9794299a1e06a17c86b2,
        type: 3}
      propertyPath: m_AnchorMax.x
      value: 0.5
      objectReference: {fileID: 0}
    - target: {fileID: 4678676913250523710, guid: 6cbbc06ceb9a9794299a1e06a17c86b2,
        type: 3}
      propertyPath: m_AnchorMax.y
      value: 0.5
      objectReference: {fileID: 0}
    - target: {fileID: 4678676913250523710, guid: 6cbbc06ceb9a9794299a1e06a17c86b2,
        type: 3}
      propertyPath: m_Pivot.x
      value: 0.5
      objectReference: {fileID: 0}
    - target: {fileID: 4678676913250523710, guid: 6cbbc06ceb9a9794299a1e06a17c86b2,
        type: 3}
      propertyPath: m_Pivot.y
      value: 0.5
      objectReference: {fileID: 0}
    - target: {fileID: 8572292734608390408, guid: 6cbbc06ceb9a9794299a1e06a17c86b2,
        type: 3}
      propertyPath: m_IsActive
      value: 0
      objectReference: {fileID: 0}
    - target: {fileID: 8865474348618771260, guid: 6cbbc06ceb9a9794299a1e06a17c86b2,
        type: 3}
      propertyPath: m_textInfo.characterCount
      value: 6
      objectReference: {fileID: 0}
    - target: {fileID: 8865474348618771260, guid: 6cbbc06ceb9a9794299a1e06a17c86b2,
        type: 3}
      propertyPath: m_textInfo.wordCount
      value: 1
      objectReference: {fileID: 0}
    - target: {fileID: 8865474348618771260, guid: 6cbbc06ceb9a9794299a1e06a17c86b2,
        type: 3}
      propertyPath: m_textInfo.lineCount
      value: 1
      objectReference: {fileID: 0}
    - target: {fileID: 8865474348618771260, guid: 6cbbc06ceb9a9794299a1e06a17c86b2,
        type: 3}
      propertyPath: m_textInfo.pageCount
      value: 1
      objectReference: {fileID: 0}
    m_RemovedComponents: []
  m_SourcePrefab: {fileID: 100100000, guid: 6cbbc06ceb9a9794299a1e06a17c86b2, type: 3}
--- !u!224 &8944949168079727059 stripped
RectTransform:
  m_CorrespondingSourceObject: {fileID: 1131754165901552208, guid: 6cbbc06ceb9a9794299a1e06a17c86b2,
    type: 3}
  m_PrefabInstance: {fileID: 8328874843188495235}
  m_PrefabAsset: {fileID: 0}
--- !u!224 &3709809782797785533 stripped
RectTransform:
  m_CorrespondingSourceObject: {fileID: 4678676913250523710, guid: 6cbbc06ceb9a9794299a1e06a17c86b2,
    type: 3}
  m_PrefabInstance: {fileID: 8328874843188495235}
  m_PrefabAsset: {fileID: 0}
--- !u!1001 &8606358953185363499
PrefabInstance:
  m_ObjectHideFlags: 0
  serializedVersion: 2
  m_Modification:
    m_TransformParent: {fileID: 8160197654570126340}
    m_Modifications:
    - target: {fileID: 1131754165901552208, guid: 6cbbc06ceb9a9794299a1e06a17c86b2,
        type: 3}
      propertyPath: m_AnchoredPosition.x
      value: 0
      objectReference: {fileID: 0}
    - target: {fileID: 1131754165901552208, guid: 6cbbc06ceb9a9794299a1e06a17c86b2,
        type: 3}
      propertyPath: m_SizeDelta.x
      value: -8
      objectReference: {fileID: 0}
    - target: {fileID: 1131754165901552208, guid: 6cbbc06ceb9a9794299a1e06a17c86b2,
        type: 3}
      propertyPath: m_AnchoredPosition.y
      value: 0
      objectReference: {fileID: 0}
    - target: {fileID: 1131754165901552208, guid: 6cbbc06ceb9a9794299a1e06a17c86b2,
        type: 3}
      propertyPath: m_SizeDelta.y
      value: -8
      objectReference: {fileID: 0}
    - target: {fileID: 1865149173984279355, guid: 6cbbc06ceb9a9794299a1e06a17c86b2,
        type: 3}
      propertyPath: m_Name
      value: Preset (7)
      objectReference: {fileID: 0}
    - target: {fileID: 3794691817542679349, guid: 6cbbc06ceb9a9794299a1e06a17c86b2,
        type: 3}
      propertyPath: m_Sprite
      value: 
      objectReference: {fileID: 21300000, guid: bb08bd65f2dfbb54e99db59bd3f0bdb6,
        type: 3}
    - target: {fileID: 4678676913250523710, guid: 6cbbc06ceb9a9794299a1e06a17c86b2,
        type: 3}
      propertyPath: m_LocalPosition.x
      value: 0
      objectReference: {fileID: 0}
    - target: {fileID: 4678676913250523710, guid: 6cbbc06ceb9a9794299a1e06a17c86b2,
        type: 3}
      propertyPath: m_LocalPosition.y
      value: 0
      objectReference: {fileID: 0}
    - target: {fileID: 4678676913250523710, guid: 6cbbc06ceb9a9794299a1e06a17c86b2,
        type: 3}
      propertyPath: m_LocalPosition.z
      value: 0
      objectReference: {fileID: 0}
    - target: {fileID: 4678676913250523710, guid: 6cbbc06ceb9a9794299a1e06a17c86b2,
        type: 3}
      propertyPath: m_LocalRotation.x
      value: 0
      objectReference: {fileID: 0}
    - target: {fileID: 4678676913250523710, guid: 6cbbc06ceb9a9794299a1e06a17c86b2,
        type: 3}
      propertyPath: m_LocalRotation.y
      value: 0
      objectReference: {fileID: 0}
    - target: {fileID: 4678676913250523710, guid: 6cbbc06ceb9a9794299a1e06a17c86b2,
        type: 3}
      propertyPath: m_LocalRotation.z
      value: 0
      objectReference: {fileID: 0}
    - target: {fileID: 4678676913250523710, guid: 6cbbc06ceb9a9794299a1e06a17c86b2,
        type: 3}
      propertyPath: m_LocalRotation.w
      value: 1
      objectReference: {fileID: 0}
    - target: {fileID: 4678676913250523710, guid: 6cbbc06ceb9a9794299a1e06a17c86b2,
        type: 3}
      propertyPath: m_RootOrder
      value: 10
      objectReference: {fileID: 0}
    - target: {fileID: 4678676913250523710, guid: 6cbbc06ceb9a9794299a1e06a17c86b2,
        type: 3}
      propertyPath: m_LocalEulerAnglesHint.x
      value: 0
      objectReference: {fileID: 0}
    - target: {fileID: 4678676913250523710, guid: 6cbbc06ceb9a9794299a1e06a17c86b2,
        type: 3}
      propertyPath: m_LocalEulerAnglesHint.y
      value: 0
      objectReference: {fileID: 0}
    - target: {fileID: 4678676913250523710, guid: 6cbbc06ceb9a9794299a1e06a17c86b2,
        type: 3}
      propertyPath: m_LocalEulerAnglesHint.z
      value: 0
      objectReference: {fileID: 0}
    - target: {fileID: 4678676913250523710, guid: 6cbbc06ceb9a9794299a1e06a17c86b2,
        type: 3}
      propertyPath: m_AnchoredPosition.x
      value: 70
      objectReference: {fileID: 0}
    - target: {fileID: 4678676913250523710, guid: 6cbbc06ceb9a9794299a1e06a17c86b2,
        type: 3}
      propertyPath: m_AnchoredPosition.y
      value: -16
      objectReference: {fileID: 0}
    - target: {fileID: 4678676913250523710, guid: 6cbbc06ceb9a9794299a1e06a17c86b2,
        type: 3}
      propertyPath: m_SizeDelta.x
      value: 38
      objectReference: {fileID: 0}
    - target: {fileID: 4678676913250523710, guid: 6cbbc06ceb9a9794299a1e06a17c86b2,
        type: 3}
      propertyPath: m_SizeDelta.y
      value: 38
      objectReference: {fileID: 0}
    - target: {fileID: 4678676913250523710, guid: 6cbbc06ceb9a9794299a1e06a17c86b2,
        type: 3}
      propertyPath: m_AnchorMin.x
      value: 0.5
      objectReference: {fileID: 0}
    - target: {fileID: 4678676913250523710, guid: 6cbbc06ceb9a9794299a1e06a17c86b2,
        type: 3}
      propertyPath: m_AnchorMin.y
      value: 0.5
      objectReference: {fileID: 0}
    - target: {fileID: 4678676913250523710, guid: 6cbbc06ceb9a9794299a1e06a17c86b2,
        type: 3}
      propertyPath: m_AnchorMax.x
      value: 0.5
      objectReference: {fileID: 0}
    - target: {fileID: 4678676913250523710, guid: 6cbbc06ceb9a9794299a1e06a17c86b2,
        type: 3}
      propertyPath: m_AnchorMax.y
      value: 0.5
      objectReference: {fileID: 0}
    - target: {fileID: 4678676913250523710, guid: 6cbbc06ceb9a9794299a1e06a17c86b2,
        type: 3}
      propertyPath: m_Pivot.x
      value: 0.5
      objectReference: {fileID: 0}
    - target: {fileID: 4678676913250523710, guid: 6cbbc06ceb9a9794299a1e06a17c86b2,
        type: 3}
      propertyPath: m_Pivot.y
      value: 0.5
      objectReference: {fileID: 0}
    - target: {fileID: 8572292734608390408, guid: 6cbbc06ceb9a9794299a1e06a17c86b2,
        type: 3}
      propertyPath: m_IsActive
      value: 0
      objectReference: {fileID: 0}
    - target: {fileID: 8865474348618771260, guid: 6cbbc06ceb9a9794299a1e06a17c86b2,
        type: 3}
      propertyPath: m_textInfo.characterCount
      value: 0
      objectReference: {fileID: 0}
    - target: {fileID: 8865474348618771260, guid: 6cbbc06ceb9a9794299a1e06a17c86b2,
        type: 3}
      propertyPath: m_textInfo.wordCount
      value: 0
      objectReference: {fileID: 0}
    - target: {fileID: 8865474348618771260, guid: 6cbbc06ceb9a9794299a1e06a17c86b2,
        type: 3}
      propertyPath: m_textInfo.lineCount
      value: 0
      objectReference: {fileID: 0}
    - target: {fileID: 8865474348618771260, guid: 6cbbc06ceb9a9794299a1e06a17c86b2,
        type: 3}
      propertyPath: m_textInfo.pageCount
      value: 0
      objectReference: {fileID: 0}
    m_RemovedComponents: []
  m_SourcePrefab: {fileID: 100100000, guid: 6cbbc06ceb9a9794299a1e06a17c86b2, type: 3}
--- !u!224 &3999779226357308437 stripped
RectTransform:
  m_CorrespondingSourceObject: {fileID: 4678676913250523710, guid: 6cbbc06ceb9a9794299a1e06a17c86b2,
    type: 3}
  m_PrefabInstance: {fileID: 8606358953185363499}
  m_PrefabAsset: {fileID: 0}
--- !u!224 &8708591363337006203 stripped
RectTransform:
  m_CorrespondingSourceObject: {fileID: 1131754165901552208, guid: 6cbbc06ceb9a9794299a1e06a17c86b2,
    type: 3}
  m_PrefabInstance: {fileID: 8606358953185363499}
  m_PrefabAsset: {fileID: 0}
