%YAML 1.1
%TAG !u! tag:unity3d.com,2011:
--- !u!1045 &1
EditorBuildSettings:
  m_ObjectHideFlags: 0
  serializedVersion: 2
  m_Scenes:
  - enabled: 1
    path: Assets/NarupaIMD/NarupaIMD Scene.unity
    guid: 9004003917e9e3c41867ba1a880c5401
  m_configObjects: {}
