%YAML 1.1
%TAG !u! tag:unity3d.com,2011:
--- !u!114 &11400000
MonoBehaviour:
  m_ObjectHideFlags: 0
  m_CorrespondingSourceObject: {fileID: 0}
  m_PrefabInstance: {fileID: 0}
  m_PrefabAsset: {fileID: 0}
  m_GameObject: {fileID: 0}
  m_Enabled: 1
  m_EditorHideFlags: 0
  m_Script: {fileID: 11500000, guid: 6e525fa22d9d4af5a457e6b61b241ecb, type: 3}
  m_Name: Menu Closed
  m_EditorClassIdentifier: 
  duration: 0.1
  frequency: 120
  amplitude: 0.03
