%YAML 1.1
%TAG !u! tag:unity3d.com,2011:
--- !u!114 &11400000
MonoBehaviour:
  m_ObjectHideFlags: 0
  m_CorrespondingSourceObject: {fileID: 0}
  m_PrefabInternal: {fileID: 0}
  m_GameObject: {fileID: 0}
  m_Enabled: 1
  m_EditorHideFlags: 0
  m_Script: {fileID: 11500000, guid: f74bc77fdedf15942982b596669a9679, type: 3}
  m_Name: Playback
  m_EditorClassIdentifier: 
  PrimaryColor: {r: 0.7075472, g: 0, b: 0.0059460695, a: 1}
  PrimaryColorBody: {r: 0.11320752, g: 0.0022156932, b: 0.000533999, a: 1}
