%YAML 1.1
%TAG !u! tag:unity3d.com,2011:
--- !u!21 &2100000
Material:
  serializedVersion: 6
  m_ObjectHideFlags: 0
  m_PrefabParentObject: {fileID: 0}
  m_PrefabInternal: {fileID: 0}
  m_Name: M4L Skeletal Bond 2
  m_Shader: {fileID: 200, guid: 0000000000000000f000000000000000, type: 0}
  m_ShaderKeywords: _EMISSION
  m_LightmapFlags: 1
  m_CustomRenderQueue: -1
  stringTagMap: {}
  m_SavedProperties:
    serializedVersion: 2
    m_TexEnvs:
    - first:
        name: _BumpMap
      second:
        m_Texture: {fileID: 0}
        m_Scale: {x: 1, y: 1}
        m_Offset: {x: 0, y: 0}
    - first:
        name: _DetailAlbedoMap
      second:
        m_Texture: {fileID: 0}
        m_Scale: {x: 1, y: 1}
        m_Offset: {x: 0, y: 0}
    - first:
        name: _DetailMask
      second:
        m_Texture: {fileID: 0}
        m_Scale: {x: 1, y: 1}
        m_Offset: {x: 0, y: 0}
    - first:
        name: _DetailNormalMap
      second:
        m_Texture: {fileID: 0}
        m_Scale: {x: 1, y: 1}
        m_Offset: {x: 0, y: 0}
    - first:
        name: _EmissionMap
      second:
        m_Texture: {fileID: 0}
        m_Scale: {x: 1, y: 1}
        m_Offset: {x: 0, y: 0}
    - first:
        name: _MainTex
      second:
        m_Texture: {fileID: 2800000, guid: 53bff714115f730479b7dfd6666facf4, type: 3}
        m_Scale: {x: 1, y: 1}
        m_Offset: {x: 0, y: 0}
    - first:
        name: _MetallicGlossMap
      second:
        m_Texture: {fileID: 0}
        m_Scale: {x: 1, y: 1}
        m_Offset: {x: 0, y: 0}
    - first:
        name: _OcclusionMap
      second:
        m_Texture: {fileID: 0}
        m_Scale: {x: 1, y: 1}
        m_Offset: {x: 0, y: 0}
    - first:
        name: _ParallaxMap
      second:
        m_Texture: {fileID: 0}
        m_Scale: {x: 1, y: 1}
        m_Offset: {x: 0, y: 0}
    m_Floats:
    - first:
        name: PixelSnap
      second: 0
    - first:
        name: _AmbientPower
      second: 0
    - first:
        name: _BumpScale
      second: 1
    - first:
        name: _ColorMask
      second: 15
    - first:
        name: _Cutoff
      second: 0.5
    - first:
        name: _DetailNormalMapScale
      second: 1
    - first:
        name: _DstBlend
      second: 0
    - first:
        name: _GlossMapScale
      second: 1
    - first:
        name: _Glossiness
      second: 0.5
    - first:
        name: _GlossyReflections
      second: 1
    - first:
        name: _GradientHeight
      second: 10
    - first:
        name: _GradientYStartPos
      second: 0
    - first:
        name: _InvFade
      second: 1
    - first:
        name: _LightmapPower
      second: 0.5
    - first:
        name: _Metallic
      second: 0
    - first:
        name: _Mode
      second: 0
    - first:
        name: _OcclusionStrength
      second: 1
    - first:
        name: _Parallax
      second: 0.02
    - first:
        name: _SmoothnessTextureChannel
      second: 0
    - first:
        name: _SpecularHighlights
      second: 1
    - first:
        name: _SrcBlend
      second: 1
    - first:
        name: _Stencil
      second: 0
    - first:
        name: _StencilComp
      second: 8
    - first:
        name: _StencilOp
      second: 0
    - first:
        name: _StencilReadMask
      second: 255
    - first:
        name: _StencilWriteMask
      second: 255
    - first:
        name: _UVSec
      second: 0
    - first:
        name: _UseUIAlphaClip
      second: 0
    - first:
        name: _ZWrite
      second: 1
    m_Colors:
    - first:
        name: _AmbientColor
      second: {r: 0.5, g: 0.5, b: 0.5, a: 0}
    - first:
        name: _BackBottomColor
      second: {r: 0.5, g: 0.5, b: 0, a: 0}
    - first:
        name: _BackTopColor
      second: {r: 0.5, g: 0.5, b: 0, a: 0}
    - first:
        name: _BottomColor
      second: {r: 0, g: 0.5, b: 0.5, a: 0}
    - first:
        name: _Color
      second: {r: 0, g: 0, b: 0, a: 1}
    - first:
        name: _EmisColor
      second: {r: 0.559, g: 0.559, b: 0.559, a: 1}
    - first:
        name: _EmissionColor
      second: {r: 0, g: 0, b: 0, a: 1}
    - first:
        name: _FrontBottomColor
      second: {r: 1, g: 0, b: 0, a: 0}
    - first:
        name: _FrontTopColor
      second: {r: 1, g: 0, b: 0, a: 0}
    - first:
        name: _LeftBottomColor
      second: {r: 0.5, g: 0, b: 0.5, a: 0}
    - first:
        name: _LeftTopColor
      second: {r: 0.5, g: 0, b: 0.5, a: 0}
    - first:
        name: _LightTint
      second: {r: 1, g: 1, b: 1, a: 0}
    - first:
        name: _LightmapColor
      second: {r: 0, g: 0, b: 0, a: 0}
    - first:
        name: _RightBottomColor
      second: {r: 0, g: 0, b: 1, a: 0}
    - first:
        name: _RightTopColor
      second: {r: 0, g: 0, b: 1, a: 0}
    - first:
        name: _TintColor
      second: {r: 0.27205884, g: 0.27205884, b: 0.27205884, a: 1}
    - first:
        name: _TopColor
      second: {r: 0, g: 1, b: 0, a: 0}
