@startuml

title DELETE request

Actor User
Boundary Blueprint
Control Serializer
Control Service
Control Converter
Control Repo
Database Database

User -> Blueprint : DELETE
Activate Blueprint

Blueprint -> Service : delete
Activate Service

Service -> Repo : delete
Activate Repo

Repo -> Database : delete
Activate Database

Database -> Repo : success
Deactivate Database

Repo -> Service
Deactivate Repo

Service -> Blueprint
Deactivate Service

Blueprint -> User : response
Deactivate Blueprint

@enduml