@startuml

title POST request

Actor User
Boundary Blueprint
Control Serializer
Control Service
Control Converter
Control Repo
Database Database

User -> Blueprint : POST
Activate Blueprint

Blueprint -> Serializer : json
Activate Serializer

Serializer -> Blueprint : DTO
Deactivate Serializer

Blueprint -> Service : add
Activate Service

Service -> Converter : DTO
Activate Converter

Converter -> Service : Model
Deactivate Converter

Service -> Repo : add
Activate Repo

Repo -> Database : insert
Activate Database

Database -> Repo : success
Deactivate Database

Repo -> Service
Deactivate Repo

Service -> Blueprint
Deactivate Service

Blueprint -> Service : get_by_id
Activate Service

Service -> Repo : get_by_id
Activate Repo

Repo -> Database : select
Activate Database

Database -> Repo : data
Deactivate Database

Repo -> Service : data
Deactivate Repo

Service -> Converter : data
Activate Converter

Converter -> Service : DTO
Deactivate Converter

Service -> Blueprint : DTO
Deactivate Service

Blueprint -> Serializer : DTO
Activate Serializer

Serializer -> Blueprint : json
Deactivate Serializer

Blueprint -> User : response
Deactivate Blueprint

@enduml