<svg width="104" height="104" viewBox="0 0 104 104" fill="none" xmlns="http://www.w3.org/2000/svg">
<path d="M52 0C58.8956 0 65.5088 2.73928 70.3848 7.61522C75.2607 12.4912 78 19.1044 78 26C78 32.8956 75.2607 39.5088 70.3848 44.3848C65.5088 49.2607 58.8956 52 52 52C45.1044 52 38.4912 49.2607 33.6152 44.3848C28.7393 39.5088 26 32.8956 26 26C26 19.1044 28.7393 12.4912 33.6152 7.61522C38.4912 2.73928 45.1044 0 52 0ZM52 104C52 104 104 104 104 91C104 75.4 78.65 58.5 52 58.5C25.35 58.5 0 75.4 0 91C0 104 52 104 52 104Z" fill="white"/>
</svg>
