<svg width="16" height="16" viewBox="0 0 16 16" fill="none" xmlns="http://www.w3.org/2000/svg">
<path fill-rule="evenodd" clip-rule="evenodd" d="M8.88889 5.77778H13.3333V4H8.88889V5.77778ZM8.88889 12H13.3333V10.2222H8.88889V12ZM14.2222 16H1.77778C0.8 16 0 15.2 0 14.2222V1.77778C0 0.8 0.8 0 1.77778 0H14.2222C15.2 0 16 0.8 16 1.77778V14.2222C16 15.2 15.2 16 14.2222 16ZM2.66667 7.11111H7.11111V2.66667H2.66667V7.11111ZM3.55556 3.55556H6.22222V6.22222H3.55556V3.55556ZM2.66667 13.3333H7.11111V8.88889H2.66667V13.3333ZM3.55556 9.77778H6.22222V12.4444H3.55556V9.77778Z" fill="#2CAE89"/>
</svg>
