<svg width="17" height="19" viewBox="0 0 17 19" fill="none" xmlns="http://www.w3.org/2000/svg">
<path d="M7.49479 8.04428C9.71616 8.04428 11.5169 6.2435 11.5169 4.02214C11.5169 1.80077 9.71616 0 7.49479 0C5.27343 0 3.47266 1.80077 3.47266 4.02214C3.47266 6.2435 5.27343 8.04428 7.49479 8.04428Z" fill="#2CAE89"/>
<path d="M3.9572 13.6426C3.96947 13.3158 4.07836 13 4.27009 12.735C4.46182 12.4701 4.72778 12.268 5.03437 12.1542C5.34095 12.0404 5.67439 12.0201 5.99252 12.0958C6.31066 12.1715 6.59922 12.3398 6.82172 12.5794L9.10152 15.0305L13.1414 10.5241C11.4726 9.41198 9.50614 8.83131 7.50093 8.85851C6.10994 8.82335 4.72813 9.09331 3.45266 9.64941C2.17718 10.2055 1.03901 11.0343 0.118154 12.0774C0.0402543 12.1813 -0.00126047 12.3079 2.91633e-05 12.4377V15.6211C-0.000109126 15.9284 0.119467 16.2236 0.333386 16.4441C0.547305 16.6647 0.838733 16.7932 1.14584 16.8024H6.20747L4.39426 14.8533C4.24445 14.6908 4.12862 14.5 4.05356 14.292C3.97851 14.0841 3.94575 13.8633 3.9572 13.6426Z" fill="#2CAE89"/>
<path d="M13.856 16.8024C14.1631 16.7932 14.4545 16.6646 14.6685 16.4441C14.8824 16.2236 15.002 15.9284 15.0018 15.6211V13.4004L11.9719 16.8024H13.856Z" fill="#2CAE89"/>
<path d="M16.8151 8.8985C16.7571 8.84612 16.6894 8.80576 16.6157 8.77976C16.542 8.75376 16.4639 8.74263 16.3859 8.74703C16.3079 8.75142 16.2315 8.77125 16.1612 8.80536C16.091 8.83947 16.0281 8.88719 15.9764 8.94575L9.11339 16.6238L6.04215 13.3223C5.99174 13.2633 5.93021 13.2149 5.86107 13.1797C5.79194 13.1445 5.71655 13.1233 5.63922 13.1173C5.56189 13.1113 5.48412 13.1205 5.41037 13.1445C5.33662 13.1686 5.26832 13.2069 5.20937 13.2573C5.15401 13.3122 5.11008 13.3775 5.08009 13.4495C5.05011 13.5215 5.03467 13.5987 5.03467 13.6766C5.03467 13.7546 5.05011 13.8318 5.08009 13.9038C5.11008 13.9757 5.15401 14.0411 5.20937 14.096L9.15473 18.3485L16.8564 9.71356C16.9558 9.59849 17.0069 9.44955 16.9992 9.29774C16.9915 9.14593 16.9256 9.00294 16.8151 8.8985Z" fill="#2CAE89"/>
</svg>
