{
  "name": "Meteo Importer",
  "description": "Импортер для данных Метео",
  "version": "3.0",
  "date": "14.01.2023",
  "transfer_data_on_multiply_import": false,
  "overwrite_exists_data_on_multiply_import": false,
  "fields": [
    {
      "field_type": "file",
      "alias": "log_file",
      "required": true,
      "order": 1,
      "title": "Выберите файл с логами",
      "description": "",
      "icon": "",
      "default_value": null
    },
    {
      "field_type": "dateTime",
      "alias": "date_time",
      "required": true,
      "order": 2,
      "title": "Дата",
      "description": "",
      "icon": "",
      "default_value": null
    }
  ]
}