{
  "name": "Drifter's Exporter",
  "description": "Экспортер для данных Дрифтеров",
  "version": "3.0",
  "date": "25.09.2023",
  "transfer_data_on_multiply_import": false,
  "overwrite_exists_data_on_multiply_import": false,
  "fields": [
    {
      "field_type": "select",
      "alias": "number_of_points",
      "required": true,
      "order": 2,

      "title": "Отрисовка",

      "select": {
        "prepend": [
          {
            "text": "Каждую точку",
            "value": "1"
          },
          {
            "text": "Каждую 2-ю точку",
            "value": "2"
          },
          {
            "text": "Каждую 3-ю точку",
            "value": "3"
          },
          {
            "text": "Каждую 5-ю точку",
            "value": "5"
          },
          {
            "text": "Каждую 10-ю точку",
            "value": "10"
          }
        ]
      },
      "description": "",
      "icon": "",
      "default_value": 1
    }
  ]
}