{
  "name" : "CTD Exporter",
  "description" : "Экспортер для данных CTD",
  "version": "3.0",
  "date": "09.05.2023",

  "transfer_data_on_multiply_import": false,
  "overwrite_exists_data_on_multiply_import": false,

  "fields": [
    {
      "field_type": "number",
      "alias": "start",
      "required": true,
      "order": 1,

      "title": "Диапазон станций [Начало]",
      "description": "",
      "icon": "",

      "default_value": 0
    },
    {
      "field_type": "number",
      "alias": "end",
      "required": true,
      "order": 1,
      "title": "Диапазон станций [Конец]",
      "description": "",
      "icon": "",
      "default_value": 0
    }
  ]
}