{
"Version":0.1,
"GenerationNotes":"JSON generated at 2018.0201.0605 from /mnt/ubi/locate/Stanley_St.kml",
"RangingRegions": [],
"AnalysisWindows": [
 {
  "Width_m": 5, 
  "Name": "Sussex_AnalysisLane", 
  "EndingPoint": [
   -34.90601295243529, 
   138.6077331792972
  ], 
  "Enable": "true", 
  "TestID": "Stanley23012018_14752", 
  "StartingPoint": [
   -34.90501774138983, 
   138.6095442329167
  ]
 }, 
 {
  "Width_m": 5, 
  "Name": "Stanley_AnalysisLane", 
  "EndingPoint": [
   -34.9053996566389, 
   138.6072381607567
  ], 
  "Enable": "true", 
  "TestID": "Stanley23012018_14752", 
  "StartingPoint": [
   -34.90448114964727, 
   138.6088938487559
  ]
 }, 
 {
  "Width_m": 5, 
  "Name": "EastPallant_AnalysisLane", 
  "EndingPoint": [
   -34.90446788832639, 
   138.6093171098999
  ], 
  "Enable": "true", 
  "TestID": "Stanley23012018_14752", 
  "StartingPoint": [
   -34.9046271015584, 
   138.6094476531365
  ]
 }
],
"KnownAPList":
[
  {
    "AntennaCount": 0, 
    "SSID": "unknown", 
    "AckRespDelayAdjust": 0, 
    "APClass": 0, 
    "LocationWGS84": {
      "Latitude_degs": -34.90423871008837, 
      "Elevation_m": 3.0, 
      "Longitude_degs": 138.6092519523908
    }, 
    "RSUName": "RSU_STANLEY_NE", 
    "Notes": "RSU_STANLEY_NE", 
    "LocationQuality": 0, 
    "Modes": "unknown", 
    "Heading_degs": 0, 
    "RRegionIDList": [], 
    "MAC": "04:E5:48:01:58:E2", 
    "Speed_mps": 0, 
    "RSUID": 2, 
    "initR": 100, 
    "AckRespDelayVariance": 0, 
    "LocalStreetAngle_Degs": [
      56.45, 
      236.45, 
      147.08, 
      327.08
    ], 
    "AntennaArrayDirection_degs": 0, 
    "APType": 0, 
    "Channel": 0, 
    "CDDMode": 0
  }, 
  {
    "AntennaCount": 0, 
    "SSID": "unknown", 
    "AckRespDelayAdjust": 0, 
    "APClass": 0, 
    "LocationWGS84": {
      "Latitude_degs": -34.90548210368632, 
      "Elevation_m": 3.0, 
      "Longitude_degs": 138.6069433389667
    }, 
    "RSUName": "RSU_STANLEY_NW", 
    "Notes": "RSU_STANLEY_NW", 
    "LocationQuality": 0, 
    "Modes": "unknown", 
    "Heading_degs": 0, 
    "RRegionIDList": [], 
    "MAC": "04:E5:48:01:58:E6", 
    "Speed_mps": 0, 
    "RSUID": 5, 
    "initR": 100, 
    "AckRespDelayVariance": 0, 
    "LocalStreetAngle_Degs": [
      56.45, 
      236.45, 
      147.08, 
      327.08
    ], 
    "AntennaArrayDirection_degs": 0, 
    "APType": 0, 
    "Channel": 0, 
    "CDDMode": 0
  }, 
  {
    "AntennaCount": 0, 
    "SSID": "unknown", 
    "AckRespDelayAdjust": 0, 
    "APClass": 0, 
    "LocationWGS84": {
      "Latitude_degs": -34.90498488754132, 
      "Elevation_m": 3.0, 
      "Longitude_degs": 138.6082524201022
    }, 
    "RSUName": "RSU_STANLEY_SMW", 
    "Notes": "RSU_STANLEY_SMW", 
    "LocationQuality": 0, 
    "Modes": "unknown", 
    "Heading_degs": 0, 
    "RRegionIDList": [], 
    "MAC": "11:11:11:11:11:11", 
    "Speed_mps": 0, 
    "RSUID": 0, 
    "initR": 100, 
    "AckRespDelayVariance": 0, 
    "LocalStreetAngle_Degs": [
      56.45, 
      236.45
    ], 
    "AntennaArrayDirection_degs": 0, 
    "APType": 0, 
    "Channel": 0, 
    "CDDMode": 0
  }, 
  {
    "AntennaCount": 0, 
    "SSID": "unknown", 
    "AckRespDelayAdjust": 0, 
    "APClass": 0, 
    "LocationWGS84": {
      "Latitude_degs": -34.90557198108341, 
      "Elevation_m": 3.0, 
      "Longitude_degs": 138.6071542022098
    }, 
    "RSUName": "RSU_STANLEY_alt", 
    "Notes": "RSU_STANLEY_alt", 
    "LocationQuality": 0, 
    "Modes": "unknown", 
    "Heading_degs": 0, 
    "RRegionIDList": [], 
    "MAC": "00:00:00:00:00:00", 
    "Speed_mps": 0, 
    "RSUID": 4, 
    "initR": 100, 
    "AckRespDelayVariance": 0, 
    "LocalStreetAngle_Degs": [
      56.45, 
      236.45, 
      147.08, 
      327.08
    ], 
    "AntennaArrayDirection_degs": 0, 
    "APType": 0, 
    "Channel": 0, 
    "CDDMode": 0
  }, 
  {
    "AntennaCount": 0, 
    "SSID": "unknown", 
    "AckRespDelayAdjust": 0, 
    "APClass": 0, 
    "LocationWGS84": {
      "Latitude_degs": -34.90498312276566, 
      "Elevation_m": 3.0, 
      "Longitude_degs": 138.6096912453564
    }, 
    "RSUName": "RSU_SUSSEX_SE", 
    "Notes": "RSU_SUSSEX_SE", 
    "LocationQuality": 0, 
    "Modes": "unknown", 
    "Heading_degs": 0, 
    "RRegionIDList": [], 
    "MAC": "04:E5:48:01:58:D6", 
    "Speed_mps": 0, 
    "RSUID": 1, 
    "initR": 100, 
    "AckRespDelayVariance": 0, 
    "LocalStreetAngle_Degs": [
      56.45, 
      236.45, 
      147.08, 
      327.08
    ], 
    "AntennaArrayDirection_degs": 0, 
    "APType": 0, 
    "Channel": 0, 
    "CDDMode": 0
  }, 
  {
    "AntennaCount": 0, 
    "SSID": "unknown", 
    "AckRespDelayAdjust": 0, 
    "APClass": 0, 
    "LocationWGS84": {
      "Latitude_degs": -34.90618567966936, 
      "Elevation_m": 3.0, 
      "Longitude_degs": 138.6075386676277
    }, 
    "RSUName": "RSU_SUSSEX_SW", 
    "Notes": "RSU_SUSSEX_SW", 
    "LocationQuality": 0, 
    "Modes": "unknown", 
    "Heading_degs": 0, 
    "RRegionIDList": [], 
    "MAC": "04:E5:48:01:55:86", 
    "Speed_mps": 0, 
    "RSUID": 3, 
    "initR": 100, 
    "AckRespDelayVariance": 0, 
    "LocalStreetAngle_Degs": [
      56.45, 
      236.45, 
      147.08, 
      327.08
    ], 
    "AntennaArrayDirection_degs": 0, 
    "APType": 0, 
    "Channel": 0, 
    "CDDMode": 0
  }
]
}