{
  "project_info": {
    "project_number": "761648787941",
    "project_id": "model-link-133020"
  },
  "client": [
    {
      "client_info": {
        "mobilesdk_app_id": "1:761648787941:android:68ea4857e3e62057",
        "android_client_info": {
          "package_name": "co.gov.ins.guardianes"
        }
      },
      "oauth_client": [
        {
          "client_id": "761648787941-d7p0ja4of7ei126eph2f8vve6rg59cbu.apps.googleusercontent.com",
          "client_type": 1,
          "android_info": {
            "package_name": "co.gov.ins.guardianes",
            "certificate_hash": "E41AD8BA0FA47863CCA36C3D5EC35ACD5ED79A07"
          }
        },
        {
          "client_id": "761648787941-jdm3cgeaagadt1p13dsi54mnrc7pbf3j.apps.googleusercontent.com",
          "client_type": 3
        }
      ],
      "api_key": [
        {
          "current_key": "AIzaSyBap8O4eY3xDn_y_INjrybKkDsp3c6bDEw"
        }
      ],
      "services": {
        "analytics_service": {
          "status": 2,
          "analytics_property": {
            "tracking_id": "UA-78734684-2"
          }
        },
        "appinvite_service": {
          "status": 1,
          "other_platform_oauth_client": []
        },
        "ads_service": {
          "status": 1
        }
      }
    }
  ],
  "configuration_version": "1"
}