{
  "images" : [
    {
      "filename" : "Screenshot 2023-08-30 at 7.55.18 AM.png",
      "idiom" : "universal",
      "scale" : "1x"
    },
    {
      "filename" : "Screenshot 2023-08-30 at 7.55.18 AM 1.png",
      "idiom" : "universal",
      "scale" : "2x"
    },
    {
      "filename" : "Screenshot 2023-08-30 at 7.55.18 AM 2.png",
      "idiom" : "universal",
      "scale" : "3x"
    }
  ],
  "info" : {
    "author" : "xcode",
    "version" : 1
  }
}
