(module apds-9930-qga_8 (layer F.Cu) (tedit 60678E45)
  (fp_text reference REF** (at 0.6223 1.9685) (layer F.SilkS)
    (effects (font (size 1 1) (thickness 0.15)))
  )
  (fp_text value apds-9930-qga_8 (at 0.8382 -4.9149) (layer F.Fab)
    (effects (font (size 1 1) (thickness 0.15)))
  )
  (fp_line (start 1.9177 0.6223) (end -0.5207 0.6223) (layer Dwgs.User) (width 0.12))
  (fp_line (start -0.5207 0.6223) (end -0.5207 -3.4671) (layer Dwgs.User) (width 0.12))
  (fp_line (start -0.5207 -3.4671) (end 1.9177 -3.4671) (layer Dwgs.User) (width 0.12))
  (fp_line (start 1.9177 -3.4671) (end 1.9177 0.635) (layer Dwgs.User) (width 0.12))
  (fp_line (start 1.9177 0.635) (end 1.8923 0.6096) (layer Dwgs.User) (width 0.12))
  (pad 8 smd rect (at 0 -2.91) (size 0.6 0.72) (layers F.Cu F.Paste F.Mask))
  (pad 7 smd rect (at 0 -1.94) (size 0.6 0.72) (layers F.Cu F.Paste F.Mask))
  (pad 6 smd rect (at 0 -0.97) (size 0.6 0.72) (layers F.Cu F.Paste F.Mask))
  (pad 5 smd rect (at 0 0) (size 0.6 0.72) (layers F.Cu F.Paste F.Mask))
  (pad 1 smd rect (at 1.4 -2.91) (size 0.6 0.72) (layers F.Cu F.Paste F.Mask))
  (pad 2 smd rect (at 1.4 -1.94) (size 0.6 0.72) (layers F.Cu F.Paste F.Mask))
  (pad 3 smd rect (at 1.4 -0.97) (size 0.6 0.72) (layers F.Cu F.Paste F.Mask))
  (pad 4 smd rect (at 1.4 0) (size 0.6 0.72) (layers F.Cu F.Paste F.Mask))
)
