EESchema Schematic File Version 4
EELAYER 30 0
EELAYER END
$Descr A4 11693 8268
encoding utf-8
Sheet 2 2
Title ""
Date ""
Rev ""
Comp ""
Comment1 ""
Comment2 ""
Comment3 ""
Comment4 ""
$EndDescr
$Comp
L power_supply-rescue:R-Device R6
U 1 1 60523F2D
P 6000 2550
F 0 "R6" H 5930 2504 50  0000 R CNN
F 1 "50ohm" H 5930 2595 50  0000 R CNN
F 2 "Resistor_SMD:R_0603_1608Metric" V 5930 2550 50  0001 C CNN
F 3 "~" H 6000 2550 50  0001 C CNN
	1    6000 2550
	-1   0    0    1   
$EndComp
$Comp
L power_supply-rescue:Varistor-Device RV1
U 1 1 6053691A
P 1750 2250
F 0 "RV1" H 1853 2296 50  0000 L CNN
F 1 "Varistor" H 1853 2205 50  0000 L CNN
F 2 "Fuse:Fuse_1206_3216Metric_Castellated" V 1680 2250 50  0001 C CNN
F 3 "~" H 1750 2250 50  0001 C CNN
	1    1750 2250
	1    0    0    -1  
$EndComp
$Comp
L power_supply-rescue:Polyfuse-Device F1
U 1 1 605393A1
P 6350 2050
F 0 "F1" V 6125 2050 50  0000 C CNN
F 1 "160mA" V 6216 2050 50  0000 C CNN
F 2 "Fuse:Fuse_0603_1608Metric_Castellated" H 6400 1850 50  0001 L CNN
F 3 "~" H 6350 2050 50  0001 C CNN
	1    6350 2050
	0    1    1    0   
$EndComp
Wire Wire Line
	2750 2100 2750 2050
Wire Wire Line
	1750 2100 1750 2050
Connection ~ 6000 3500
Text HLabel 1250 2050 0    50   Input ~ 0
IN-AC
Text HLabel 1350 3500 0    50   Input ~ 0
GND
Text GLabel 8850 2050 2    50   Input ~ 0
DC
Text GLabel 8850 3500 2    50   Input ~ 0
GND-DC
Text GLabel 4950 4050 0    50   Input ~ 0
DC
Text GLabel 4950 3950 0    50   Input ~ 0
GND-DC
Text HLabel 5400 4050 2    50   Input ~ 0
VCC
Text HLabel 5400 3950 2    50   Input ~ 0
V0
$Comp
L power_supply-rescue:Conn_01x02-Connector_Generic J2
U 1 1 6073F5BD
P 5150 3950
F 0 "J2" H 5200 4167 50  0000 C CNN
F 1 "Conn_02x02_Counter_Clockwise" H 5200 4076 50  0000 C CNN
F 2 "Connector_PinHeader_2.54mm:PinHeader_1x02_P2.54mm_Vertical" H 5150 3950 50  0001 C CNN
F 3 "~" H 5150 3950 50  0001 C CNN
	1    5150 3950
	1    0    0    -1  
$EndComp
Wire Wire Line
	1750 2400 1750 2450
Wire Wire Line
	3050 2400 3050 2050
Wire Wire Line
	3050 2050 3300 2050
Wire Wire Line
	2450 2400 2850 2400
Wire Wire Line
	2850 2400 2850 3500
Wire Wire Line
	2850 3500 3300 3500
$Comp
L power_supply-rescue:CP-Device C3
U 1 1 60AD1E89
P 5600 2650
F 0 "C3" H 5718 2696 50  0000 L CNN
F 1 "20u" H 5718 2605 50  0000 L CNN
F 2 "Capacitor_SMD:C_1206_3216Metric" H 5638 2500 50  0001 C CNN
F 3 "~" H 5600 2650 50  0001 C CNN
	1    5600 2650
	1    0    0    -1  
$EndComp
Wire Wire Line
	5600 2800 5600 3500
Connection ~ 5600 3500
Wire Wire Line
	5600 3500 6000 3500
$Comp
L power_supply-rescue:D_Zener-Device D6
U 1 1 60F992FB
P 6000 3150
F 0 "D6" V 5954 3230 50  0000 L CNN
F 1 "6v" V 6045 3230 50  0000 L CNN
F 2 "Diode_SMD:D_SOD-323" H 6000 3150 50  0001 C CNN
F 3 "~" H 6000 3150 50  0001 C CNN
	1    6000 3150
	0    1    1    0   
$EndComp
Wire Wire Line
	6000 3300 6000 3500
Wire Wire Line
	3300 2900 3300 3000
Wire Wire Line
	6000 3500 6800 3500
$Comp
L power_supply-rescue:CP-Device C7
U 1 1 61041C46
P 7150 2650
F 0 "C7" H 7268 2696 50  0000 L CNN
F 1 "10u" H 7268 2605 50  0000 L CNN
F 2 "Capacitor_SMD:C_0805_2012Metric_Pad1.15x1.40mm_HandSolder" H 7188 2500 50  0001 C CNN
F 3 "~" H 7150 2650 50  0001 C CNN
	1    7150 2650
	1    0    0    -1  
$EndComp
$Comp
L power_supply-rescue:CP-Device C6
U 1 1 61041C4E
P 6800 2650
F 0 "C6" H 6918 2696 50  0000 L CNN
F 1 "0.1u" H 6918 2605 50  0000 L CNN
F 2 "Capacitor_SMD:C_0603_1608Metric_Pad1.05x0.95mm_HandSolder" H 6838 2500 50  0001 C CNN
F 3 "~" H 6800 2650 50  0001 C CNN
	1    6800 2650
	1    0    0    -1  
$EndComp
$Comp
L power_supply-rescue:CP-Device C9
U 1 1 61044F24
P 8550 2650
F 0 "C9" H 8668 2696 50  0000 L CNN
F 1 "22u" H 8668 2605 50  0000 L CNN
F 2 "Capacitor_SMD:C_0805_2012Metric_Pad1.15x1.40mm_HandSolder" H 8588 2500 50  0001 C CNN
F 3 "~" H 8550 2650 50  0001 C CNN
	1    8550 2650
	1    0    0    -1  
$EndComp
$Comp
L power_supply-rescue:CP-Device C8
U 1 1 61044F2C
P 8200 2650
F 0 "C8" H 8318 2696 50  0000 L CNN
F 1 "0.1u" H 8318 2605 50  0000 L CNN
F 2 "Capacitor_SMD:C_0603_1608Metric_Pad1.05x0.95mm_HandSolder" H 8238 2500 50  0001 C CNN
F 3 "~" H 8200 2650 50  0001 C CNN
	1    8200 2650
	1    0    0    -1  
$EndComp
Connection ~ 7550 3500
Wire Wire Line
	7550 3500 8200 3500
Wire Wire Line
	5400 4050 4950 4050
Wire Wire Line
	5400 3950 4950 3950
Wire Wire Line
	6800 2500 6800 2050
Connection ~ 6800 2050
Wire Wire Line
	6800 2050 7150 2050
Wire Wire Line
	7150 2500 7150 2050
Connection ~ 7150 2050
Wire Wire Line
	8200 2500 8200 2050
Connection ~ 8200 2050
Wire Wire Line
	8200 2050 8550 2050
Wire Wire Line
	8550 2500 8550 2050
Connection ~ 8550 2050
Wire Wire Line
	8550 2050 8850 2050
Wire Wire Line
	6800 2800 6800 3500
Connection ~ 6800 3500
Wire Wire Line
	6800 3500 7150 3500
Wire Wire Line
	7150 2800 7150 3500
Connection ~ 7150 3500
Wire Wire Line
	7150 3500 7550 3500
Wire Wire Line
	8200 2800 8200 3500
Connection ~ 8200 3500
Wire Wire Line
	8200 3500 8550 3500
Wire Wire Line
	8550 2800 8550 3500
Connection ~ 8550 3500
Wire Wire Line
	8550 3500 8850 3500
$Comp
L power_supply-rescue:D_Schottky-Device D1
U 1 1 62CF13C9
P 5050 2650
F 0 "D1" V 5004 2730 50  0000 L CNN
F 1 "D" V 5095 2730 50  0000 L CNN
F 2 "Diode_SMD:D_SOD-323" H 5050 2650 50  0001 C CNN
F 3 "~" H 5050 2650 50  0001 C CNN
	1    5050 2650
	0    1    1    0   
$EndComp
Wire Wire Line
	5050 2800 5050 3500
Connection ~ 5050 3500
Wire Wire Line
	5050 3500 5600 3500
Wire Wire Line
	3300 2050 3300 2150
$Comp
L power_supply-rescue:L_Core_Ferrite-Device L2
U 1 1 62CF952F
P 5350 2050
F 0 "L2" V 5575 2050 50  0000 C CNN
F 1 "680uH" V 5484 2050 50  0000 C CNN
F 2 "Inductor_SMD:L_Bourns_SRN6045TA" H 5350 2050 50  0001 C CNN
F 3 "~" H 5350 2050 50  0001 C CNN
F 4 "SDR0604-681KL" H 5350 2050 50  0001 C CNN "ID"
	1    5350 2050
	0    -1   -1   0   
$EndComp
Wire Wire Line
	2750 2700 2750 3500
$Comp
L power_supply-rescue:Thermistor_NTC-Device TH1
U 1 1 62D47BE6
P 2250 2050
F 0 "TH1" V 1960 2050 50  0000 C CNN
F 1 "10ohm" V 2051 2050 50  0000 C CNN
F 2 "Capacitor_THT:C_Disc_D3.0mm_W2.0mm_P2.50mm" H 2250 2100 50  0001 C CNN
F 3 "~" H 2250 2100 50  0001 C CNN
	1    2250 2050
	0    1    1    0   
$EndComp
$Comp
L power_supply-rescue:FODM217D-Isolator U3
U 1 1 62CEFE36
P 5700 1500
F 0 "U3" H 5700 1825 50  0000 C CNN
F 1 "FODM217D" H 5700 1734 50  0000 C CNN
F 2 "Package_SO:SOP-4_4.4x2.6mm_P1.27mm" H 5700 1300 50  0001 C CIN
F 3 "https://www.onsemi.com/pub/Collateral/FODM214-D.PDF" H 5700 1500 50  0001 L CNN
	1    5700 1500
	0    -1   -1   0   
$EndComp
Wire Wire Line
	5500 2050 5600 2050
Wire Wire Line
	5600 2500 5600 2050
Connection ~ 5600 2050
Wire Wire Line
	6000 2700 6000 2850
Wire Wire Line
	6000 2400 6000 2050
Connection ~ 6000 2050
Wire Wire Line
	6000 2050 6200 2050
Wire Wire Line
	5600 2050 5600 1800
Wire Wire Line
	5800 1800 5800 2850
Wire Wire Line
	5800 2850 6000 2850
Connection ~ 6000 2850
Wire Wire Line
	6000 2850 6000 3000
Wire Wire Line
	5600 1200 5600 1100
Wire Wire Line
	5600 1100 5050 1100
Wire Wire Line
	4600 1100 4600 1750
Wire Wire Line
	5800 1000 4400 1000
Wire Wire Line
	4400 1000 4400 1750
Wire Wire Line
	5800 1200 5800 1000
$Comp
L power_supply-rescue:C-Device C1
U 1 1 62D8D6AE
P 5050 1550
F 0 "C1" H 5165 1596 50  0000 L CNN
F 1 "100nf" H 5165 1505 50  0000 L CNN
F 2 "Capacitor_SMD:C_0603_1608Metric_Pad1.05x0.95mm_HandSolder" H 5088 1400 50  0001 C CNN
F 3 "~" H 5050 1550 50  0001 C CNN
F 4 "C1608Y5V1H104Z" H 5050 1550 50  0001 C CNN "ID"
	1    5050 1550
	1    0    0    -1  
$EndComp
Wire Wire Line
	5050 1400 5050 1100
Connection ~ 5050 1100
Wire Wire Line
	5050 1100 4600 1100
Connection ~ 1750 2050
Wire Wire Line
	1350 3500 1750 3500
$Comp
L power_supply-rescue:Varistor-Device RV3
U 1 1 62D12209
P 1750 2950
F 0 "RV3" H 1853 2996 50  0000 L CNN
F 1 "Varistor" H 1853 2905 50  0000 L CNN
F 2 "Fuse:Fuse_1206_3216Metric_Castellated" V 1680 2950 50  0001 C CNN
F 3 "~" H 1750 2950 50  0001 C CNN
	1    1750 2950
	1    0    0    -1  
$EndComp
Wire Wire Line
	1750 3100 1750 3150
$Comp
L power_supply-rescue:Varistor-Device RV2
U 1 1 62D15AA4
P 1750 2600
F 0 "RV2" H 1853 2646 50  0000 L CNN
F 1 "Varistor" H 1853 2555 50  0000 L CNN
F 2 "Fuse:Fuse_1206_3216Metric_Castellated" V 1680 2600 50  0001 C CNN
F 3 "~" H 1750 2600 50  0001 C CNN
	1    1750 2600
	1    0    0    -1  
$EndComp
Wire Wire Line
	1750 2750 1750 2800
Connection ~ 3300 2050
Connection ~ 3300 3500
Wire Wire Line
	1750 3500 2750 3500
Connection ~ 1750 3500
Wire Wire Line
	3300 2450 3300 2600
Wire Wire Line
	3300 3300 3300 3500
Wire Wire Line
	1750 2050 2100 2050
$Comp
L power_supply-rescue:Varistor-Device RV4
U 1 1 62D0E152
P 1750 3300
F 0 "RV4" H 1853 3346 50  0000 L CNN
F 1 "Varistor" H 1853 3255 50  0000 L CNN
F 2 "Fuse:Fuse_1206_3216Metric_Castellated" V 1680 3300 50  0001 C CNN
F 3 "~" H 1750 3300 50  0001 C CNN
	1    1750 3300
	1    0    0    -1  
$EndComp
Wire Wire Line
	1750 3450 1750 3500
Wire Wire Line
	2400 2050 2750 2050
Wire Wire Line
	1250 2050 1750 2050
NoConn ~ 3850 800 
Wire Wire Line
	3300 2050 4100 2050
$Comp
L power_supply-rescue:MB4S-Diode_Bridge D2
U 1 1 62D59F84
P 2750 2400
F 0 "D2" H 3094 2446 50  0000 L CNN
F 1 "MB4S" H 3094 2355 50  0000 L CNN
F 2 "Package_TO_SOT_SMD:TO-269AA" H 2900 2525 50  0001 L CNN
F 3 "http://www.vishay.com/docs/88661/mb2s.pdf" H 2750 2400 50  0001 C CNN
	1    2750 2400
	1    0    0    -1  
$EndComp
$Comp
L power_supply-rescue:C-Device C2
U 1 1 62D1E9A2
P 3300 2300
F 0 "C2" H 3415 2346 50  0000 L CNN
F 1 "1uf 100v" H 3415 2255 50  0000 L CNN
F 2 "Capacitor_SMD:C_1206_3216Metric" H 3338 2150 50  0001 C CNN
F 3 "~" H 3300 2300 50  0001 C CNN
F 4 "" H 3300 2300 50  0001 C CNN "ID"
	1    3300 2300
	1    0    0    -1  
$EndComp
$Comp
L power_supply-rescue:C-Device C4
U 1 1 62D1FE96
P 3300 2750
F 0 "C4" H 3415 2796 50  0000 L CNN
F 1 "1uf 100v" H 3415 2705 50  0000 L CNN
F 2 "Capacitor_SMD:C_1206_3216Metric" H 3338 2600 50  0001 C CNN
F 3 "~" H 3300 2750 50  0001 C CNN
F 4 "" H 3300 2750 50  0001 C CNN "ID"
	1    3300 2750
	1    0    0    -1  
$EndComp
$Comp
L power_supply-rescue:C-Device C5
U 1 1 62D20275
P 3300 3150
F 0 "C5" H 3415 3196 50  0000 L CNN
F 1 "1uf 100v" H 3415 3105 50  0000 L CNN
F 2 "Capacitor_SMD:C_1206_3216Metric" H 3338 3000 50  0001 C CNN
F 3 "~" H 3300 3150 50  0001 C CNN
F 4 "" H 3300 3150 50  0001 C CNN "ID"
	1    3300 3150
	1    0    0    -1  
$EndComp
$Comp
L power_supply-rescue:LNK304D-Library-cbas U2
U 1 1 62CEAC61
P 4500 2050
F 0 "U2" H 4500 1775 50  0000 C CNN
F 1 "LNK304D" H 4500 1684 50  0000 C CNN
F 2 "Package_SO:PowerIntegrations_SO-8B" H 4500 2050 50  0001 C CIN
F 3 "http://www.powerint.com/sites/default/files/product-docs/lnk302_304-306.pdf" H 4500 2050 50  0001 C CNN
	1    4500 2050
	1    0    0    -1  
$EndComp
Wire Wire Line
	3300 3500 5050 3500
Wire Wire Line
	7150 2050 7250 2050
Wire Wire Line
	7850 2050 8200 2050
Wire Wire Line
	7550 2350 7550 3500
$Comp
L power_supply-rescue:AP2127N-3.3-Regulator_Linear U1
U 1 1 61014316
P 7550 2050
F 0 "U1" H 7550 2292 50  0000 C CNN
F 1 "AP2127N-3.3" H 7550 2201 50  0000 C CNN
F 2 "Package_TO_SOT_SMD:SOT-23_Handsoldering" H 7550 2050 50  0001 C CNN
F 3 "http://www.ti.com/lit/ds/symlink/lm1117.pdf" H 7550 2050 50  0001 C CNN
	1    7550 2050
	1    0    0    -1  
$EndComp
Wire Wire Line
	5200 2050 5050 2050
Wire Wire Line
	5050 2500 5050 2050
Connection ~ 5050 2050
Wire Wire Line
	5050 2050 4900 2050
Wire Wire Line
	5050 1700 5050 2050
Wire Wire Line
	6500 2050 6800 2050
Wire Wire Line
	5600 2050 6000 2050
Text Notes 800  3000 0    79   ~ 16
ENTRADA\nTENSION\nLINEA\n220VA
Text Notes 8950 2850 0    79   ~ 16
SALIDA\nTENSION\n3.3VDC
$EndSCHEMATC
