M48
; DRILL file {KiCad 5.1.6-c6e7f7d~86~ubuntu19.10.1} date Mon Jul 25 17:04:07 2022
; FORMAT={-:-/ absolute / metric / decimal}
; #@! TF.CreationDate,2022-07-25T17:04:07-03:00
; #@! TF.GenerationSoftware,Kicad,Pcbnew,5.1.6-c6e7f7d~86~ubuntu19.10.1
; #@! TF.FileFunction,Plated,1,2,PTH
FMAT,2
METRIC
T1C0.400
T2C0.800
T3C1.000
%
G90
G05
T1
X120.117Y-92.781
X120.117Y-94.661
X120.117Y-96.708
X120.117Y-98.11
X120.117Y-119.781
X120.117Y-121.661
X120.117Y-123.708
X120.117Y-125.11
X120.117Y-146.781
X120.117Y-148.661
X120.117Y-150.708
X120.117Y-152.11
X120.142Y-100.775
X120.142Y-127.775
X120.142Y-154.775
X120.157Y-102.982
X120.157Y-129.982
X120.157Y-156.982
X121.371Y-96.688
X121.371Y-123.688
X121.371Y-150.688
X121.387Y-92.766
X121.387Y-94.661
X121.387Y-119.766
X121.387Y-121.661
X121.387Y-146.766
X121.387Y-148.661
X121.389Y-106.975
X121.389Y-133.975
X121.389Y-160.975
X121.392Y-98.146
X121.392Y-125.146
X121.392Y-152.146
X121.473Y-100.79
X121.473Y-127.79
X121.473Y-154.79
X121.477Y-102.988
X121.477Y-129.988
X121.477Y-156.988
X122.728Y-99.388
X122.728Y-100.775
X122.728Y-126.388
X122.728Y-127.775
X122.728Y-153.388
X122.728Y-154.775
X123.876Y-99.378
X123.876Y-126.378
X123.876Y-153.378
X123.891Y-100.826
X123.891Y-127.826
X123.891Y-154.826
X125.886Y-95.558
X125.886Y-122.558
X125.886Y-149.558
X126.5Y-111.0
X126.5Y-138.0
X126.5Y-165.0
X127.5Y-98.2
X127.5Y-125.2
X127.5Y-152.2
X129.54Y-95.331
X129.54Y-122.331
X129.54Y-149.331
X131.206Y-103.815
X131.206Y-130.815
X131.206Y-157.815
X131.378Y-101.335
X131.378Y-128.335
X131.378Y-155.335
X132.551Y-108.7
X132.551Y-135.7
X132.551Y-162.7
X132.7Y-107.3
X132.7Y-134.3
X132.7Y-161.3
X133.3Y-100.3
X133.3Y-127.3
X133.3Y-154.3
X133.5Y-112.9
X133.5Y-115.0
X133.5Y-139.9
X133.5Y-166.9
X133.522Y-142.061
X133.522Y-169.061
X133.868Y-108.7
X133.868Y-135.7
X133.868Y-162.7
X137.867Y-92.781
X137.867Y-94.661
X137.867Y-96.708
X137.867Y-98.11
X137.867Y-119.781
X137.867Y-121.661
X137.867Y-123.708
X137.867Y-125.11
X137.867Y-146.781
X137.867Y-148.661
X137.867Y-150.708
X137.867Y-152.11
X137.892Y-100.775
X137.892Y-127.775
X137.892Y-154.775
X137.907Y-102.982
X137.907Y-129.982
X137.907Y-156.982
X139.121Y-96.688
X139.121Y-123.688
X139.121Y-150.688
X139.137Y-92.766
X139.137Y-94.661
X139.137Y-119.766
X139.137Y-121.661
X139.137Y-146.766
X139.137Y-148.661
X139.139Y-106.975
X139.139Y-133.975
X139.139Y-160.975
X139.142Y-98.146
X139.142Y-125.146
X139.142Y-152.146
X139.223Y-100.79
X139.223Y-127.79
X139.223Y-154.79
X139.227Y-102.988
X139.227Y-129.988
X139.227Y-156.988
X140.478Y-99.388
X140.478Y-100.775
X140.478Y-126.388
X140.478Y-127.775
X140.478Y-153.388
X140.478Y-154.775
X141.626Y-99.378
X141.626Y-126.378
X141.626Y-153.378
X141.641Y-100.826
X141.641Y-127.826
X141.641Y-154.826
X143.636Y-95.558
X143.636Y-122.558
X143.636Y-149.558
X144.25Y-111.0
X144.25Y-138.0
X144.25Y-165.0
X145.25Y-98.2
X145.25Y-125.2
X145.25Y-152.2
X147.29Y-95.331
X147.29Y-122.331
X147.29Y-149.331
X148.956Y-103.815
X148.956Y-130.815
X148.956Y-157.815
X149.128Y-101.335
X149.128Y-128.335
X149.128Y-155.335
X150.301Y-108.7
X150.301Y-135.7
X150.301Y-162.7
X150.45Y-107.3
X150.45Y-134.3
X150.45Y-161.3
X151.05Y-100.3
X151.05Y-127.3
X151.05Y-154.3
X151.2Y-115.0
X151.25Y-112.9
X151.25Y-139.9
X151.25Y-166.9
X151.272Y-142.061
X151.272Y-169.061
X151.618Y-108.7
X151.618Y-135.7
X151.618Y-162.7
X155.617Y-92.781
X155.617Y-94.661
X155.617Y-96.708
X155.617Y-98.11
X155.617Y-119.781
X155.617Y-121.661
X155.617Y-123.708
X155.617Y-125.11
X155.617Y-146.781
X155.617Y-148.661
X155.617Y-150.708
X155.617Y-152.11
X155.642Y-100.775
X155.642Y-127.775
X155.642Y-154.775
X155.657Y-102.982
X155.657Y-129.982
X155.657Y-156.982
X156.871Y-96.688
X156.871Y-123.688
X156.871Y-150.688
X156.887Y-92.766
X156.887Y-94.661
X156.887Y-119.766
X156.887Y-121.661
X156.887Y-146.766
X156.887Y-148.661
X156.889Y-106.975
X156.889Y-133.975
X156.889Y-160.975
X156.892Y-98.146
X156.892Y-125.146
X156.892Y-152.146
X156.973Y-100.79
X156.973Y-127.79
X156.973Y-154.79
X156.977Y-102.988
X156.977Y-129.988
X156.977Y-156.988
X158.228Y-99.388
X158.228Y-100.775
X158.228Y-126.388
X158.228Y-127.775
X158.228Y-153.388
X158.228Y-154.775
X159.376Y-99.378
X159.376Y-126.378
X159.376Y-153.378
X159.391Y-100.826
X159.391Y-127.826
X159.391Y-154.826
X161.386Y-95.558
X161.386Y-122.558
X161.386Y-149.558
X162.0Y-111.0
X162.0Y-138.0
X162.0Y-165.0
X163.0Y-98.2
X163.0Y-125.2
X163.0Y-152.2
X165.04Y-95.331
X165.04Y-122.331
X165.04Y-149.331
X166.706Y-103.815
X166.706Y-130.815
X166.706Y-157.815
X166.878Y-101.335
X166.878Y-128.335
X166.878Y-155.335
X168.051Y-108.7
X168.051Y-135.7
X168.051Y-162.7
X168.2Y-107.3
X168.2Y-134.3
X168.2Y-161.3
X168.8Y-100.3
X168.8Y-127.3
X168.8Y-154.3
X169.0Y-112.9
X169.0Y-139.9
X169.0Y-166.9
X169.022Y-115.061
X169.022Y-142.061
X169.022Y-169.061
X169.368Y-108.7
X169.368Y-135.7
X169.368Y-162.7
X173.367Y-92.781
X173.367Y-94.661
X173.367Y-96.708
X173.367Y-98.11
X173.367Y-119.781
X173.367Y-121.661
X173.367Y-123.708
X173.367Y-125.11
X173.367Y-146.781
X173.367Y-148.661
X173.367Y-150.708
X173.367Y-152.11
X173.392Y-100.775
X173.392Y-127.775
X173.392Y-154.775
X173.407Y-102.982
X173.407Y-129.982
X173.407Y-156.982
X174.621Y-96.688
X174.621Y-123.688
X174.621Y-150.688
X174.637Y-92.766
X174.637Y-94.661
X174.637Y-119.766
X174.637Y-121.661
X174.637Y-146.766
X174.637Y-148.661
X174.639Y-106.975
X174.639Y-133.975
X174.639Y-160.975
X174.642Y-98.146
X174.642Y-125.146
X174.642Y-152.146
X174.723Y-100.79
X174.723Y-127.79
X174.723Y-154.79
X174.727Y-102.988
X174.727Y-129.988
X174.727Y-156.988
X175.978Y-99.388
X175.978Y-100.775
X175.978Y-126.388
X175.978Y-127.775
X175.978Y-153.388
X175.978Y-154.775
X177.126Y-99.378
X177.126Y-126.378
X177.126Y-153.378
X177.141Y-100.826
X177.141Y-127.826
X177.141Y-154.826
X179.136Y-95.558
X179.136Y-122.558
X179.136Y-149.558
X179.75Y-111.0
X179.75Y-138.0
X179.75Y-165.0
X180.75Y-98.2
X180.75Y-125.2
X180.75Y-152.2
X182.79Y-95.331
X182.79Y-122.331
X182.79Y-149.331
X184.456Y-103.815
X184.456Y-130.815
X184.456Y-157.815
X184.628Y-101.335
X184.628Y-128.335
X184.628Y-155.335
X185.801Y-108.7
X185.801Y-135.7
X185.801Y-162.7
X185.95Y-107.3
X185.95Y-134.3
X185.95Y-161.3
X186.55Y-100.3
X186.55Y-127.3
X186.55Y-154.3
X186.75Y-112.9
X186.75Y-139.9
X186.75Y-166.9
X186.772Y-115.061
X186.772Y-142.061
X186.772Y-169.061
X187.118Y-108.7
X187.118Y-135.7
X187.118Y-162.7
X191.117Y-92.781
X191.117Y-94.661
X191.117Y-96.708
X191.117Y-98.11
X191.117Y-119.781
X191.117Y-121.661
X191.117Y-123.708
X191.117Y-125.11
X191.117Y-146.781
X191.117Y-148.661
X191.117Y-150.708
X191.117Y-152.11
X191.142Y-100.775
X191.142Y-127.775
X191.142Y-154.775
X191.157Y-102.982
X191.157Y-129.982
X191.157Y-156.982
X192.371Y-96.688
X192.371Y-123.688
X192.371Y-150.688
X192.387Y-92.766
X192.387Y-94.661
X192.387Y-119.766
X192.387Y-121.661
X192.387Y-146.766
X192.387Y-148.661
X192.389Y-106.975
X192.389Y-133.975
X192.389Y-160.975
X192.392Y-98.146
X192.392Y-125.146
X192.392Y-152.146
X192.473Y-100.79
X192.473Y-127.79
X192.473Y-154.79
X192.477Y-102.988
X192.477Y-129.988
X192.477Y-156.988
X193.728Y-99.388
X193.728Y-100.775
X193.728Y-126.388
X193.728Y-127.775
X193.728Y-153.388
X193.728Y-154.775
X194.876Y-99.378
X194.876Y-126.378
X194.876Y-153.378
X194.891Y-100.826
X194.891Y-127.826
X194.891Y-154.826
X196.886Y-95.558
X196.886Y-122.558
X196.886Y-149.558
X197.5Y-111.0
X197.5Y-138.0
X197.5Y-165.0
X198.5Y-98.2
X198.5Y-125.2
X198.5Y-152.2
X200.54Y-95.331
X200.54Y-122.331
X200.54Y-149.331
X202.206Y-103.815
X202.206Y-130.815
X202.206Y-157.815
X202.378Y-101.335
X202.378Y-128.335
X202.378Y-155.335
X203.551Y-108.7
X203.551Y-135.7
X203.551Y-162.7
X203.7Y-107.3
X203.7Y-134.3
X203.7Y-161.3
X204.3Y-100.3
X204.3Y-127.3
X204.3Y-154.3
X204.5Y-112.9
X204.5Y-139.9
X204.5Y-166.9
X204.522Y-115.061
X204.522Y-142.061
X204.522Y-169.061
X204.868Y-108.7
X204.868Y-135.7
X204.868Y-162.7
T2
X125.4Y-136.465
X126.65Y-134.3
X178.65Y-136.465
X179.9Y-134.3
X143.15Y-109.465
X144.4Y-107.3
X196.4Y-109.465
X197.65Y-107.3
X196.4Y-136.465
X197.65Y-134.3
X125.4Y-163.465
X126.65Y-161.3
X143.15Y-163.465
X144.4Y-161.3
X178.65Y-163.465
X179.9Y-161.3
X125.4Y-109.465
X126.65Y-107.3
X160.9Y-109.465
X162.15Y-107.3
X160.9Y-136.465
X162.15Y-134.3
X178.65Y-109.465
X179.9Y-107.3
X143.15Y-136.465
X144.4Y-134.3
X196.4Y-163.465
X197.65Y-161.3
X160.9Y-163.465
X162.15Y-161.3
T3
X150.86Y-93.59
X150.86Y-96.13
X186.36Y-120.59
X186.36Y-123.13
X191.616Y-114.966
X194.156Y-114.966
X186.36Y-147.59
X186.36Y-150.13
X168.61Y-93.59
X168.61Y-96.13
X186.36Y-93.59
X186.36Y-96.13
X204.11Y-120.59
X204.11Y-123.13
X120.616Y-141.966
X123.156Y-141.966
X168.61Y-147.59
X168.61Y-150.13
X156.116Y-168.966
X158.656Y-168.966
X120.616Y-168.966
X123.156Y-168.966
X156.116Y-114.966
X158.656Y-114.966
X204.11Y-93.59
X204.11Y-96.13
X150.86Y-120.59
X150.86Y-123.13
X156.116Y-141.966
X158.656Y-141.966
X173.866Y-114.966
X176.406Y-114.966
X191.616Y-168.966
X194.156Y-168.966
X173.866Y-141.966
X176.406Y-141.966
X133.11Y-120.59
X133.11Y-123.13
X133.11Y-147.59
X133.11Y-150.13
X138.366Y-141.966
X140.906Y-141.966
X191.616Y-141.966
X194.156Y-141.966
X204.11Y-147.59
X204.11Y-150.13
X173.866Y-168.966
X176.406Y-168.966
X133.11Y-93.59
X133.11Y-96.13
X138.366Y-114.966
X140.906Y-114.966
X120.616Y-114.966
X123.156Y-114.966
X168.61Y-120.59
X168.61Y-123.13
X150.86Y-147.59
X150.86Y-150.13
X138.366Y-168.966
X140.906Y-168.966
T0
M30
