EESchema Schematic File Version 4
EELAYER 30 0
EELAYER END
$Descr A4 11693 8268
encoding utf-8
Sheet 1 1
Title ""
Date "lun. 30 mars 2015"
Rev ""
Comp ""
Comment1 ""
Comment2 ""
Comment3 ""
Comment4 ""
$EndDescr
Text Label 6350 1250 0    60   ~ 0
VCC
Text Label 6350 1350 0    60   ~ 0
TXD1
Text Label 6350 1450 0    60   ~ 0
SCL
Text Label 10300 2850 0    60   ~ 0
GNDA
Text Label 10300 2750 0    60   ~ 0
NC
Text Label 10300 2650 0    60   ~ 0
RTS
Text Label 10300 2550 0    60   ~ 0
RG4-CCP5-P1D
Text Label 10300 2450 0    60   ~ 0
RF5-AN10-CVREF
Text Label 10300 2350 0    60   ~ 0
RF1-AN6-C2OUT
Text Label 10300 2150 0    60   ~ 0
VIN
Text Label 10300 2050 0    60   ~ 0
+3.3V
Text Label 10300 1950 0    60   ~ 0
RST
Text Label 10300 1850 0    60   ~ 0
RB3-INT3
Text Label 10300 1750 0    60   ~ 0
RB1-INT1
Text Label 10300 1650 0    60   ~ 0
RD1-ECCP3-P3A
Text Label 10300 1450 0    60   ~ 0
RE1-P2C
Text Label 10300 1350 0    60   ~ 0
RA5-AN4
Text Notes 10600 1050 0    60   ~ 0
Holes
Text Notes 7700 850  0    60   ~ 12
Cape for OLIMEX PIC-WEB\nthat uses the same pin disposition\nlike "PIC-WEB" board Rev C.
$Comp
L power:GND #PWR03
U 1 1 56D70CC2
P 8650 3200
F 0 "#PWR03" H 8650 2950 50  0001 C CNN
F 1 "GND" H 8650 3050 50  0000 C CNN
F 2 "" H 8650 3200 50  0000 C CNN
F 3 "" H 8650 3200 50  0000 C CNN
	1    8650 3200
	1    0    0    -1  
$EndComp
$Comp
L power:GNDA #PWR04
U 1 1 56D70CFF
P 10300 3200
F 0 "#PWR04" H 10300 2950 50  0001 C CNN
F 1 "GNDA" H 10300 3050 50  0000 C CNN
F 2 "" H 10300 3200 50  0000 C CNN
F 3 "" H 10300 3200 50  0000 C CNN
	1    10300 3200
	1    0    0    -1  
$EndComp
$Comp
L Connector_Generic:Conn_01x01 P5
U 1 1 56D71177
P 10550 700
F 0 "P5" V 10650 700 50  0000 C CNN
F 1 "CONN_01X01" V 10650 700 50  0001 C CNN
F 2 "Socket_Arduino_Uno:Arduino_1pin" H 10471 774 20  0000 C CNN
F 3 "" H 10550 700 50  0000 C CNN
	1    10550 700 
	0    -1   -1   0   
$EndComp
$Comp
L Connector_Generic:Conn_01x01 P6
U 1 1 56D71274
P 10650 700
F 0 "P6" V 10750 700 50  0000 C CNN
F 1 "CONN_01X01" V 10750 700 50  0001 C CNN
F 2 "Socket_Arduino_Uno:Arduino_1pin" H 10650 700 20  0001 C CNN
F 3 "" H 10650 700 50  0000 C CNN
	1    10650 700 
	0    -1   -1   0   
$EndComp
$Comp
L Connector_Generic:Conn_01x01 P7
U 1 1 56D712A8
P 10750 700
F 0 "P7" V 10850 700 50  0000 C CNN
F 1 "CONN_01X01" V 10850 700 50  0001 C CNN
F 2 "Socket_Arduino_Uno:Arduino_1pin" V 10750 700 20  0001 C CNN
F 3 "" H 10750 700 50  0000 C CNN
	1    10750 700 
	0    -1   -1   0   
$EndComp
$Comp
L Connector_Generic:Conn_01x01 P8
U 1 1 56D712DB
P 10850 700
F 0 "P8" V 10950 700 50  0000 C CNN
F 1 "CONN_01X01" V 10950 700 50  0001 C CNN
F 2 "Socket_Arduino_Uno:Arduino_1pin" H 10774 622 20  0000 C CNN
F 3 "" H 10850 700 50  0000 C CNN
	1    10850 700 
	0    -1   -1   0   
$EndComp
NoConn ~ 10550 900 
NoConn ~ 10650 900 
NoConn ~ 10750 900 
NoConn ~ 10850 900 
Wire Wire Line
	6850 1250 6350 1250
Wire Wire Line
	6850 1350 6350 1350
Wire Wire Line
	6850 1450 6350 1450
Wire Wire Line
	9950 2150 10300 2150
Wire Wire Line
	9950 2050 10300 2050
Wire Wire Line
	9950 1950 10300 1950
Wire Wire Line
	9950 1850 10300 1850
Wire Wire Line
	9950 1750 10300 1750
Wire Wire Line
	9950 1650 10300 1650
Wire Wire Line
	9950 1450 10300 1450
Wire Wire Line
	9950 1350 10300 1350
Wire Wire Line
	9950 1250 10300 1250
Wire Wire Line
	9950 2850 10300 2850
Wire Wire Line
	9950 2750 10300 2750
Wire Wire Line
	9950 2650 10300 2650
Wire Wire Line
	9950 2550 10300 2550
Wire Wire Line
	9950 2450 10300 2450
Wire Wire Line
	9950 2350 10300 2350
Wire Notes Line
	5950 500  5950 3450
Wire Notes Line
	5950 3450 11200 3450
Text Notes 9350 1050 0    60   ~ 0
1
Wire Notes Line
	10950 1050 10450 1050
Wire Notes Line
	10450 1050 10450 550 
Text Label 10300 1250 0    60   ~ 0
RA3-AN3-VREF+
$Comp
L Connector_Generic:Conn_02x17_Odd_Even J2
U 1 1 60745D4D
P 9650 2050
F 0 "J2" H 9700 3067 50  0000 C CNN
F 1 "EXT" H 9700 2976 50  0000 C CNN
F 2 "Connector_PinHeader_2.54mm:PinHeader_2x17_P2.54mm_Vertical" H 9650 2050 50  0001 C CNN
F 3 "~" H 9650 2050 50  0001 C CNN
	1    9650 2050
	1    0    0    -1  
$EndComp
Text Label 10300 1550 0    60   ~ 0
RC2-ECCP1-P1A
Wire Wire Line
	9950 1550 10300 1550
Text Label 10300 2250 0    60   ~ 0
RE4-P3B
Wire Wire Line
	9950 2250 10300 2250
Text Label 9100 1250 2    60   ~ 0
RA2-AN2-VREF–
Text Label 9100 1350 2    60   ~ 0
RA4-T0CKI
Text Label 9100 1450 2    60   ~ 0
RE0-P2D
Text Label 9100 1550 2    60   ~ 0
RE2-P2B
Text Label 9100 1750 2    60   ~ 0
RD2-CCP4-P3D
Text Label 9100 1950 2    60   ~ 0
RB5-KBI1
Text Label 9100 2050 2    60   ~ 0
+3.3V
Text Label 9100 2150 2    60   ~ 0
GND
Text Label 9100 2250 2    60   ~ 0
RE3-P3C
Text Label 9100 2350 2    60   ~ 0
RE5-P1C
Text Label 9100 2450 2    60   ~ 0
RF2-AN7-C1OUT
Text Label 9100 2650 2    60   ~ 0
CTS
Text Label 9100 2750 2    60   ~ 0
NC
Wire Wire Line
	9450 1950 9100 1950
Wire Wire Line
	9450 2050 9100 2050
Wire Wire Line
	9450 2250 9100 2250
Wire Wire Line
	9450 2350 9100 2350
Wire Wire Line
	9450 2450 9100 2450
Wire Wire Line
	9450 2650 9100 2650
Wire Wire Line
	9450 2750 9100 2750
Wire Wire Line
	9450 2850 9100 2850
Wire Wire Line
	9450 1250 9100 1250
Wire Wire Line
	9450 1350 9100 1350
Wire Wire Line
	9450 1450 9100 1450
Wire Wire Line
	9450 1550 9100 1550
Wire Wire Line
	9450 1650 9100 1650
Wire Wire Line
	9450 1750 9100 1750
Text Label 9100 2850 2    60   ~ 0
3.3VA
Text Label 9100 2550 2    60   ~ 0
RF6-AN11
Wire Wire Line
	9450 2550 9100 2550
Text Label 9100 1850 2    60   ~ 0
RB2-INT2
Wire Wire Line
	9450 1850 9100 1850
Text Label 9100 1650 2    60   ~ 0
RD0-P1B
$Comp
L Connector_Generic:Conn_02x05_Odd_Even J1
U 1 1 60768DB2
P 7050 1450
F 0 "J1" H 7100 1867 50  0000 C CNN
F 1 "UEXT" H 7100 1776 50  0000 C CNN
F 2 "Connector_PinHeader_2.54mm:PinHeader_2x05_P2.54mm_Vertical" H 7050 1450 50  0001 C CNN
F 3 "~" H 7050 1450 50  0001 C CNN
	1    7050 1450
	1    0    0    -1  
$EndComp
Text Label 7850 1350 2    60   ~ 0
RXD1
Text Label 7850 1250 2    60   ~ 0
GND
Wire Wire Line
	7350 1450 7850 1450
Wire Wire Line
	7350 1350 7850 1350
Text Label 7850 1650 2    60   ~ 0
UEXT_#CS
Text Label 7850 1550 2    60   ~ 0
SDO
Text Label 7850 1450 2    60   ~ 0
SDA
Wire Wire Line
	7350 1650 7850 1650
Wire Wire Line
	7350 1550 7850 1550
Text Label 6350 1550 0    60   ~ 0
SDI
Text Label 6350 1650 0    60   ~ 0
SCK
Wire Wire Line
	6850 1550 6350 1550
Wire Wire Line
	6850 1650 6350 1650
Wire Wire Line
	8650 3200 8650 2150
Wire Wire Line
	8650 2150 9450 2150
Wire Wire Line
	10300 3200 10300 2850
$Comp
L power:GND #PWR0101
U 1 1 6079330B
P 8050 1850
F 0 "#PWR0101" H 8050 1600 50  0001 C CNN
F 1 "GND" H 8050 1700 50  0000 C CNN
F 2 "" H 8050 1850 50  0000 C CNN
F 3 "" H 8050 1850 50  0000 C CNN
	1    8050 1850
	1    0    0    -1  
$EndComp
Wire Wire Line
	8050 1850 8050 1250
Wire Wire Line
	7350 1250 8050 1250
$Comp
L Library-cbas:Mrf24j40ma U1
U 1 1 60FA0603
P 3700 1950
F 0 "U1" H 3725 2165 50  0000 C CNN
F 1 "Mrf24j40ma" H 3725 2074 50  0000 C CNN
F 2 "Monitor-RF_MODULE:microchip_MRF24F_SMD" H 3725 1983 50  0000 C CNN
F 3 "" H 3750 1950 50  0001 C CNN
	1    3700 1950
	1    0    0    -1  
$EndComp
$Comp
L power:GND #PWR0102
U 1 1 60FAD570
P 2900 2050
F 0 "#PWR0102" H 2900 1800 50  0001 C CNN
F 1 "GND" H 2900 1900 50  0000 C CNN
F 2 "" H 2900 2050 50  0000 C CNN
F 3 "" H 2900 2050 50  0000 C CNN
	1    2900 2050
	1    0    0    -1  
$EndComp
$Comp
L power:GND #PWR0103
U 1 1 60FAD954
P 4500 2050
F 0 "#PWR0103" H 4500 1800 50  0001 C CNN
F 1 "GND" H 4500 1900 50  0000 C CNN
F 2 "" H 4500 2050 50  0000 C CNN
F 3 "" H 4500 2050 50  0000 C CNN
	1    4500 2050
	1    0    0    -1  
$EndComp
$Comp
L power:GND #PWR0104
U 1 1 60FADBAB
P 2750 3950
F 0 "#PWR0104" H 2750 3700 50  0001 C CNN
F 1 "GND" H 2750 3800 50  0000 C CNN
F 2 "" H 2750 3950 50  0000 C CNN
F 3 "" H 2750 3950 50  0000 C CNN
	1    2750 3950
	1    0    0    -1  
$EndComp
$Comp
L power:GND #PWR0105
U 1 1 60FADD5D
P 5050 3950
F 0 "#PWR0105" H 5050 3700 50  0001 C CNN
F 1 "GND" H 5050 3800 50  0000 C CNN
F 2 "" H 5050 3950 50  0000 C CNN
F 3 "" H 5050 3950 50  0000 C CNN
	1    5050 3950
	1    0    0    -1  
$EndComp
$Comp
L power:GND #PWR0106
U 1 1 60FAE1EA
P 5050 5100
F 0 "#PWR0106" H 5050 4850 50  0001 C CNN
F 1 "GND" H 5050 4950 50  0000 C CNN
F 2 "" H 5050 5100 50  0000 C CNN
F 3 "" H 5050 5100 50  0000 C CNN
	1    5050 5100
	1    0    0    -1  
$EndComp
$Comp
L power:GND #PWR0107
U 1 1 60FAE7D1
P 2750 5500
F 0 "#PWR0107" H 2750 5250 50  0001 C CNN
F 1 "GND" H 2750 5350 50  0000 C CNN
F 2 "" H 2750 5500 50  0000 C CNN
F 3 "" H 2750 5500 50  0000 C CNN
	1    2750 5500
	1    0    0    -1  
$EndComp
Wire Wire Line
	2750 3950 3050 3950
Wire Wire Line
	4700 3950 5050 3950
Wire Wire Line
	4700 5100 4700 5250
Wire Wire Line
	4700 5100 5050 5100
Wire Wire Line
	2750 5500 3050 5500
Connection ~ 4700 5100
Connection ~ 3050 4250
Wire Wire Line
	3050 4100 3050 3950
Connection ~ 3050 4100
Connection ~ 3050 3950
Wire Wire Line
	3050 4250 3050 4100
Wire Wire Line
	3050 4400 3050 4250
$Comp
L Library-cbas:SX1278-LORA U2
U 1 1 60FA66FC
P 3800 3900
F 0 "U2" H 3875 4075 50  0000 C CNN
F 1 "SX1278-LORA" H 3875 3984 50  0000 C CNN
F 2 "Monitor-RF_MODULE:sx1278" H 3500 3900 50  0001 C CNN
F 3 "" H 3500 3900 50  0001 C CNN
	1    3800 3900
	1    0    0    -1  
$EndComp
NoConn ~ 3050 5150
NoConn ~ 4150 2500
Wire Wire Line
	2900 2050 3300 2050
Wire Wire Line
	4150 2050 4500 2050
Wire Wire Line
	4150 2200 4150 2050
Connection ~ 4150 2050
Text Label 4150 2350 0    60   ~ 0
+3.3V
Text Label 4700 4150 0    60   ~ 0
+3.3V
Text Label 4150 2800 0    60   ~ 0
SDI
Text Label 4700 4500 0    60   ~ 0
SDI
Text Label 3300 2650 2    60   ~ 0
SDO
Text Label 4700 4650 0    60   ~ 0
SDO
Text Label 4150 2650 0    60   ~ 0
UEXT_#CS
NoConn ~ 9100 2750
NoConn ~ 10300 2750
Text Label 3300 2500 2    60   ~ 0
RB1-INT1
Text Label 3300 2800 2    60   ~ 0
SCK
Text Label 4700 4350 0    60   ~ 0
SCK
NoConn ~ 3050 4700
NoConn ~ 3050 4850
NoConn ~ 3050 5000
NoConn ~ 3050 5300
$Comp
L power:GND #PWR0108
U 1 1 60FE229A
P 5050 5600
F 0 "#PWR0108" H 5050 5350 50  0001 C CNN
F 1 "GND" H 5050 5450 50  0000 C CNN
F 2 "" H 5050 5600 50  0000 C CNN
F 3 "" H 5050 5600 50  0000 C CNN
	1    5050 5600
	1    0    0    -1  
$EndComp
Wire Wire Line
	5050 5550 4700 5550
$Comp
L Device:Antenna AE1
U 1 1 60FE5460
P 5550 5150
F 0 "AE1" H 5630 5139 50  0000 L CNN
F 1 "Antenna" H 5630 5048 50  0000 L CNN
F 2 "Monitor-RF_MODULE:Antenna-433MHz" H 5550 5150 50  0001 C CNN
F 3 "~" H 5550 5150 50  0001 C CNN
	1    5550 5150
	1    0    0    -1  
$EndComp
Wire Wire Line
	5550 5350 5550 5400
Wire Wire Line
	4700 5400 4850 5400
Text Label 4700 4800 0    60   ~ 0
RA3-AN3-VREF+
Text Label 4700 4950 0    60   ~ 0
RA5-AN4
Text Label 3300 2350 2    60   ~ 0
RE1-P2C
Text Label 3300 2200 2    60   ~ 0
RC2-ECCP1-P1A
$Comp
L Connector_Generic:Conn_01x06 J3
U 1 1 610D684E
P 1400 2350
F 0 "J3" H 1318 2767 50  0000 C CNN
F 1 "Conn_01x06" H 1318 2676 50  0000 C CNN
F 2 "Connector_PinHeader_2.54mm:PinHeader_1x06_P2.54mm_Vertical" H 1400 2350 50  0001 C CNN
F 3 "~" H 1400 2350 50  0001 C CNN
	1    1400 2350
	-1   0    0    -1  
$EndComp
$Comp
L Connector_Generic:Conn_01x06 J5
U 1 1 610D73E6
P 1850 2350
F 0 "J5" H 1930 2342 50  0000 L CNN
F 1 "Conn_01x06" H 1930 2251 50  0000 L CNN
F 2 "Connector_PinHeader_2.54mm:PinHeader_1x06_P2.54mm_Vertical" H 1850 2350 50  0001 C CNN
F 3 "~" H 1850 2350 50  0001 C CNN
	1    1850 2350
	1    0    0    -1  
$EndComp
$Comp
L power:GND #PWR0109
U 1 1 610DB77B
P 1950 2100
F 0 "#PWR0109" H 1950 1850 50  0001 C CNN
F 1 "GND" H 1950 1950 50  0000 C CNN
F 2 "" H 1950 2100 50  0000 C CNN
F 3 "" H 1950 2100 50  0000 C CNN
	1    1950 2100
	1    0    0    -1  
$EndComp
Wire Wire Line
	1600 2150 1600 2050
Wire Wire Line
	1600 2050 1950 2050
Wire Wire Line
	1950 2050 1950 2100
Text Label 1600 2250 2    60   ~ 0
RC2-ECCP1-P1A
Text Label 1600 2350 2    60   ~ 0
RE1-P2C
Text Label 1600 2450 2    60   ~ 0
RB1-INT1
Text Label 1600 2550 2    60   ~ 0
SDO
Text Label 1600 2650 2    60   ~ 0
SCK
Wire Wire Line
	5050 2100 5050 2200
Text Label 5050 2300 2    60   ~ 0
+3.3V
$Comp
L Connector_Generic:Conn_01x06 J4
U 1 1 610D6E9B
P 5250 2300
F 0 "J4" H 5330 2292 50  0000 L CNN
F 1 "Conn_01x06" H 5330 2201 50  0000 L CNN
F 2 "Connector_PinHeader_2.54mm:PinHeader_1x06_P2.54mm_Vertical" H 5250 2300 50  0001 C CNN
F 3 "~" H 5250 2300 50  0001 C CNN
	1    5250 2300
	1    0    0    -1  
$EndComp
Text Label 5050 2600 2    60   ~ 0
SDI
NoConn ~ 5050 2400
Text Label 5050 2500 2    60   ~ 0
UEXT_#CS
Wire Wire Line
	1650 2150 1600 2150
Connection ~ 1600 2150
Wire Wire Line
	1650 2250 1600 2250
Wire Wire Line
	1650 2350 1600 2350
Wire Wire Line
	1650 2450 1600 2450
Wire Wire Line
	1650 2550 1600 2550
Wire Wire Line
	1650 2650 1600 2650
Wire Wire Line
	4500 2050 5050 2050
Wire Wire Line
	5050 2050 5050 2100
Connection ~ 4500 2050
Connection ~ 5050 2100
Text Label 6350 1250 2    60   ~ 0
+3.3V
Text Label 5250 4150 0    60   ~ 0
VCC
Wire Wire Line
	5250 4150 4700 4150
Text Label 5050 2300 0    60   ~ 0
VCC
Text Label 4450 2350 0    60   ~ 0
VCC
Wire Wire Line
	4450 2350 4150 2350
$Comp
L Library-cbas:23k640 U3
U 1 1 6117C7BF
P 8300 4650
F 0 "U3" H 8350 4825 50  0000 C CNN
F 1 "23k640" H 8350 4734 50  0000 C CNN
F 2 "Package_SO:SO-8_3.9x4.9mm_P1.27mm" H 8300 4650 50  0001 C CNN
F 3 "" H 8300 4650 50  0001 C CNN
	1    8300 4650
	1    0    0    -1  
$EndComp
Text Label 8650 4700 0    60   ~ 0
VCC
$Comp
L power:GND #PWR0110
U 1 1 61182102
P 8050 5000
F 0 "#PWR0110" H 8050 4750 50  0001 C CNN
F 1 "GND" H 8050 4850 50  0000 C CNN
F 2 "" H 8050 5000 50  0000 C CNN
F 3 "" H 8050 5000 50  0000 C CNN
	1    8050 5000
	1    0    0    -1  
$EndComp
Text Label 8650 4900 0    60   ~ 0
SCK
Text Label 8050 4800 2    60   ~ 0
SDO
Text Label 8650 5000 0    60   ~ 0
SDI
Text Label 8050 4700 2    60   ~ 0
nCS
Text Label 8650 4800 0    60   ~ 0
nHLD
Text Label 9050 4800 0    60   ~ 0
RG4-CCP5-P1D
Text Label 7800 4700 2    60   ~ 0
RF5-AN10-CVREF
Wire Wire Line
	9050 4800 8650 4800
Wire Wire Line
	7800 4700 8050 4700
$Comp
L Connector:Conn_Coaxial J6
U 1 1 610F6FA9
P 5050 5400
F 0 "J6" H 5150 5375 50  0000 L CNN
F 1 "Conn_Coaxial" H 5150 5284 50  0000 L CNN
F 2 "Connector_Coaxial:SMA_Amphenol_132203-12_Horizontal" H 5050 5400 50  0001 C CNN
F 3 " ~" H 5050 5400 50  0001 C CNN
	1    5050 5400
	1    0    0    -1  
$EndComp
Connection ~ 4850 5400
Wire Wire Line
	4850 5400 5550 5400
Wire Wire Line
	5050 5550 5050 5600
Connection ~ 5050 5600
$Comp
L Device:LED D1
U 1 1 610BABDC
P 3100 7050
F 0 "D1" V 3139 6932 50  0000 R CNN
F 1 "LED" V 3048 6932 50  0000 R CNN
F 2 "LED_SMD:LED_0603_1608Metric_Pad1.05x0.95mm_HandSolder" H 3100 7050 50  0001 C CNN
F 3 "~" H 3100 7050 50  0001 C CNN
	1    3100 7050
	0    -1   -1   0   
$EndComp
$Comp
L Device:LED D2
U 1 1 610BBC73
P 3600 7050
F 0 "D2" V 3639 6932 50  0000 R CNN
F 1 "LED" V 3548 6932 50  0000 R CNN
F 2 "LED_SMD:LED_0603_1608Metric_Pad1.05x0.95mm_HandSolder" H 3600 7050 50  0001 C CNN
F 3 "~" H 3600 7050 50  0001 C CNN
	1    3600 7050
	0    -1   -1   0   
$EndComp
$Comp
L Device:LED D3
U 1 1 610BBF4E
P 4150 7050
F 0 "D3" V 4189 6932 50  0000 R CNN
F 1 "LED" V 4098 6932 50  0000 R CNN
F 2 "LED_SMD:LED_0603_1608Metric_Pad1.05x0.95mm_HandSolder" H 4150 7050 50  0001 C CNN
F 3 "~" H 4150 7050 50  0001 C CNN
	1    4150 7050
	0    -1   -1   0   
$EndComp
$Comp
L Device:LED D4
U 1 1 610BC317
P 4650 7050
F 0 "D4" V 4689 6932 50  0000 R CNN
F 1 "LED" V 4598 6932 50  0000 R CNN
F 2 "LED_SMD:LED_0603_1608Metric_Pad1.05x0.95mm_HandSolder" H 4650 7050 50  0001 C CNN
F 3 "~" H 4650 7050 50  0001 C CNN
	1    4650 7050
	0    -1   -1   0   
$EndComp
$Comp
L power:GND #PWR0111
U 1 1 610BDD5F
P 3100 7200
F 0 "#PWR0111" H 3100 6950 50  0001 C CNN
F 1 "GND" H 3100 7050 50  0000 C CNN
F 2 "" H 3100 7200 50  0000 C CNN
F 3 "" H 3100 7200 50  0000 C CNN
	1    3100 7200
	1    0    0    -1  
$EndComp
$Comp
L power:GND #PWR0112
U 1 1 610BDFF5
P 3600 7200
F 0 "#PWR0112" H 3600 6950 50  0001 C CNN
F 1 "GND" H 3600 7050 50  0000 C CNN
F 2 "" H 3600 7200 50  0000 C CNN
F 3 "" H 3600 7200 50  0000 C CNN
	1    3600 7200
	1    0    0    -1  
$EndComp
$Comp
L power:GND #PWR0113
U 1 1 610BE338
P 4150 7200
F 0 "#PWR0113" H 4150 6950 50  0001 C CNN
F 1 "GND" H 4150 7050 50  0000 C CNN
F 2 "" H 4150 7200 50  0000 C CNN
F 3 "" H 4150 7200 50  0000 C CNN
	1    4150 7200
	1    0    0    -1  
$EndComp
$Comp
L power:GND #PWR0114
U 1 1 610BE681
P 4650 7200
F 0 "#PWR0114" H 4650 6950 50  0001 C CNN
F 1 "GND" H 4650 7050 50  0000 C CNN
F 2 "" H 4650 7200 50  0000 C CNN
F 3 "" H 4650 7200 50  0000 C CNN
	1    4650 7200
	1    0    0    -1  
$EndComp
Text Label 3100 6600 1    60   ~ 0
RF1-AN6-C2OUT
Text Label 3600 6600 1    60   ~ 0
RE4-P3B
$Comp
L Device:R R1
U 1 1 610F2362
P 3100 6750
F 0 "R1" H 3170 6796 50  0000 L CNN
F 1 "R" H 3170 6705 50  0000 L CNN
F 2 "Resistor_SMD:R_0603_1608Metric_Pad1.05x0.95mm_HandSolder" V 3030 6750 50  0001 C CNN
F 3 "~" H 3100 6750 50  0001 C CNN
	1    3100 6750
	1    0    0    -1  
$EndComp
$Comp
L Device:R R2
U 1 1 610F2DC9
P 3600 6750
F 0 "R2" H 3670 6796 50  0000 L CNN
F 1 "R" H 3670 6705 50  0000 L CNN
F 2 "Resistor_SMD:R_0603_1608Metric_Pad1.05x0.95mm_HandSolder" V 3530 6750 50  0001 C CNN
F 3 "~" H 3600 6750 50  0001 C CNN
	1    3600 6750
	1    0    0    -1  
$EndComp
$Comp
L Device:R R3
U 1 1 610F30DA
P 4150 6750
F 0 "R3" H 4220 6796 50  0000 L CNN
F 1 "R" H 4220 6705 50  0000 L CNN
F 2 "Resistor_SMD:R_0603_1608Metric_Pad1.05x0.95mm_HandSolder" V 4080 6750 50  0001 C CNN
F 3 "~" H 4150 6750 50  0001 C CNN
	1    4150 6750
	1    0    0    -1  
$EndComp
$Comp
L Device:R R4
U 1 1 610F33F6
P 4650 6750
F 0 "R4" H 4720 6796 50  0000 L CNN
F 1 "R" H 4720 6705 50  0000 L CNN
F 2 "Resistor_SMD:R_0603_1608Metric_Pad1.05x0.95mm_HandSolder" V 4580 6750 50  0001 C CNN
F 3 "~" H 4650 6750 50  0001 C CNN
	1    4650 6750
	1    0    0    -1  
$EndComp
Text Label 3050 4550 2    60   ~ 0
RB3-INT3
Text Label 4650 6600 1    60   ~ 0
RE3-P3C
Text Label 4150 6600 1    60   ~ 0
RE5-P1C
$EndSCHEMATC
