EESchema Schematic File Version 2
LIBS:power
LIBS:device
LIBS:switches
LIBS:relays
LIBS:motors
LIBS:transistors
LIBS:conn
LIBS:linear
LIBS:regul
LIBS:74xx
LIBS:cmos4000
LIBS:adc-dac
LIBS:memory
LIBS:xilinx
LIBS:microcontrollers
LIBS:dsp
LIBS:analog_switches
LIBS:motorola
LIBS:texas
LIBS:intel
LIBS:audio
LIBS:interface
LIBS:digital-audio
LIBS:philips
LIBS:display
LIBS:cypress
LIBS:siliconi
LIBS:opto
LIBS:atmel
LIBS:contrib
LIBS:valves
LIBS:microchip
LIBS:REGL
LIBS:FFD-PAN-Rep-cache
EELAYER 25 0
EELAYER END
$Descr A4 11693 8268
encoding utf-8
Sheet 3 4
Title ""
Date ""
Rev ""
Comp ""
Comment1 ""
Comment2 ""
Comment3 ""
Comment4 ""
$EndDescr
$Comp
L CP C1
U 1 1 5B5B5B9E
P 4150 3900
F 0 "C1" H 4175 4000 50  0000 L CNN
F 1 "CP" H 4175 3800 50  0000 L CNN
F 2 "Capacitors_SMD:C_1206_HandSoldering" H 4188 3750 50  0001 C CNN
F 3 "" H 4150 3900 50  0001 C CNN
	1    4150 3900
	1    0    0    -1  
$EndComp
$Comp
L CP C3
U 1 1 5B5B5B9F
P 6750 3650
F 0 "C3" H 6775 3750 50  0000 L CNN
F 1 "CP" H 6775 3550 50  0000 L CNN
F 2 "Capacitors_SMD:C_1206_HandSoldering" H 6788 3500 50  0001 C CNN
F 3 "" H 6750 3650 50  0001 C CNN
	1    6750 3650
	1    0    0    -1  
$EndComp
Text HLabel 8700 3500 2    60   Output ~ 0
3.3V
Text HLabel 8700 4150 2    60   Input ~ 0
0v
$Comp
L +5VA #PWR010
U 1 1 5B5B5BA0
P 6250 3050
F 0 "#PWR010" H 6250 2900 50  0001 C CNN
F 1 "+5VA" H 6250 3190 50  0000 C CNN
F 2 "" H 6250 3050 50  0001 C CNN
F 3 "" H 6250 3050 50  0001 C CNN
	1    6250 3050
	1    0    0    -1  
$EndComp
$Comp
L +5VA #PWR011
U 1 1 5B5B5BA1
P 4600 5550
F 0 "#PWR011" H 4600 5400 50  0001 C CNN
F 1 "+5VA" H 4600 5690 50  0000 C CNN
F 2 "" H 4600 5550 50  0001 C CNN
F 3 "" H 4600 5550 50  0001 C CNN
	1    4600 5550
	1    0    0    -1  
$EndComp
$Comp
L PWR_FLAG #FLG012
U 1 1 5B5B5BA2
P 4300 5550
F 0 "#FLG012" H 4300 5625 50  0001 C CNN
F 1 "PWR_FLAG" H 4300 5700 50  0000 C CNN
F 2 "" H 4300 5550 50  0001 C CNN
F 3 "" H 4300 5550 50  0001 C CNN
	1    4300 5550
	1    0    0    -1  
$EndComp
$Comp
L PWR_FLAG #FLG013
U 1 1 5B5B5BAD
P 3650 5550
F 0 "#FLG013" H 3650 5625 50  0001 C CNN
F 1 "PWR_FLAG" H 3650 5700 50  0000 C CNN
F 2 "" H 3650 5550 50  0001 C CNN
F 3 "" H 3650 5550 50  0001 C CNN
	1    3650 5550
	1    0    0    -1  
$EndComp
$Comp
L +6V #PWR014
U 1 1 5B5B5BAE
P 4400 3500
F 0 "#PWR014" H 4400 3350 50  0001 C CNN
F 1 "+6V" H 4400 3640 50  0000 C CNN
F 2 "" H 4400 3500 50  0001 C CNN
F 3 "" H 4400 3500 50  0001 C CNN
	1    4400 3500
	1    0    0    -1  
$EndComp
$Comp
L +6V #PWR015
U 1 1 5B5B5BAF
P 3900 5550
F 0 "#PWR015" H 3900 5400 50  0001 C CNN
F 1 "+6V" H 3900 5690 50  0000 C CNN
F 2 "" H 3900 5550 50  0001 C CNN
F 3 "" H 3900 5550 50  0001 C CNN
	1    3900 5550
	1    0    0    -1  
$EndComp
Text HLabel 3250 3650 0    60   Input ~ 0
6Vbat
Text HLabel 3250 4150 0    60   Output ~ 0
0Vbat
$Comp
L Ferrite_Bead_Small L2
U 1 1 5B5B5BB4
P 6500 3500
F 0 "L2" H 6575 3550 50  0000 L CNN
F 1 "Ferrite_Bead_Small" H 6575 3450 50  0000 L CNN
F 2 "Inductors_THT:L_Axial_L9.5mm_D4.0mm_P12.70mm_Horizontal_Fastron_SMCC" V 6430 3500 50  0001 C CNN
F 3 "" H 6500 3500 50  0001 C CNN
	1    6500 3500
	0    1    1    0   
$EndComp
$Comp
L Ferrite_Bead_Small L3
U 1 1 5B5B5BB5
P 6500 4150
F 0 "L3" H 6575 4200 50  0000 L CNN
F 1 "Ferrite_Bead_Small" H 6575 4100 50  0000 L CNN
F 2 "Inductors_THT:L_Axial_L9.5mm_D4.0mm_P12.70mm_Horizontal_Fastron_SMCC" V 6430 4150 50  0001 C CNN
F 3 "" H 6500 4150 50  0001 C CNN
	1    6500 4150
	0    1    1    0   
$EndComp
$Comp
L PWR_FLAG #FLG016
U 1 1 5B5B5BB6
P 5100 5550
F 0 "#FLG016" H 5100 5625 50  0001 C CNN
F 1 "PWR_FLAG" H 5100 5700 50  0000 C CNN
F 2 "" H 5100 5550 50  0001 C CNN
F 3 "" H 5100 5550 50  0001 C CNN
	1    5100 5550
	1    0    0    -1  
$EndComp
$Comp
L Earth #PWR017
U 1 1 5B5B5BB7
P 5100 5650
F 0 "#PWR017" H 5100 5400 50  0001 C CNN
F 1 "Earth" H 5100 5500 50  0001 C CNN
F 2 "" H 5100 5650 50  0001 C CNN
F 3 "" H 5100 5650 50  0001 C CNN
	1    5100 5650
	1    0    0    -1  
$EndComp
$Comp
L GNDA #PWR018
U 1 1 5B5B5BB9
P 6400 5700
F 0 "#PWR018" H 6400 5450 50  0001 C CNN
F 1 "GNDA" H 6400 5550 50  0000 C CNN
F 2 "" H 6400 5700 50  0001 C CNN
F 3 "" H 6400 5700 50  0001 C CNN
	1    6400 5700
	1    0    0    -1  
$EndComp
$Comp
L PWR_FLAG #FLG019
U 1 1 5B5B5BBA
P 6400 5550
F 0 "#FLG019" H 6400 5625 50  0001 C CNN
F 1 "PWR_FLAG" H 6400 5700 50  0000 C CNN
F 2 "" H 6400 5550 50  0001 C CNN
F 3 "" H 6400 5550 50  0001 C CNN
	1    6400 5550
	1    0    0    -1  
$EndComp
$Comp
L +3.3V #PWR020
U 1 1 5B5B5BBB
P 5550 5550
F 0 "#PWR020" H 5550 5400 50  0001 C CNN
F 1 "+3.3V" H 5550 5690 50  0000 C CNN
F 2 "" H 5550 5550 50  0001 C CNN
F 3 "" H 5550 5550 50  0001 C CNN
	1    5550 5550
	1    0    0    -1  
$EndComp
$Comp
L MCP16301 U1
U 1 1 5B6550C1
P 5000 3750
F 0 "U1" H 4850 3975 50  0000 C CNN
F 1 "MCP16301" H 5000 3975 50  0000 L CNN
F 2 "TO_SOT_Packages_SMD:SOT-23-6" H 5000 4075 50  0001 C CNN
F 3 "" H 5000 3750 50  0001 C CNN
	1    5000 3750
	1    0    0    -1  
$EndComp
$Comp
L 1N5817 D1
U 1 1 5B65575D
P 3700 3650
F 0 "D1" H 3700 3750 50  0000 C CNN
F 1 "1N5817" H 3700 3550 50  0000 C CNN
F 2 "Diodes_THT:D_DO-41_SOD81_P7.62mm_Horizontal" H 3700 3475 50  0001 C CNN
F 3 "" H 3700 3650 50  0001 C CNN
	1    3700 3650
	-1   0    0    1   
$EndComp
$Comp
L R R2
U 1 1 5B6559C4
P 6250 3650
F 0 "R2" V 6330 3650 50  0000 C CNN
F 1 "R" V 6250 3650 50  0000 C CNN
F 2 "Resistors_THT:R_Axial_DIN0204_L3.6mm_D1.6mm_P7.62mm_Horizontal" V 6180 3650 50  0001 C CNN
F 3 "" H 6250 3650 50  0001 C CNN
	1    6250 3650
	1    0    0    -1  
$EndComp
$Comp
L R R3
U 1 1 5B655A58
P 6250 4000
F 0 "R3" V 6330 4000 50  0000 C CNN
F 1 "R" V 6250 4000 50  0000 C CNN
F 2 "Resistors_THT:R_Axial_DIN0204_L3.6mm_D1.6mm_P7.62mm_Horizontal" V 6180 4000 50  0001 C CNN
F 3 "" H 6250 4000 50  0001 C CNN
	1    6250 4000
	1    0    0    -1  
$EndComp
$Comp
L CP C4
U 1 1 5B655FA3
P 7000 3650
F 0 "C4" H 7025 3750 50  0000 L CNN
F 1 "CP" H 7025 3550 50  0000 L CNN
F 2 "Capacitors_SMD:C_1206_HandSoldering" H 7038 3500 50  0001 C CNN
F 3 "" H 7000 3650 50  0001 C CNN
	1    7000 3650
	1    0    0    -1  
$EndComp
Wire Wire Line
	4600 5550 4300 5550
Wire Wire Line
	3900 5550 3650 5550
Wire Wire Line
	5100 5550 5100 5650
Wire Wire Line
	3250 4150 6400 4150
Wire Wire Line
	6600 4150 8700 4150
Wire Wire Line
	3250 3650 3550 3650
Wire Wire Line
	3850 3650 4700 3650
Wire Wire Line
	4150 3650 4150 3750
Wire Wire Line
	4150 4050 4150 4150
Connection ~ 4150 4150
Wire Wire Line
	5300 3850 6250 3850
Wire Wire Line
	6250 3850 6250 3800
Wire Wire Line
	5300 3750 5700 3750
Wire Wire Line
	5500 3550 5500 3750
$Comp
L 1N5817 D3
U 1 1 5B6561C5
P 5600 3900
F 0 "D3" H 5600 4000 50  0000 C CNN
F 1 "1N5817" H 5600 3800 50  0000 C CNN
F 2 "Diodes_THT:D_DO-41_SOD81_P7.62mm_Horizontal" H 5600 3725 50  0001 C CNN
F 3 "" H 5600 3900 50  0001 C CNN
	1    5600 3900
	0    1    1    0   
$EndComp
Connection ~ 5500 3750
Wire Wire Line
	5600 4050 5600 4150
Connection ~ 5600 4150
$Comp
L D_ALT D4
U 1 1 5B656392
P 5800 3200
F 0 "D4" H 5800 3300 50  0000 C CNN
F 1 "D_ALT" H 5800 3100 50  0000 C CNN
F 2 "Diodes_THT:D_DO-35_SOD27_P7.62mm_Horizontal" H 5800 3200 50  0001 C CNN
F 3 "" H 5800 3200 50  0001 C CNN
	1    5800 3200
	1    0    0    -1  
$EndComp
Wire Wire Line
	5950 3200 6250 3200
Wire Wire Line
	6250 3050 6250 3500
Wire Wire Line
	5300 3200 5650 3200
Wire Wire Line
	5300 3200 5300 3650
Wire Wire Line
	5500 3250 5500 3200
Connection ~ 5500 3200
Connection ~ 4150 3650
Wire Wire Line
	6050 3500 6400 3500
Wire Wire Line
	6600 3500 7450 3500
Connection ~ 6750 3500
Wire Wire Line
	6750 4150 6750 3800
Connection ~ 6250 4150
Wire Wire Line
	7000 4150 7000 3800
Connection ~ 6750 4150
$Comp
L L L1
U 1 1 5B656F85
P 5900 3500
F 0 "L1" V 5850 3500 50  0000 C CNN
F 1 "L" V 5975 3500 50  0000 C CNN
F 2 "Choke_Axial_ThroughHole:Choke_Horizontal_RM15mm" H 5900 3500 50  0001 C CNN
F 3 "" H 5900 3500 50  0001 C CNN
	1    5900 3500
	0    -1   -1   0   
$EndComp
Connection ~ 6250 3500
Wire Wire Line
	5750 3500 5700 3500
Wire Wire Line
	5700 3500 5700 3750
Connection ~ 5600 3750
$Comp
L R R1
U 1 1 5B657561
P 4400 3850
F 0 "R1" V 4480 3850 50  0000 C CNN
F 1 "R" V 4400 3850 50  0000 C CNN
F 2 "Resistors_THT:R_Axial_DIN0204_L3.6mm_D1.6mm_P7.62mm_Horizontal" V 4330 3850 50  0001 C CNN
F 3 "" H 4400 3850 50  0001 C CNN
	1    4400 3850
	1    0    0    -1  
$EndComp
$Comp
L LED D2
U 1 1 5B6576D8
P 4400 4250
F 0 "D2" H 4400 4350 50  0000 C CNN
F 1 "LED" H 4400 4150 50  0000 C CNN
F 2 "LEDs:LED_D5.0mm" H 4400 4250 50  0001 C CNN
F 3 "" H 4400 4250 50  0001 C CNN
	1    4400 4250
	0    -1   -1   0   
$EndComp
Wire Wire Line
	4400 3500 4400 3700
Connection ~ 4400 3650
Wire Wire Line
	4400 4000 4400 4100
Wire Wire Line
	4400 4400 4400 4450
Wire Wire Line
	4400 4450 4550 4450
Wire Wire Line
	4550 4450 4550 4150
Connection ~ 4550 4150
$Comp
L LM1117-3.3 U2
U 1 1 5B657B93
P 7750 3500
F 0 "U2" H 7600 3625 50  0000 C CNN
F 1 "LM1117-3.3" H 7750 3625 50  0000 L CNN
F 2 "TO_SOT_Packages_SMD:SOT-223-3Lead_TabPin2" H 7750 3500 50  0001 C CNN
F 3 "" H 7750 3500 50  0001 C CNN
	1    7750 3500
	1    0    0    -1  
$EndComp
$Comp
L CP C5
U 1 1 5B657D26
P 8450 3850
F 0 "C5" H 8475 3950 50  0000 L CNN
F 1 "CP" H 8475 3750 50  0000 L CNN
F 2 "Capacitors_SMD:C_1206_HandSoldering" H 8488 3700 50  0001 C CNN
F 3 "" H 8450 3850 50  0001 C CNN
	1    8450 3850
	1    0    0    -1  
$EndComp
Wire Wire Line
	8450 4150 8450 4000
Connection ~ 7000 4150
Connection ~ 7750 4150
Wire Wire Line
	8050 3500 8700 3500
Connection ~ 7000 3500
Connection ~ 8450 4150
Connection ~ 6250 3200
Wire Wire Line
	6400 5550 6400 5700
Wire Wire Line
	7750 3800 7750 4250
$Comp
L GNDA #PWR021
U 1 1 5B66BAA1
P 7750 4250
F 0 "#PWR021" H 7750 4000 50  0001 C CNN
F 1 "GNDA" H 7750 4100 50  0000 C CNN
F 2 "" H 7750 4250 50  0001 C CNN
F 3 "" H 7750 4250 50  0001 C CNN
	1    7750 4250
	1    0    0    -1  
$EndComp
$Comp
L +3.3VP #PWR022
U 1 1 5B66CEC0
P 5550 5900
F 0 "#PWR022" H 5700 5850 50  0001 C CNN
F 1 "+3.3VP" H 5550 6000 50  0000 C CNN
F 2 "" H 5550 5900 50  0001 C CNN
F 3 "" H 5550 5900 50  0001 C CNN
	1    5550 5900
	1    0    0    -1  
$EndComp
$Comp
L PWR_FLAG #FLG023
U 1 1 5B66D033
P 5950 5800
F 0 "#FLG023" H 5950 5875 50  0001 C CNN
F 1 "PWR_FLAG" H 5950 5950 50  0000 C CNN
F 2 "" H 5950 5800 50  0001 C CNN
F 3 "" H 5950 5800 50  0001 C CNN
	1    5950 5800
	1    0    0    -1  
$EndComp
Wire Wire Line
	5950 5900 5550 5900
Wire Wire Line
	5950 5800 5950 5900
$Comp
L +3.3VP #PWR024
U 1 1 5B66D145
P 7000 3250
F 0 "#PWR024" H 7150 3200 50  0001 C CNN
F 1 "+3.3VP" H 7000 3350 50  0000 C CNN
F 2 "" H 7000 3250 50  0001 C CNN
F 3 "" H 7000 3250 50  0001 C CNN
	1    7000 3250
	1    0    0    -1  
$EndComp
Wire Wire Line
	7000 3250 7000 3500
$Comp
L PWR_FLAG #FLG025
U 1 1 5B677E5D
P 5950 5550
F 0 "#FLG025" H 5950 5625 50  0001 C CNN
F 1 "PWR_FLAG" H 5950 5700 50  0000 C CNN
F 2 "" H 5950 5550 50  0001 C CNN
F 3 "" H 5950 5550 50  0001 C CNN
	1    5950 5550
	1    0    0    -1  
$EndComp
Wire Wire Line
	5550 5550 5550 5600
Wire Wire Line
	5550 5600 5950 5600
Wire Wire Line
	5950 5600 5950 5550
Wire Wire Line
	8450 3700 8450 3500
Connection ~ 8450 3500
Wire Wire Line
	5000 4050 5000 4150
Connection ~ 5000 4150
$Comp
L C C2
U 1 1 5B65FC15
P 5500 3400
F 0 "C2" H 5525 3500 50  0000 L CNN
F 1 "C" H 5525 3300 50  0000 L CNN
F 2 "Capacitors_SMD:C_1206_HandSoldering" H 5538 3250 50  0001 C CNN
F 3 "" H 5500 3400 50  0001 C CNN
	1    5500 3400
	1    0    0    -1  
$EndComp
$Comp
L R R10
U 1 1 5B676010
P 4600 3850
F 0 "R10" V 4680 3850 50  0000 C CNN
F 1 "R" V 4600 3850 50  0000 C CNN
F 2 "Resistors_THT:R_Axial_DIN0204_L3.6mm_D1.6mm_P7.62mm_Horizontal" V 4530 3850 50  0001 C CNN
F 3 "" H 4600 3850 50  0001 C CNN
	1    4600 3850
	1    0    0    -1  
$EndComp
Wire Wire Line
	4600 3700 4600 3650
Connection ~ 4600 3650
Wire Wire Line
	4600 4000 4700 4000
Wire Wire Line
	4700 4000 4700 3850
$Comp
L CP C8
U 1 1 5B69EE29
P 3900 3900
F 0 "C8" H 3925 4000 50  0000 L CNN
F 1 "CP" H 3925 3800 50  0000 L CNN
F 2 "Capacitors_SMD:C_1206_HandSoldering" H 3938 3750 50  0001 C CNN
F 3 "" H 3900 3900 50  0001 C CNN
	1    3900 3900
	1    0    0    -1  
$EndComp
Wire Wire Line
	3900 3750 3900 3650
Connection ~ 3900 3650
Wire Wire Line
	3900 4050 3900 4150
Connection ~ 3900 4150
$EndSCHEMATC
