EESchema Schematic File Version 4
EELAYER 30 0
EELAYER END
$Descr A4 11693 8268
encoding utf-8
Sheet 1 5
Title ""
Date ""
Rev ""
Comp ""
Comment1 ""
Comment2 ""
Comment3 ""
Comment4 ""
$EndDescr
Text Notes 6800 2450 0    60   ~ 0
I2C
Text Notes 6800 2200 0    60   ~ 0
SPI\n
$Comp
L power:PWR_FLAG #FLG02
U 1 1 5B5B4E8C
P 1950 1800
F 0 "#FLG02" H 1950 1875 50  0001 C CNN
F 1 "PWR_FLAG" H 1950 1950 50  0000 C CNN
F 2 "" H 1950 1800 50  0001 C CNN
F 3 "" H 1950 1800 50  0001 C CNN
	1    1950 1800
	1    0    0    -1  
$EndComp
$Comp
L power:+5C #PWR01
U 1 1 5B5B4E8D
P 1400 1850
F 0 "#PWR01" H 1400 1700 50  0001 C CNN
F 1 "+5C" H 1400 1990 50  0000 C CNN
F 2 "" H 1400 1850 50  0001 C CNN
F 3 "" H 1400 1850 50  0001 C CNN
	1    1400 1850
	1    0    0    -1  
$EndComp
$Comp
L power:GND #PWR03
U 1 1 5B5B4E8E
P 1950 1950
F 0 "#PWR03" H 1950 1700 50  0001 C CNN
F 1 "GND" H 1950 1800 50  0000 C CNN
F 2 "" H 1950 1950 50  0001 C CNN
F 3 "" H 1950 1950 50  0001 C CNN
	1    1950 1950
	1    0    0    -1  
$EndComp
$Comp
L power:PWR_FLAG #FLG01
U 1 1 5B5B4E8F
P 1200 1850
F 0 "#FLG01" H 1200 1925 50  0001 C CNN
F 1 "PWR_FLAG" H 1200 2000 50  0000 C CNN
F 2 "" H 1200 1850 50  0001 C CNN
F 3 "" H 1200 1850 50  0001 C CNN
	1    1200 1850
	1    0    0    -1  
$EndComp
Wire Notes Line
	6200 2650 6600 2650
Wire Notes Line
	6600 2000 6200 2000
Wire Wire Line
	1400 1850 1400 1950
Wire Wire Line
	1400 1950 1200 1950
Wire Wire Line
	1200 1950 1200 1850
Wire Wire Line
	1950 1800 1950 1950
$Comp
L power:Earth_Protective #PWR04
U 1 1 5B5B4E92
P 2450 1850
F 0 "#PWR04" H 2700 1600 50  0001 C CNN
F 1 "Earth_Protective" H 2900 1700 50  0001 C CNN
F 2 "" H 2450 1750 50  0001 C CNN
F 3 "" H 2450 1750 50  0001 C CNN
	1    2450 1850
	1    0    0    -1  
$EndComp
$Comp
L power:PWR_FLAG #FLG03
U 1 1 5B5B4E93
P 2450 1800
F 0 "#FLG03" H 2450 1875 50  0001 C CNN
F 1 "PWR_FLAG" H 2450 1950 50  0000 C CNN
F 2 "" H 2450 1800 50  0001 C CNN
F 3 "" H 2450 1800 50  0001 C CNN
	1    2450 1800
	1    0    0    -1  
$EndComp
Wire Wire Line
	2450 1800 2450 1850
$Comp
L power:GND #PWR02
U 1 1 5B5B4E95
P 2650 6350
F 0 "#PWR02" H 2650 6100 50  0001 C CNN
F 1 "GND" H 2650 6200 50  0000 C CNN
F 2 "" H 2650 6350 50  0001 C CNN
F 3 "" H 2650 6350 50  0001 C CNN
	1    2650 6350
	1    0    0    -1  
$EndComp
Wire Wire Line
	4300 6250 3850 6250
$Sheet
S 2850 6100 1000 800 
U 5B5B4E91
F0 "Fuente" 60
F1 "Fuente.sch" 60
F2 "3.3V" O R 3850 6250 60 
F3 "0v" I R 3850 6350 60 
F4 "0Vbat" O L 2850 6350 60 
F5 "Vccbat" I L 2850 6250 60 
F6 "1.8V" O R 3850 6450 50 
$EndSheet
Text Notes 8700 2900 0    60   ~ 0
SPI\n
Wire Notes Line
	8250 3150 8650 3150
Wire Notes Line
	8650 2600 8650 3150
Wire Notes Line
	8250 2600 8250 3150
Text Notes 8700 3550 0    60   ~ 0
UART
Text Notes 7150 3800 0    60   ~ 0
UART 1\n
Wire Notes Line
	8250 3250 8250 3750
Wire Notes Line
	8250 3750 8650 3750
Wire Notes Line
	8650 3250 8250 3250
Wire Notes Line
	7250 3250 7250 3700
Wire Notes Line
	7250 3700 7600 3700
Wire Notes Line
	7600 3700 7600 3250
Wire Notes Line
	7600 3250 7250 3250
Wire Wire Line
	2550 6250 2850 6250
Text GLabel 4300 6250 2    59   Input ~ 0
Vdd
Text GLabel 4300 6450 2    59   Input ~ 0
Vdd_L
Text GLabel 4300 6350 2    59   Input ~ 0
Vss
Wire Wire Line
	3850 6350 4300 6350
Wire Wire Line
	3850 6450 4300 6450
Text GLabel 3500 2050 0    59   Input ~ 0
Vdd
Text GLabel 8150 2050 0    59   Input ~ 0
Vdd
Text GLabel 7650 2050 2    59   Input ~ 0
Vdd
Text GLabel 8150 2200 0    59   Input ~ 0
Vss
Text GLabel 7650 2200 2    59   Input ~ 0
Vss
Wire Wire Line
	7650 2050 7550 2050
Wire Wire Line
	7650 2200 7550 2200
Wire Wire Line
	8150 2050 8300 2050
Wire Wire Line
	8300 2200 8150 2200
Text GLabel 8150 2600 0    59   Input ~ 0
Sck
Text GLabel 8150 2750 0    59   Input ~ 0
MiSo
Text GLabel 8150 2900 0    59   Input ~ 0
MoSi
Text GLabel 8150 3050 0    59   Input ~ 0
CsRm
Wire Wire Line
	8150 2600 8300 2600
Wire Wire Line
	8300 2750 8150 2750
Wire Wire Line
	8150 2900 8300 2900
Wire Wire Line
	8300 3050 8150 3050
Text GLabel 6100 2100 0    59   Input ~ 0
Sck
Text GLabel 6100 2200 0    59   Input ~ 0
MiSo
Wire Wire Line
	6100 2100 6250 2100
Wire Wire Line
	6250 2200 6100 2200
Text GLabel 5050 3000 2    59   Input ~ 0
Sck
Text GLabel 5050 3150 2    59   Input ~ 0
MiSo
Text GLabel 5050 3300 2    59   Input ~ 0
MoSi
Wire Wire Line
	5050 3300 5000 3300
Wire Wire Line
	6100 2500 6250 2500
Text GLabel 5050 4050 2    59   Input ~ 0
CsLR
Wire Wire Line
	8150 3500 8300 3500
Wire Wire Line
	8300 3350 8150 3350
Text GLabel 7700 3350 2    59   Input ~ 0
A
Text GLabel 7700 3500 2    59   Input ~ 0
B
Wire Wire Line
	7700 3500 7550 3500
Wire Wire Line
	7700 3350 7550 3350
Text GLabel 5050 4350 2    59   Input ~ 0
RstLR
Text GLabel 3500 2150 0    59   Input ~ 0
Vss
Wire Wire Line
	5050 4350 5000 4350
Wire Wire Line
	3500 2050 3600 2050
Text GLabel 3500 2450 0    59   Input ~ 0
VCC
Text GLabel 3500 2550 0    59   Input ~ 0
GND
Text GLabel 3500 2350 0    59   Input ~ 0
VBAT
Wire Wire Line
	3500 2350 3600 2350
Wire Wire Line
	3600 2450 3500 2450
Wire Wire Line
	3600 2550 3500 2550
Text GLabel 3500 2700 0    59   Input ~ 0
RST
Wire Wire Line
	3500 2700 3600 2700
Text GLabel 2550 6250 0    59   Input ~ 0
VBAT
Text GLabel 2550 6350 0    59   Input ~ 0
GND
Text GLabel 3500 2850 0    59   Input ~ 0
VREF
Text GLabel 3500 2950 0    59   Input ~ 0
A2
Text GLabel 3500 3050 0    59   Input ~ 0
B2
Text GLabel 3500 3150 0    59   Input ~ 0
DIO12
Text GLabel 3500 3250 0    59   Input ~ 0
DIO11
Text GLabel 3500 3350 0    59   Input ~ 0
DIO10
Text GLabel 3500 3950 0    59   Input ~ 0
DIO4
Text GLabel 3500 4150 0    59   Input ~ 0
DIO2
Text GLabel 3500 4250 0    59   Input ~ 0
DIO1
Text GLabel 3500 4350 0    59   Input ~ 0
DIO0
Wire Wire Line
	3500 2850 3600 2850
Wire Wire Line
	3600 2950 3500 2950
Wire Wire Line
	3500 3050 3600 3050
Wire Wire Line
	3600 3150 3500 3150
Wire Wire Line
	3500 3250 3600 3250
Wire Wire Line
	3600 3350 3500 3350
Wire Wire Line
	3600 4350 3500 4350
Wire Wire Line
	3500 4250 3600 4250
Wire Wire Line
	3600 4150 3500 4150
Wire Wire Line
	3600 3950 3500 3950
Wire Wire Line
	2550 6350 2650 6350
Connection ~ 2650 6350
Wire Wire Line
	2650 6350 2850 6350
$Sheet
S 3600 1950 1400 2500
U 5B5B4E89
F0 "Puertos_IO" 60
F1 "Puertos_IO.sch" 60
F2 "SDI" I R 5000 3300 60 
F3 "CS" I R 5000 4050 60 
F4 "VCCD" I L 3600 2050 60 
F5 "INT" O R 5000 4200 60 
F6 "SDO" O R 5000 3150 60 
F7 "SCK" I R 5000 3000 60 
F8 "Reset" I R 5000 4350 60 
F9 "GNDD" I L 3600 2150 60 
F10 "VBAT" O L 3600 2350 63 
F11 "GND" I L 3600 2550 63 
F12 "VCC" I L 3600 2450 63 
F13 "DIO13-DOUT" I L 3600 2950 63 
F14 "DIO14-DIN" I L 3600 3050 63 
F15 "DIO12-SPI_MISO" I L 3600 3150 63 
F16 "nRESET" I L 3600 2700 63 
F17 "DIO10-RSSI" I L 3600 3350 63 
F18 "DIO11-I2C-SDA" I L 3600 3250 63 
F19 "DIO4-SPI_MOSI" I L 3600 3950 63 
F20 "DIO2-AD2-SPI_CLK" I L 3600 4150 63 
F21 "DIO1-AD1-I2C_SCL" I L 3600 4250 63 
F22 "DIO0-AD0" I L 3600 4350 63 
F23 "VREF" I L 3600 2850 59 
$EndSheet
Text GLabel 6100 4600 0    59   Input ~ 0
VBAT
Wire Wire Line
	3500 2150 3600 2150
$Sheet
S 8300 1950 1300 2750
U 61365D92
F0 "bootdriver" 50
F1 "bootdriver.sch" 50
F2 "VCCD" I L 8300 2050 60 
F3 "GNDD" O L 8300 2200 60 
F4 "MISO" O L 8300 2750 60 
F5 "MOSI" I L 8300 2900 60 
F6 "TX" O L 8300 3350 60 
F7 "RX" I L 8300 3500 60 
F8 "SCK" I L 8300 2600 60 
F9 "nCS_SRAM" I L 8300 3050 60 
$EndSheet
Text GLabel 5050 4200 2    59   Input ~ 0
INT_LR
Wire Wire Line
	5050 4050 5000 4050
Wire Wire Line
	5050 4200 5000 4200
Text GLabel 6100 4700 0    59   Input ~ 0
RST
Wire Wire Line
	5050 3000 5000 3000
Wire Wire Line
	5050 3150 5000 3150
Text GLabel 6100 4350 0    59   Input ~ 0
A2
Text GLabel 6100 4250 0    59   Input ~ 0
B2
Text GLabel 6100 2950 0    59   Input ~ 0
DIO2
Wire Wire Line
	6250 2950 6100 2950
Text GLabel 6100 4500 0    59   Input ~ 0
VREF
Text GLabel 6100 3850 0    59   Input ~ 0
DIO11
Text GLabel 6100 3750 0    59   Input ~ 0
DIO10
Wire Wire Line
	6100 3850 6250 3850
Wire Wire Line
	6100 4700 6250 4700
Wire Wire Line
	6250 4500 6100 4500
Wire Wire Line
	6250 4600 6100 4600
Wire Wire Line
	6250 4250 6100 4250
Wire Wire Line
	6100 4350 6250 4350
Wire Wire Line
	6100 3750 6250 3750
Text GLabel 6100 3050 0    59   Input ~ 0
DIO4
Text GLabel 6100 2850 0    59   Input ~ 0
DIO1
Text GLabel 6100 2750 0    59   Input ~ 0
DIO0
Text GLabel 6100 2400 0    59   Input ~ 0
CsRm
Text GLabel 6100 2500 0    59   Input ~ 0
CsLR
Text GLabel 6100 2300 0    59   Input ~ 0
MoSi
Wire Wire Line
	6250 2300 6100 2300
Wire Wire Line
	6250 2400 6100 2400
Wire Wire Line
	6100 2850 6250 2850
Wire Wire Line
	6100 2750 6250 2750
Text GLabel 6100 3950 0    59   Input ~ 0
DIO12
Wire Wire Line
	6100 3950 6250 3950
Wire Wire Line
	6100 3050 6250 3050
Text GLabel 6100 3200 0    59   Input ~ 0
INT_LR
Text GLabel 6100 3300 0    59   Input ~ 0
RstLR
Wire Wire Line
	6100 3200 6250 3200
Wire Wire Line
	6250 3300 6100 3300
$Sheet
S 6250 1950 1300 2800
U 5B5B4E88
F0 "CPU PIC16F19156" 60
F1 "CPU PIC16F19156.sch" 60
F2 "VCCD" I R 7550 2050 60 
F3 "GNDD" O R 7550 2200 60 
F4 "Vbat" I L 6250 4600 63 
F5 "VPP" I L 6250 4700 63 
F6 "RC4-ANC4" B L 6250 2850 63 
F7 "RB2-ANB2" I L 6250 2200 59 
F8 "RB1-ANB1" O L 6250 2300 59 
F9 "RA7-ANA7" B L 6250 3300 63 
F10 "RC7-ANC7" I R 7550 3350 59 
F11 "RC3-ANC3" B L 6250 2950 63 
F12 "RB0-ANB0" O L 6250 3950 59 
F13 "RA6-ANA6" B L 6250 3200 63 
F14 "RB3-ANB3" O L 6250 2100 59 
F15 "RB4-ANB4" I L 6250 3750 63 
F16 "RA2-DAC1" I L 6250 2750 63 
F17 "Vref+" I L 6250 4500 63 
F18 "RB7-ANB7-DAC2-RX2-ISPDT" I L 6250 4250 59 
F19 "RB6-ANB6-TX2-ISPCLK" I L 6250 4350 63 
F20 "RC2-ANC2" B L 6250 3050 63 
F21 "RC6-ANC6" O R 7550 3500 59 
F22 "RB5-ANB5" I L 6250 3850 63 
F23 "RA0-ANA0" I L 6250 2500 50 
F24 "RA1-ANA1" I L 6250 2400 50 
$EndSheet
Text GLabel 8150 3500 0    59   Input ~ 0
A
Text GLabel 8150 3350 0    59   Input ~ 0
B
$EndSCHEMATC
