EESchema Schematic File Version 4
EELAYER 30 0
EELAYER END
$Descr A4 11693 8268
encoding utf-8
Sheet 4 9
Title ""
Date ""
Rev ""
Comp ""
Comment1 ""
Comment2 ""
Comment3 ""
Comment4 ""
$EndDescr
$Comp
L gateway-rescue:Barrel_Jack J?
U 1 1 5B4D0237
P 6400 2000
F 0 "J?" H 6400 2210 50  0000 C CNN
F 1 "Barrel_Jack" H 6400 1825 50  0000 C CNN
F 2 "" H 6450 1960 50  0001 C CNN
F 3 "" H 6450 1960 50  0001 C CNN
	1    6400 2000
	1    0    0    -1  
$EndComp
$Comp
L power1:GND #PWR?
U 1 1 5B4D0247
P 6750 1150
F 0 "#PWR?" H 6750 900 50  0001 C CNN
F 1 "GND" H 6750 1000 50  0000 C CNN
F 2 "" H 6750 1150 50  0001 C CNN
F 3 "" H 6750 1150 50  0001 C CNN
	1    6750 1150
	1    0    0    -1  
$EndComp
$Comp
L power1:GNDD #PWR?
U 1 1 5B4D025C
P 7700 1650
F 0 "#PWR?" H 7700 1400 50  0001 C CNN
F 1 "GNDD" H 7700 1525 50  0000 C CNN
F 2 "" H 7700 1650 50  0001 C CNN
F 3 "" H 7700 1650 50  0001 C CNN
	1    7700 1650
	1    0    0    -1  
$EndComp
$Comp
L gateway-rescue:Transformer_1P_1S T?
U 1 1 5B4D025D
P 1450 1650
F 0 "T?" H 1450 1900 50  0000 C CNN
F 1 "Transformer_1P_1S" H 1450 1350 50  0000 C CNN
F 2 "" H 1450 1650 50  0001 C CNN
F 3 "" H 1450 1650 50  0001 C CNN
	1    1450 1650
	1    0    0    -1  
$EndComp
$Comp
L gateway-rescue:CP C?
U 1 1 5B4D025E
P 2450 1650
F 0 "C?" H 2475 1750 50  0000 L CNN
F 1 "CP" H 2475 1550 50  0000 L CNN
F 2 "" H 2488 1500 50  0001 C CNN
F 3 "" H 2450 1650 50  0001 C CNN
	1    2450 1650
	1    0    0    -1  
$EndComp
$Comp
L power1:GND #PWR?
U 1 1 5B4D025F
P 2450 1850
F 0 "#PWR?" H 2450 1600 50  0001 C CNN
F 1 "GND" H 2450 1700 50  0000 C CNN
F 2 "" H 2450 1850 50  0001 C CNN
F 3 "" H 2450 1850 50  0001 C CNN
	1    2450 1850
	1    0    0    -1  
$EndComp
$Comp
L gateway-rescue:LM78L05_TO92 U?
U 1 1 5B4D0260
P 2900 1450
F 0 "U?" H 2750 1575 50  0000 C CNN
F 1 "LM78L05_TO92" H 2900 1575 50  0000 L CNN
F 2 "TO_SOT_Packages_THT:TO-92_Inline_Narrow_Oval" H 2900 1675 50  0001 C CIN
F 3 "" H 2900 1400 50  0001 C CNN
	1    2900 1450
	1    0    0    -1  
$EndComp
$Comp
L gateway-rescue:1N4001 D?
U 1 1 5B4D026A
P 2050 1450
F 0 "D?" H 2050 1550 50  0000 C CNN
F 1 "1N4001" H 2050 1350 50  0000 C CNN
F 2 "Diodes_THT:D_DO-41_SOD81_Horizontal_RM10" H 2050 1275 50  0001 C CNN
F 3 "" H 2050 1450 50  0001 C CNN
	1    2050 1450
	-1   0    0    1   
$EndComp
$Comp
L power1:GND #PWR?
U 1 1 5B4D026B
P 2900 1850
F 0 "#PWR?" H 2900 1600 50  0001 C CNN
F 1 "GND" H 2900 1700 50  0000 C CNN
F 2 "" H 2900 1850 50  0001 C CNN
F 3 "" H 2900 1850 50  0001 C CNN
	1    2900 1850
	1    0    0    -1  
$EndComp
$Comp
L power1:GND #PWR?
U 1 1 5B4D026C
P 1950 1850
F 0 "#PWR?" H 1950 1600 50  0001 C CNN
F 1 "GND" H 1950 1700 50  0000 C CNN
F 2 "" H 1950 1850 50  0001 C CNN
F 3 "" H 1950 1850 50  0001 C CNN
	1    1950 1850
	1    0    0    -1  
$EndComp
$Comp
L power1:GNDD #PWR?
U 1 1 5B4D026D
P 1000 2850
F 0 "#PWR?" H 1000 2600 50  0001 C CNN
F 1 "GNDD" H 1000 2725 50  0000 C CNN
F 2 "" H 1000 2850 50  0001 C CNN
F 3 "" H 1000 2850 50  0001 C CNN
	1    1000 2850
	1    0    0    -1  
$EndComp
$Comp
L gateway-rescue:Transformer_1P_1S T?
U 1 1 5B4D026E
P 1450 2650
F 0 "T?" H 1450 2900 50  0000 C CNN
F 1 "Transformer_1P_1S" H 1450 2350 50  0000 C CNN
F 2 "" H 1450 2650 50  0001 C CNN
F 3 "" H 1450 2650 50  0001 C CNN
	1    1450 2650
	1    0    0    -1  
$EndComp
$Comp
L gateway-rescue:CP C?
U 1 1 5B4D026F
P 2450 2650
F 0 "C?" H 2475 2750 50  0000 L CNN
F 1 "CP" H 2475 2550 50  0000 L CNN
F 2 "" H 2488 2500 50  0001 C CNN
F 3 "" H 2450 2650 50  0001 C CNN
	1    2450 2650
	1    0    0    -1  
$EndComp
$Comp
L gateway-rescue:LM78L05_TO92 U?
U 1 1 5B4D0270
P 2900 2450
F 0 "U?" H 2750 2575 50  0000 C CNN
F 1 "LM78L05_TO92" H 2900 2575 50  0000 L CNN
F 2 "TO_SOT_Packages_THT:TO-92_Inline_Narrow_Oval" H 2900 2675 50  0001 C CIN
F 3 "" H 2900 2400 50  0001 C CNN
	1    2900 2450
	1    0    0    -1  
$EndComp
$Comp
L gateway-rescue:1N4001 D?
U 1 1 5B4D0271
P 2050 2450
F 0 "D?" H 2050 2550 50  0000 C CNN
F 1 "1N4001" H 2050 2350 50  0000 C CNN
F 2 "Diodes_THT:D_DO-41_SOD81_Horizontal_RM10" H 2050 2275 50  0001 C CNN
F 3 "" H 2050 2450 50  0001 C CNN
	1    2050 2450
	-1   0    0    1   
$EndComp
$Comp
L gateway-rescue:GNDPWR #PWR?
U 1 1 5B4D0272
P 1950 2850
F 0 "#PWR?" H 1950 2650 50  0001 C CNN
F 1 "GNDPWR" H 1950 2720 50  0000 C CNN
F 2 "" H 1950 2800 50  0001 C CNN
F 3 "" H 1950 2800 50  0001 C CNN
	1    1950 2850
	1    0    0    -1  
$EndComp
$Comp
L gateway-rescue:GNDPWR #PWR?
U 1 1 5B4D0273
P 2450 2850
F 0 "#PWR?" H 2450 2650 50  0001 C CNN
F 1 "GNDPWR" H 2450 2720 50  0000 C CNN
F 2 "" H 2450 2800 50  0001 C CNN
F 3 "" H 2450 2800 50  0001 C CNN
	1    2450 2850
	1    0    0    -1  
$EndComp
$Comp
L gateway-rescue:GNDPWR #PWR?
U 1 1 5B4D0274
P 2900 2850
F 0 "#PWR?" H 2900 2650 50  0001 C CNN
F 1 "GNDPWR" H 2900 2720 50  0000 C CNN
F 2 "" H 2900 2800 50  0001 C CNN
F 3 "" H 2900 2800 50  0001 C CNN
	1    2900 2850
	1    0    0    -1  
$EndComp
$Comp
L power1:+5C #PWR?
U 1 1 5B4D0275
P 3550 1450
F 0 "#PWR?" H 3550 1300 50  0001 C CNN
F 1 "+5C" H 3550 1590 50  0000 C CNN
F 2 "" H 3550 1450 50  0001 C CNN
F 3 "" H 3550 1450 50  0001 C CNN
	1    3550 1450
	1    0    0    -1  
$EndComp
$Comp
L power1:+5F #PWR?
U 1 1 5B4D0276
P 3550 2400
F 0 "#PWR?" H 3550 2250 50  0001 C CNN
F 1 "+5F" H 3550 2540 50  0000 C CNN
F 2 "" H 3550 2400 50  0001 C CNN
F 3 "" H 3550 2400 50  0001 C CNN
	1    3550 2400
	1    0    0    -1  
$EndComp
Wire Wire Line
	2450 1500 2450 1450
Connection ~ 2450 1450
Wire Wire Line
	2200 1450 2600 1450
Wire Wire Line
	2900 1750 2900 1850
Wire Wire Line
	1050 1850 1000 1850
Wire Wire Line
	1850 1450 1900 1450
Wire Wire Line
	2050 1450 2050 1450
Wire Wire Line
	2450 1800 2450 1850
Wire Wire Line
	1850 1850 1950 1850
Wire Wire Line
	2450 2500 2450 2450
Connection ~ 2450 2450
Wire Wire Line
	2200 2450 2600 2450
Wire Wire Line
	2900 2750 2900 2850
Wire Wire Line
	1050 2850 1000 2850
Wire Wire Line
	1850 2450 1900 2450
Wire Wire Line
	2050 2450 2050 2450
Wire Wire Line
	2450 2800 2450 2850
Wire Wire Line
	1850 2850 1950 2850
Wire Wire Line
	1000 2450 1050 2450
Wire Wire Line
	3200 2450 3550 2450
Wire Wire Line
	3550 2450 3550 2400
Wire Wire Line
	3200 1450 3550 1450
$EndSCHEMATC
