EESchema Schematic File Version 4
EELAYER 30 0
EELAYER END
$Descr A4 11693 8268
encoding utf-8
Sheet 6 9
Title ""
Date ""
Rev ""
Comp ""
Comment1 ""
Comment2 ""
Comment3 ""
Comment4 ""
$EndDescr
$Comp
L gateway-rescue:MAX485E U?
U 1 1 5B52C847
P 5100 3550
F 0 "U?" H 4860 4000 50  0000 C CNN
F 1 "MAX485E" H 5130 4000 50  0000 L CNN
F 2 "" H 5100 2850 50  0001 C CNN
F 3 "" H 5100 3600 50  0001 C CNN
	1    5100 3550
	1    0    0    -1  
$EndComp
$Comp
L gateway-rescue:Polyfuse_Small F?
U 1 1 5B52C848
P 6350 3350
F 0 "F?" V 6275 3350 50  0000 C CNN
F 1 "Polyfuse_Small" V 6450 3350 50  0000 C CNN
F 2 "" H 6400 3150 50  0001 L CNN
F 3 "" H 6350 3350 50  0001 C CNN
	1    6350 3350
	0    -1   -1   0   
$EndComp
$Comp
L gateway-rescue:Polyfuse_Small F?
U 1 1 5B52C849
P 6350 3950
F 0 "F?" V 6275 3950 50  0000 C CNN
F 1 "Polyfuse_Small" V 6450 3950 50  0000 C CNN
F 2 "" H 6400 3750 50  0001 L CNN
F 3 "" H 6350 3950 50  0001 C CNN
	1    6350 3950
	0    -1   -1   0   
$EndComp
$Comp
L power1:GND #PWR?
U 1 1 5B52C84A
P 4450 3400
F 0 "#PWR?" H 4450 3150 50  0001 C CNN
F 1 "GND" H 4450 3250 50  0000 C CNN
F 2 "" H 4450 3400 50  0001 C CNN
F 3 "" H 4450 3400 50  0001 C CNN
	1    4450 3400
	1    0    0    -1  
$EndComp
$Comp
L gateway-rescue:D_TVS D?
U 1 1 5B52C84B
P 6150 3600
F 0 "D?" H 6150 3700 50  0000 C CNN
F 1 "D_TVS" H 6150 3500 50  0000 C CNN
F 2 "" H 6150 3600 50  0001 C CNN
F 3 "" H 6150 3600 50  0001 C CNN
	1    6150 3600
	0    1    1    0   
$EndComp
$Comp
L gateway-rescue:D_TVS D?
U 1 1 5B52C84C
P 6150 3150
F 0 "D?" H 6150 3250 50  0000 C CNN
F 1 "D_TVS" H 6150 3050 50  0000 C CNN
F 2 "" H 6150 3150 50  0001 C CNN
F 3 "" H 6150 3150 50  0001 C CNN
	1    6150 3150
	0    1    1    0   
$EndComp
$Comp
L gateway-rescue:D_TVS D?
U 1 1 5B52C84D
P 6150 4150
F 0 "D?" H 6150 4250 50  0000 C CNN
F 1 "D_TVS" H 6150 4050 50  0000 C CNN
F 2 "" H 6150 4150 50  0001 C CNN
F 3 "" H 6150 4150 50  0001 C CNN
	1    6150 4150
	0    1    1    0   
$EndComp
$Comp
L gateway-rescue:Varistor RV?
U 1 1 5B52C84E
P 7250 3500
F 0 "RV?" V 7375 3500 50  0000 C CNN
F 1 "Varistor" V 7125 3500 50  0000 C CNN
F 2 "" V 7180 3500 50  0001 C CNN
F 3 "" H 7250 3500 50  0001 C CNN
	1    7250 3500
	1    0    0    -1  
$EndComp
$Comp
L gateway-rescue:Varistor RV?
U 1 1 5B52C84F
P 7550 3500
F 0 "RV?" V 7675 3500 50  0000 C CNN
F 1 "Varistor" V 7425 3500 50  0000 C CNN
F 2 "" V 7480 3500 50  0001 C CNN
F 3 "" H 7550 3500 50  0001 C CNN
	1    7550 3500
	1    0    0    -1  
$EndComp
$Comp
L gateway-rescue:Varistor RV?
U 1 1 5B52C850
P 6950 3500
F 0 "RV?" V 7075 3500 50  0000 C CNN
F 1 "Varistor" V 6825 3500 50  0000 C CNN
F 2 "" V 6880 3500 50  0001 C CNN
F 3 "" H 6950 3500 50  0001 C CNN
	1    6950 3500
	1    0    0    -1  
$EndComp
$Comp
L gateway-rescue:Varistor RV?
U 1 1 5B52C851
P 6650 3500
F 0 "RV?" V 6775 3500 50  0000 C CNN
F 1 "Varistor" V 6525 3500 50  0000 C CNN
F 2 "" V 6580 3500 50  0001 C CNN
F 3 "" H 6650 3500 50  0001 C CNN
	1    6650 3500
	1    0    0    -1  
$EndComp
$Comp
L power1:GND #PWR?
U 1 1 5B52C852
P 7050 3700
F 0 "#PWR?" H 7050 3450 50  0001 C CNN
F 1 "GND" H 7050 3550 50  0000 C CNN
F 2 "" H 7050 3700 50  0001 C CNN
F 3 "" H 7050 3700 50  0001 C CNN
	1    7050 3700
	1    0    0    -1  
$EndComp
$Comp
L gateway-rescue:R R?
U 1 1 5B52C853
P 5650 3450
F 0 "R?" V 5730 3450 50  0000 C CNN
F 1 "R" V 5650 3450 50  0000 C CNN
F 2 "" V 5580 3450 50  0001 C CNN
F 3 "" H 5650 3450 50  0001 C CNN
	1    5650 3450
	0    1    1    0   
$EndComp
$Comp
L gateway-rescue:R R?
U 1 1 5B52C854
P 5650 3750
F 0 "R?" V 5730 3750 50  0000 C CNN
F 1 "R" V 5650 3750 50  0000 C CNN
F 2 "" V 5580 3750 50  0001 C CNN
F 3 "" H 5650 3750 50  0001 C CNN
	1    5650 3750
	0    1    1    0   
$EndComp
$Comp
L gateway-rescue:R R?
U 1 1 5B52C855
P 5900 3200
F 0 "R?" V 5980 3200 50  0000 C CNN
F 1 "R" V 5900 3200 50  0000 C CNN
F 2 "" V 5830 3200 50  0001 C CNN
F 3 "" H 5900 3200 50  0001 C CNN
	1    5900 3200
	-1   0    0    1   
$EndComp
$Comp
L gateway-rescue:R R?
U 1 1 5B52C856
P 5900 3200
F 0 "R?" V 5980 3200 50  0000 C CNN
F 1 "R" V 5900 3200 50  0000 C CNN
F 2 "" V 5830 3200 50  0001 C CNN
F 3 "" H 5900 3200 50  0001 C CNN
	1    5900 3200
	-1   0    0    1   
$EndComp
$Comp
L gateway-rescue:R R?
U 1 1 5B52C857
P 5900 3600
F 0 "R?" V 5980 3600 50  0000 C CNN
F 1 "R" V 5900 3600 50  0000 C CNN
F 2 "" V 5830 3600 50  0001 C CNN
F 3 "" H 5900 3600 50  0001 C CNN
	1    5900 3600
	-1   0    0    1   
$EndComp
$Comp
L gateway-rescue:R R?
U 1 1 5B52C858
P 5900 4150
F 0 "R?" V 5980 4150 50  0000 C CNN
F 1 "R" V 5900 4150 50  0000 C CNN
F 2 "" V 5830 4150 50  0001 C CNN
F 3 "" H 5900 4150 50  0001 C CNN
	1    5900 4150
	-1   0    0    1   
$EndComp
$Comp
L gateway-rescue:Varistor RV?
U 1 1 5B52C859
P 7250 4100
F 0 "RV?" V 7375 4100 50  0000 C CNN
F 1 "Varistor" V 7125 4100 50  0000 C CNN
F 2 "" V 7180 4100 50  0001 C CNN
F 3 "" H 7250 4100 50  0001 C CNN
	1    7250 4100
	1    0    0    -1  
$EndComp
$Comp
L gateway-rescue:Varistor RV?
U 1 1 5B52C85A
P 7550 4100
F 0 "RV?" V 7675 4100 50  0000 C CNN
F 1 "Varistor" V 7425 4100 50  0000 C CNN
F 2 "" V 7480 4100 50  0001 C CNN
F 3 "" H 7550 4100 50  0001 C CNN
	1    7550 4100
	1    0    0    -1  
$EndComp
$Comp
L gateway-rescue:Varistor RV?
U 1 1 5B52C85B
P 6950 4100
F 0 "RV?" V 7075 4100 50  0000 C CNN
F 1 "Varistor" V 6825 4100 50  0000 C CNN
F 2 "" V 6880 4100 50  0001 C CNN
F 3 "" H 6950 4100 50  0001 C CNN
	1    6950 4100
	1    0    0    -1  
$EndComp
$Comp
L gateway-rescue:Varistor RV?
U 1 1 5B52C85C
P 6650 4100
F 0 "RV?" V 6775 4100 50  0000 C CNN
F 1 "Varistor" V 6525 4100 50  0000 C CNN
F 2 "" V 6580 4100 50  0001 C CNN
F 3 "" H 6650 4100 50  0001 C CNN
	1    6650 4100
	1    0    0    -1  
$EndComp
$Comp
L gateway-rescue:ISO7341C U?
U 1 1 5B52C85D
P 3900 3600
F 0 "U?" H 3900 4225 50  0000 C CNN
F 1 "ISO7341C" H 3900 4150 50  0000 C CNN
F 2 "Housings_SOIC:SOIC-16W_7.5x10.3mm_Pitch1.27mm" H 3900 3050 50  0001 C CIN
F 3 "" H 3900 4000 50  0001 C CNN
	1    3900 3600
	1    0    0    -1  
$EndComp
$Comp
L power1:+5C #PWR?
U 1 1 5B52C85F
P 5100 3000
F 0 "#PWR?" H 5100 2850 50  0001 C CNN
F 1 "+5C" H 5100 3140 50  0000 C CNN
F 2 "" H 5100 3000 50  0001 C CNN
F 3 "" H 5100 3000 50  0001 C CNN
	1    5100 3000
	1    0    0    -1  
$EndComp
Wire Wire Line
	6450 3350 7650 3350
Connection ~ 7250 3350
Connection ~ 6950 3350
Connection ~ 6650 3350
Wire Wire Line
	5900 3350 6250 3350
Wire Wire Line
	6150 3300 6150 3450
Connection ~ 6150 3350
Wire Wire Line
	6650 3650 7550 3650
Connection ~ 7250 3650
Connection ~ 6950 3650
Wire Wire Line
	7050 3700 7050 3650
Connection ~ 7050 3650
Wire Wire Line
	6450 3950 7650 3950
Connection ~ 7250 3950
Connection ~ 6950 3950
Connection ~ 6650 3950
Wire Wire Line
	5900 3450 5900 3350
Wire Wire Line
	5900 3750 5900 4000
Wire Wire Line
	5800 3750 5900 3750
Wire Wire Line
	5800 3450 5900 3450
Wire Wire Line
	6150 3750 6150 4000
Wire Wire Line
	5900 3950 6250 3950
Connection ~ 6150 3950
Connection ~ 5900 3950
Wire Wire Line
	6650 4300 6650 4250
Connection ~ 6150 4300
Wire Wire Line
	7550 4300 7550 4250
Connection ~ 6650 4300
Wire Wire Line
	7250 4300 7250 4250
Connection ~ 7250 4300
Wire Wire Line
	6950 4300 6950 4250
Connection ~ 6950 4300
Connection ~ 5900 4300
Wire Wire Line
	4350 3000 7700 3000
Wire Wire Line
	7650 3350 7650 3500
Wire Wire Line
	7650 3500 7850 3500
Connection ~ 7550 3350
Wire Wire Line
	7650 3950 7650 3600
Wire Wire Line
	7650 3600 7850 3600
Connection ~ 7550 3950
Wire Wire Line
	4300 3300 4300 3400
Wire Wire Line
	3500 3300 3500 3400
Wire Wire Line
	4450 3300 4450 3400
Wire Wire Line
	7700 4300 7700 3700
Wire Wire Line
	7700 3700 7850 3700
Connection ~ 7550 4300
Wire Wire Line
	7700 3000 7700 3400
Wire Wire Line
	7700 3400 7850 3400
Connection ~ 6150 3000
Wire Wire Line
	5500 3450 5500 3450
Wire Wire Line
	5500 3750 5500 3750
Wire Wire Line
	5100 4300 7700 4300
Wire Wire Line
	3350 3300 3500 3300
Wire Wire Line
	3250 3200 3500 3200
Wire Wire Line
	3450 3100 3450 3500
Wire Wire Line
	3450 3500 3500 3500
Wire Wire Line
	4350 3200 4300 3200
Wire Wire Line
	4350 3000 4350 3500
Wire Wire Line
	4350 3500 4300 3500
Wire Wire Line
	4450 3300 4300 3300
Wire Wire Line
	4300 3700 4600 3700
Wire Wire Line
	4600 3700 4600 3550
Wire Wire Line
	4600 3550 4700 3550
Wire Wire Line
	4700 3650 4650 3650
Wire Wire Line
	4650 3650 4650 3800
Wire Wire Line
	4650 3800 4300 3800
Wire Wire Line
	4300 3900 4700 3900
Wire Wire Line
	4700 3450 4550 3450
Wire Wire Line
	4550 3450 4550 4000
Wire Wire Line
	4550 4000 4300 4000
Connection ~ 4350 3200
Wire Wire Line
	5900 3050 5900 3000
Connection ~ 5900 3000
Wire Wire Line
	5100 3050 5100 3000
Wire Wire Line
	2600 3900 3500 3900
$Comp
L power1:+5V #PWR?
U 1 1 5B52C860
P 3450 3100
F 0 "#PWR?" H 3450 2950 50  0001 C CNN
F 1 "+5V" H 3450 3240 50  0000 C CNN
F 2 "" H 3450 3100 50  0001 C CNN
F 3 "" H 3450 3100 50  0001 C CNN
	1    3450 3100
	1    0    0    -1  
$EndComp
Connection ~ 3450 3200
Wire Wire Line
	2600 4000 3500 4000
Wire Wire Line
	4700 3900 4700 3750
Wire Wire Line
	5100 4150 5100 4300
$Comp
L gateway-rescue:Conn_01x06_Male J?
U 1 1 5B52C861
P 2400 3700
F 0 "J?" H 2400 4000 50  0000 C CNN
F 1 "Conn_01x06_Male" H 2400 3300 50  0000 C CNN
F 2 "" H 2400 3700 50  0001 C CNN
F 3 "" H 2400 3700 50  0001 C CNN
	1    2400 3700
	1    0    0    -1  
$EndComp
$Comp
L gateway-rescue:Conn_01x04_Male J?
U 1 1 5B52C862
P 8050 3500
F 0 "J?" H 8050 3700 50  0000 C CNN
F 1 "Conn_01x04_Male" H 8050 3200 50  0000 C CNN
F 2 "" H 8050 3500 50  0001 C CNN
F 3 "" H 8050 3500 50  0001 C CNN
	1    8050 3500
	-1   0    0    -1  
$EndComp
Wire Wire Line
	3500 3800 2600 3800
Wire Wire Line
	3500 3700 2600 3700
Wire Wire Line
	3250 3200 3250 3500
Wire Wire Line
	3250 3500 2600 3500
Wire Wire Line
	2600 3600 3350 3600
Wire Wire Line
	3350 3600 3350 3300
$Comp
L power1:GND #PWR?
U 1 1 5B52C863
P 6450 4400
F 0 "#PWR?" H 6450 4150 50  0001 C CNN
F 1 "GND" H 6450 4250 50  0000 C CNN
F 2 "" H 6450 4400 50  0001 C CNN
F 3 "" H 6450 4400 50  0001 C CNN
	1    6450 4400
	1    0    0    -1  
$EndComp
Wire Wire Line
	6450 4400 6450 4300
Connection ~ 6450 4300
Connection ~ 5100 3000
$EndSCHEMATC
