EESchema Schematic File Version 4
EELAYER 30 0
EELAYER END
$Descr A4 11693 8268
encoding utf-8
Sheet 1 4
Title ""
Date ""
Rev ""
Comp ""
Comment1 ""
Comment2 ""
Comment3 ""
Comment4 ""
$EndDescr
$Sheet
S 6950 1950 1300 2800
U 5B56656E
F0 "CPU PIC18F26K20" 60
F1 "PIC18F26K20.sch" 60
F2 "VCCP" I L 6950 2100 60 
F3 "VCCD" I R 8250 2000 60 
F4 "VPP" I L 6950 2000 60 
F5 "PGC" I L 6950 2300 60 
F6 "PGD" I L 6950 2200 60 
F7 "GNDD" O R 8250 2100 60 
F8 "SCK" O L 6950 3100 60 
F9 "SDI" I L 6950 3200 60 
F10 "SDO" O L 6950 3300 60 
F11 "CS" O L 6950 3400 60 
F12 "SDA-i2c" I L 6950 3700 60 
F13 "SDO-i2c" I L 6950 3800 60 
F14 "AN0" I R 8250 3350 60 
F15 "AN1" I R 8250 3450 60 
F16 "AN3" I R 8250 3700 60 
F17 "AN4" I R 8250 3800 60 
F18 "AN5" I R 8250 3900 60 
F19 "INT0" I L 6950 4150 60 
F20 "INT3/2" I L 6950 4050 60 
F21 "INT1" I L 6950 4250 60 
F22 "AN9" I R 8250 4250 60 
F23 "AN6" I R 8250 4350 60 
F24 "AN7" I R 8250 4450 60 
F25 "RO1" I L 6950 2850 60 
F26 "DI1" O L 6950 2550 60 
F27 "!RE1" O L 6950 2650 60 
F28 "DE1" O L 6950 2750 60 
F29 "Wake" O L 6950 4350 60 
F30 "!Reset" O L 6950 4450 60 
$EndSheet
$Sheet
S 5450 1950 850  2800
U 5B56656F
F0 "Puertos_IO" 60
F1 "Puertos_IO.sch" 60
F2 "SDI" I R 6300 3300 60 
F3 "CS" I R 6300 3400 60 
F4 "VCCD" I L 5450 2000 60 
F5 "INT" O R 6300 4150 60 
F6 "SDO" O R 6300 3200 60 
F7 "SCK" I R 6300 3100 60 
F8 "Reset" I R 6300 4450 60 
F9 "GNDD" I L 5450 2100 60 
F10 "VCC1" O L 5450 2700 60 
F11 "RS485-B1" B L 5450 2500 60 
F12 "RS485-A1" B L 5450 2400 60 
F13 "VPP" O R 6300 2000 60 
F14 "VCCP" O R 6300 2100 60 
F15 "PGD" B R 6300 2200 60 
F16 "PGC" O R 6300 2300 60 
F17 "!RE1" I R 6300 2650 60 
F18 "DE1" I R 6300 2750 60 
F19 "DI1" I R 6300 2550 60 
F20 "RO1" O R 6300 2850 60 
F21 "GND1" I L 5450 2600 60 
F22 "Wake" I R 6300 4350 60 
F23 "GNDP" O L 5450 2800 60 
$EndSheet
$Comp
L PAN-CO-rescue:RJ12 J1
U 1 1 5B566570
P 3700 2500
F 0 "J1" H 3900 3000 50  0000 C CNN
F 1 "RJ12" H 3550 3000 50  0000 C CNN
F 2 "Connectors:RJ12_E" H 3700 2500 50  0001 C CNN
F 3 "" H 3700 2500 50  0001 C CNN
	1    3700 2500
	0    -1   -1   0   
$EndComp
Text Notes 7350 2200 0    60   ~ 0
ICSP\n
Text Notes 7450 3750 0    60   ~ 0
I2C
Text Notes 7400 3200 0    60   ~ 0
SPI\n
Text Notes 7350 2750 0    60   ~ 0
USART
$Comp
L PAN-CO-rescue:Earth_Protective #PWR01
U 1 1 5B566572
P 4400 3350
F 0 "#PWR01" H 4650 3100 50  0001 C CNN
F 1 "Earth_Protective" H 4850 3200 50  0001 C CNN
F 2 "" H 4400 3250 50  0001 C CNN
F 3 "" H 4400 3250 50  0001 C CNN
	1    4400 3350
	1    0    0    -1  
$EndComp
NoConn ~ 3300 2000
NoConn ~ 3400 2000
$Comp
L PAN-CO-rescue:PWR_FLAG #FLG02
U 1 1 5B566573
P 2050 3200
F 0 "#FLG02" H 2050 3275 50  0001 C CNN
F 1 "PWR_FLAG" H 2050 3350 50  0000 C CNN
F 2 "" H 2050 3200 50  0001 C CNN
F 3 "" H 2050 3200 50  0001 C CNN
	1    2050 3200
	1    0    0    -1  
$EndComp
$Comp
L PAN-CO-rescue:+5C #PWR03
U 1 1 5B566577
P 1500 3250
F 0 "#PWR03" H 1500 3100 50  0001 C CNN
F 1 "+5C" H 1500 3390 50  0000 C CNN
F 2 "" H 1500 3250 50  0001 C CNN
F 3 "" H 1500 3250 50  0001 C CNN
	1    1500 3250
	1    0    0    -1  
$EndComp
$Comp
L PAN-CO-rescue:GND #PWR04
U 1 1 5B566579
P 2050 3350
F 0 "#PWR04" H 2050 3100 50  0001 C CNN
F 1 "GND" H 2050 3200 50  0000 C CNN
F 2 "" H 2050 3350 50  0001 C CNN
F 3 "" H 2050 3350 50  0001 C CNN
	1    2050 3350
	1    0    0    -1  
$EndComp
$Comp
L PAN-CO-rescue:PWR_FLAG #FLG05
U 1 1 5B56657B
P 1300 3250
F 0 "#FLG05" H 1300 3325 50  0001 C CNN
F 1 "PWR_FLAG" H 1300 3400 50  0000 C CNN
F 2 "" H 1300 3250 50  0001 C CNN
F 3 "" H 1300 3250 50  0001 C CNN
	1    1300 3250
	1    0    0    -1  
$EndComp
$Comp
L PAN-CO-rescue:+5C #PWR06
U 1 1 5B56657E
P 3600 3250
F 0 "#PWR06" H 3600 3100 50  0001 C CNN
F 1 "+5C" H 3600 3390 50  0000 C CNN
F 2 "" H 3600 3250 50  0001 C CNN
F 3 "" H 3600 3250 50  0001 C CNN
	1    3600 3250
	1    0    0    -1  
$EndComp
Wire Wire Line
	5150 2700 5450 2700
Wire Wire Line
	4150 2500 5450 2500
Wire Wire Line
	4150 2400 5450 2400
Wire Notes Line
	6850 2500 7300 2500
Wire Notes Line
	7300 1850 7300 2950
Wire Notes Line
	7300 1850 6850 1850
Wire Notes Line
	6850 1850 6850 2950
Wire Notes Line
	6850 3650 6850 3900
Wire Notes Line
	6850 3900 7350 3900
Wire Notes Line
	7350 3650 6850 3650
Wire Notes Line
	6850 3000 6850 3500
Wire Notes Line
	6850 3500 7350 3500
Wire Notes Line
	7350 3500 7350 3000
Wire Notes Line
	7350 3000 6850 3000
Wire Notes Line
	6850 2950 7300 2950
Wire Notes Line
	7350 3900 7350 3650
Wire Wire Line
	6950 2550 6300 2550
Wire Wire Line
	6950 2650 6300 2650
Wire Wire Line
	6950 2750 6300 2750
Wire Wire Line
	6300 2850 6950 2850
Wire Wire Line
	6300 2000 6950 2000
Wire Wire Line
	6300 2100 6950 2100
Wire Wire Line
	6300 2200 6950 2200
Wire Wire Line
	6300 2300 6950 2300
Wire Wire Line
	6300 3100 6950 3100
Wire Wire Line
	6950 3400 6300 3400
Wire Wire Line
	8250 2000 8400 2000
Wire Wire Line
	8400 2000 8400 1650
Wire Wire Line
	1500 3250 1500 3350
Wire Wire Line
	1500 3350 1300 3350
Wire Wire Line
	1300 3350 1300 3250
Wire Wire Line
	2050 3200 2050 3350
Wire Wire Line
	4400 2600 4400 2800
Wire Wire Line
	4150 2600 4400 2600
Wire Wire Line
	8400 1650 5000 1650
Wire Wire Line
	4900 1700 8350 1700
Wire Wire Line
	8350 1700 8350 2100
Wire Wire Line
	8350 2100 8250 2100
Wire Wire Line
	6300 4150 6950 4150
Wire Wire Line
	6950 3200 6300 3200
Wire Wire Line
	6950 3300 6300 3300
Wire Wire Line
	6950 4350 6300 4350
Wire Wire Line
	6950 4450 6300 4450
$Sheet
S 3550 4450 1000 800 
U 5B5921E5
F0 "Fuente" 60
F1 "Fuente.sch" 60
F2 "VCC1" O R 4550 4600 60 
F3 "GND1" I R 4550 4700 60 
F4 "6Vcc" I L 3550 4600 60 
F5 "0Vcc" O L 3550 4900 60 
F6 "GP" I L 3550 5100 60 
F7 "VDD" O R 4550 4850 60 
F8 "GND" I R 4550 4950 60 
$EndSheet
$Comp
L PAN-CO-rescue:Earth_Protective #PWR07
U 1 1 5B5A4781
P 2600 3300
F 0 "#PWR07" H 2850 3050 50  0001 C CNN
F 1 "Earth_Protective" H 3050 3150 50  0001 C CNN
F 2 "" H 2600 3200 50  0001 C CNN
F 3 "" H 2600 3200 50  0001 C CNN
	1    2600 3300
	1    0    0    -1  
$EndComp
$Comp
L PAN-CO-rescue:PWR_FLAG #FLG08
U 1 1 5B5A48EC
P 2600 3250
F 0 "#FLG08" H 2600 3325 50  0001 C CNN
F 1 "PWR_FLAG" H 2600 3400 50  0000 C CNN
F 2 "" H 2600 3250 50  0001 C CNN
F 3 "" H 2600 3250 50  0001 C CNN
	1    2600 3250
	1    0    0    -1  
$EndComp
Wire Wire Line
	2600 3250 2600 3300
$Comp
L PAN-CO-rescue:Earth_Protective #PWR09
U 1 1 5B5A6AB7
P 3100 5100
F 0 "#PWR09" H 3350 4850 50  0001 C CNN
F 1 "Earth_Protective" H 3550 4950 50  0001 C CNN
F 2 "" H 3100 5000 50  0001 C CNN
F 3 "" H 3100 5000 50  0001 C CNN
	1    3100 5100
	1    0    0    -1  
$EndComp
Wire Wire Line
	3100 5100 3550 5100
Wire Wire Line
	4150 2700 4150 3250
Wire Wire Line
	4150 4200 3400 4200
Wire Wire Line
	3400 4200 3400 4600
Wire Wire Line
	3400 4600 3550 4600
Wire Wire Line
	4150 2200 4150 2300
Wire Wire Line
	3550 4900 3300 4900
Wire Wire Line
	3300 4900 3300 4100
Wire Wire Line
	3300 4100 4250 4100
Wire Wire Line
	4250 4100 4250 3550
Wire Wire Line
	4250 2300 4150 2300
Wire Wire Line
	3600 3250 4150 3250
Connection ~ 4150 3250
$Comp
L PAN-CO-rescue:GND #PWR010
U 1 1 5B5A8C25
P 3600 3600
F 0 "#PWR010" H 3600 3350 50  0001 C CNN
F 1 "GND" H 3600 3450 50  0000 C CNN
F 2 "" H 3600 3600 50  0001 C CNN
F 3 "" H 3600 3600 50  0001 C CNN
	1    3600 3600
	1    0    0    -1  
$EndComp
Wire Wire Line
	3600 3600 3600 3550
Wire Wire Line
	3600 3550 4250 3550
Connection ~ 4250 3550
Wire Wire Line
	5450 2800 4400 2800
Connection ~ 4400 2800
Wire Wire Line
	5000 4600 4550 4600
Wire Wire Line
	5000 1650 5000 2000
Wire Wire Line
	4900 4700 4550 4700
Wire Wire Line
	4900 1700 4900 2100
Wire Wire Line
	4900 2100 5450 2100
Connection ~ 4900 2100
Wire Wire Line
	5000 2000 5450 2000
Connection ~ 5000 2000
Wire Wire Line
	4550 4850 5150 4850
Wire Wire Line
	5150 4850 5150 2700
Wire Wire Line
	4550 4950 5250 4950
Wire Wire Line
	5250 4950 5250 2600
Wire Wire Line
	5250 2600 5450 2600
Wire Wire Line
	4150 3250 4150 4200
Wire Wire Line
	4250 3550 4250 2300
Wire Wire Line
	4400 2800 4400 3350
Wire Wire Line
	4900 2100 4900 4700
Wire Wire Line
	5000 2000 5000 4600
$EndSCHEMATC
