EESchema Schematic File Version 4
EELAYER 30 0
EELAYER END
$Descr A4 11693 8268
encoding utf-8
Sheet 1 2
Title ""
Date ""
Rev ""
Comp ""
Comment1 ""
Comment2 ""
Comment3 ""
Comment4 ""
$EndDescr
$Sheet
S 5350 3550 500  750 
U 5B4FD204
F0 "Com_Rs_485_1" 60
F1 "file5B4FD204.sch" 60
F2 "VD" I L 5350 3650 60 
F3 "GndD" O L 5350 3750 60 
F4 "!re" I L 5350 4050 60 
F5 "de" I L 5350 4150 60 
F6 "di" I L 5350 3950 60 
F7 "ro" O L 5350 4250 60 
F8 "Va" O R 5850 3700 60 
F9 "Ga" I R 5850 4000 60 
F10 "B" B R 5850 3800 60 
F11 "A" B R 5850 3900 60 
$EndSheet
$Comp
L power1:PWR_FLAG #FLG01
U 1 1 5B4FD20C
P 3350 3300
F 0 "#FLG01" H 3350 3375 50  0001 C CNN
F 1 "PWR_FLAG" H 3350 3450 50  0000 C CNN
F 2 "" H 3350 3300 50  0001 C CNN
F 3 "" H 3350 3300 50  0001 C CNN
	1    3350 3300
	1    0    0    -1  
$EndComp
$Comp
L power1:PWR_FLAG #FLG02
U 1 1 5B4FD20D
P 7550 3250
F 0 "#FLG02" H 7550 3325 50  0001 C CNN
F 1 "PWR_FLAG" H 7550 3400 50  0000 C CNN
F 2 "" H 7550 3250 50  0001 C CNN
F 3 "" H 7550 3250 50  0001 C CNN
	1    7550 3250
	1    0    0    -1  
$EndComp
$Comp
L power1:PWR_FLAG #FLG03
U 1 1 5B4FD20E
P 7550 3750
F 0 "#FLG03" H 7550 3825 50  0001 C CNN
F 1 "PWR_FLAG" H 7550 3900 50  0000 C CNN
F 2 "" H 7550 3750 50  0001 C CNN
F 3 "" H 7550 3750 50  0001 C CNN
	1    7550 3750
	1    0    0    -1  
$EndComp
Wire Wire Line
	7550 3250 7550 3300
$Comp
L board-rs484-rescue:Conn_01x05_Male J2
U 1 1 5B4FF060
P 6950 3900
F 0 "J2" H 6950 4100 50  0000 C CNN
F 1 "Conn_01x05_Male" H 6950 3600 50  0000 C CNN
F 2 "Pin_Headers:Pin_Header_Angled_1x05_Pitch2.54mm" H 6950 3900 50  0001 C CNN
F 3 "" H 6950 3900 50  0001 C CNN
	1    6950 3900
	-1   0    0    -1  
$EndComp
Wire Wire Line
	4450 3650 4700 3650
Wire Wire Line
	4450 3750 5350 3750
Wire Wire Line
	4450 3850 5050 3850
Wire Wire Line
	5050 3850 5050 3950
Wire Wire Line
	5050 3950 5350 3950
Wire Wire Line
	4450 4050 5350 4050
Wire Wire Line
	4850 3950 4850 4150
Wire Wire Line
	4850 4150 5350 4150
Wire Wire Line
	5350 4250 4700 4250
Wire Wire Line
	4700 4250 4700 4150
Wire Wire Line
	4700 4150 4450 4150
$Comp
L power1:PWR_FLAG #FLG04
U 1 1 5B4FF9AD
P 3350 3750
F 0 "#FLG04" H 3350 3825 50  0001 C CNN
F 1 "PWR_FLAG" H 3350 3900 50  0000 C CNN
F 2 "" H 3350 3750 50  0001 C CNN
F 3 "" H 3350 3750 50  0001 C CNN
	1    3350 3750
	1    0    0    -1  
$EndComp
$Comp
L power1:VBUS #PWR05
U 1 1 5B4FFB3A
P 7250 3250
F 0 "#PWR05" H 7250 3100 50  0001 C CNN
F 1 "VBUS" H 7250 3400 50  0000 C CNN
F 2 "" H 7250 3250 50  0001 C CNN
F 3 "" H 7250 3250 50  0001 C CNN
	1    7250 3250
	1    0    0    -1  
$EndComp
$Comp
L power1:VCC #PWR06
U 1 1 5B5000DE
P 4700 3300
F 0 "#PWR06" H 4700 3150 50  0001 C CNN
F 1 "VCC" H 4700 3450 50  0000 C CNN
F 2 "" H 4700 3300 50  0001 C CNN
F 3 "" H 4700 3300 50  0001 C CNN
	1    4700 3300
	1    0    0    -1  
$EndComp
$Comp
L power1:GNDD #PWR07
U 1 1 5B501748
P 3700 3800
F 0 "#PWR07" H 3700 3550 50  0001 C CNN
F 1 "GNDD" H 3700 3675 50  0000 C CNN
F 2 "" H 3700 3800 50  0001 C CNN
F 3 "" H 3700 3800 50  0001 C CNN
	1    3700 3800
	1    0    0    -1  
$EndComp
$Comp
L power1:GND #PWR08
U 1 1 5B501AD1
P 7550 3850
F 0 "#PWR08" H 7550 3600 50  0001 C CNN
F 1 "GND" H 7550 3700 50  0000 C CNN
F 2 "" H 7550 3850 50  0001 C CNN
F 3 "" H 7550 3850 50  0001 C CNN
	1    7550 3850
	1    0    0    -1  
$EndComp
$Comp
L power1:VBUS #PWR09
U 1 1 5B501B45
P 6500 3450
F 0 "#PWR09" H 6500 3300 50  0001 C CNN
F 1 "VBUS" H 6500 3600 50  0000 C CNN
F 2 "" H 6500 3450 50  0001 C CNN
F 3 "" H 6500 3450 50  0001 C CNN
	1    6500 3450
	1    0    0    -1  
$EndComp
$Comp
L power1:GND #PWR010
U 1 1 5B501B92
P 6500 4100
F 0 "#PWR010" H 6500 3850 50  0001 C CNN
F 1 "GND" H 6500 3950 50  0000 C CNN
F 2 "" H 6500 4100 50  0001 C CNN
F 3 "" H 6500 4100 50  0001 C CNN
	1    6500 4100
	1    0    0    -1  
$EndComp
$Comp
L power1:VCC #PWR011
U 1 1 5B501BDF
P 3600 3300
F 0 "#PWR011" H 3600 3150 50  0001 C CNN
F 1 "VCC" H 3600 3450 50  0000 C CNN
F 2 "" H 3600 3300 50  0001 C CNN
F 3 "" H 3600 3300 50  0001 C CNN
	1    3600 3300
	1    0    0    -1  
$EndComp
$Comp
L power1:GNDD #PWR012
U 1 1 5B501C2C
P 3350 3800
F 0 "#PWR012" H 3350 3550 50  0001 C CNN
F 1 "GNDD" H 3350 3675 50  0000 C CNN
F 2 "" H 3350 3800 50  0001 C CNN
F 3 "" H 3350 3800 50  0001 C CNN
	1    3350 3800
	1    0    0    -1  
$EndComp
Wire Wire Line
	3350 3300 3600 3300
Wire Wire Line
	3350 3750 3350 3800
Wire Wire Line
	4700 3300 4700 3650
Connection ~ 4700 3650
Wire Wire Line
	6500 3450 6500 3700
Connection ~ 6500 3700
Wire Wire Line
	6500 4100 6500 4000
Connection ~ 6500 4000
Wire Wire Line
	7550 3300 7250 3300
Wire Wire Line
	7250 3300 7250 3250
Wire Wire Line
	7550 3750 7550 3850
$Comp
L board-rs484-rescue:Conn_01x06_Male J1
U 1 1 5B4FE88B
P 4250 3850
F 0 "J1" H 4250 4150 50  0000 C CNN
F 1 "Conn_01x06_Male" H 4250 3450 50  0000 C CNN
F 2 "Pin_Headers:Pin_Header_Angled_1x06_Pitch2.54mm" H 4250 3850 50  0001 C CNN
F 3 "" H 4250 3850 50  0001 C CNN
	1    4250 3850
	1    0    0    -1  
$EndComp
$Comp
L power1:PWR_FLAG #FLG013
U 1 1 5B50257B
P 8150 3750
F 0 "#FLG013" H 8150 3825 50  0001 C CNN
F 1 "PWR_FLAG" H 8150 3900 50  0000 C CNN
F 2 "" H 8150 3750 50  0001 C CNN
F 3 "" H 8150 3750 50  0001 C CNN
	1    8150 3750
	1    0    0    -1  
$EndComp
$Comp
L power1:Earth_Protective #PWR014
U 1 1 5B5025C8
P 8150 3800
F 0 "#PWR014" H 8400 3550 50  0001 C CNN
F 1 "Earth_Protective" H 8600 3650 50  0001 C CNN
F 2 "" H 8150 3700 50  0001 C CNN
F 3 "" H 8150 3700 50  0001 C CNN
	1    8150 3800
	1    0    0    -1  
$EndComp
Wire Wire Line
	8150 3750 8150 3800
$Comp
L power1:Earth_Protective #PWR015
U 1 1 5B5028DC
P 6800 3150
F 0 "#PWR015" H 7050 2900 50  0001 C CNN
F 1 "Earth_Protective" H 7250 3000 50  0001 C CNN
F 2 "" H 6800 3050 50  0001 C CNN
F 3 "" H 6800 3050 50  0001 C CNN
	1    6800 3150
	1    0    0    -1  
$EndComp
Wire Wire Line
	6750 3900 6200 3900
Wire Wire Line
	6200 3900 6200 3800
Wire Wire Line
	6200 3800 5850 3800
Wire Wire Line
	5850 3900 6050 3900
Wire Wire Line
	6050 3900 6050 3850
Wire Wire Line
	6050 3850 6350 3850
Wire Wire Line
	6350 3850 6350 3800
Wire Wire Line
	6350 3800 6750 3800
Wire Wire Line
	5850 4000 6500 4000
Wire Wire Line
	5850 3700 6500 3700
Wire Wire Line
	6800 3150 6800 3600
Wire Wire Line
	6800 3600 6750 3600
Wire Wire Line
	6750 3600 6750 3700
Wire Wire Line
	6700 3700 6700 4100
Wire Wire Line
	6700 4100 6750 4100
Wire Wire Line
	4850 3950 4450 3950
Wire Wire Line
	3700 3800 4450 3800
Wire Wire Line
	4450 3800 4450 3750
Wire Wire Line
	4700 3650 5350 3650
Wire Wire Line
	6500 3700 6700 3700
Wire Wire Line
	6500 4000 6750 4000
$EndSCHEMATC
