EESchema Schematic File Version 2
LIBS:power
LIBS:device
LIBS:switches
LIBS:relays
LIBS:motors
LIBS:transistors
LIBS:conn
LIBS:linear
LIBS:regul
LIBS:74xx
LIBS:cmos4000
LIBS:adc-dac
LIBS:memory
LIBS:xilinx
LIBS:microcontrollers
LIBS:dsp
LIBS:microchip
LIBS:analog_switches
LIBS:motorola
LIBS:texas
LIBS:intel
LIBS:audio
LIBS:interface
LIBS:digital-audio
LIBS:philips
LIBS:display
LIBS:cypress
LIBS:siliconi
LIBS:opto
LIBS:atmel
LIBS:contrib
LIBS:valves
LIBS:Fuente-cache
EELAYER 25 0
EELAYER END
$Descr A4 11693 8268
encoding utf-8
Sheet 3 3
Title ""
Date ""
Rev ""
Comp ""
Comment1 ""
Comment2 ""
Comment3 ""
Comment4 ""
$EndDescr
$Comp
L CP C?
U 1 1 5B53A0BC
P 5650 3800
F 0 "C?" H 5675 3900 50  0000 L CNN
F 1 "CP" H 5675 3700 50  0000 L CNN
F 2 "Capacitors_THT:CP_Radial_D8.0mm_P3.50mm" H 5688 3650 50  0001 C CNN
F 3 "" H 5650 3800 50  0001 C CNN
	1    5650 3800
	1    0    0    -1  
$EndComp
$Comp
L LM78L05_TO92 U?
U 1 1 5B53A0BD
P 7650 3600
F 0 "U?" H 7500 3725 50  0000 C CNN
F 1 "LM78L05_TO92" H 7650 3725 50  0000 L CNN
F 2 "TO_SOT_Packages_THT:TO-92_Inline_Narrow_Oval" H 7650 3825 50  0001 C CIN
F 3 "" H 7650 3550 50  0001 C CNN
	1    7650 3600
	1    0    0    -1  
$EndComp
Wire Wire Line
	4750 3600 5800 3600
Wire Wire Line
	7650 4000 7650 3900
Wire Wire Line
	2550 4250 3100 4250
Wire Wire Line
	3900 3650 4000 3650
Wire Wire Line
	4700 4000 8850 4000
Wire Wire Line
	3900 3950 4000 3950
Text HLabel 2550 3850 0    60   Input ~ 0
L
Text HLabel 2550 4250 0    60   Input ~ 0
N
Wire Wire Line
	2850 3850 3100 3850
Wire Wire Line
	4000 3650 4000 3550
Wire Wire Line
	4000 3550 4350 3550
Wire Wire Line
	4000 3950 4000 4050
Wire Wire Line
	4000 4050 4350 4050
Connection ~ 5650 4000
$Comp
L CP C?
U 1 1 5B53A0BE
P 5400 3800
F 0 "C?" H 5425 3900 50  0000 L CNN
F 1 "CP" H 5425 3700 50  0000 L CNN
F 2 "Capacitors_THT:CP_Radial_D12.5mm_P5.00mm" H 5438 3650 50  0001 C CNN
F 3 "" H 5400 3800 50  0001 C CNN
	1    5400 3800
	1    0    0    -1  
$EndComp
Wire Wire Line
	5400 3600 5400 3600
Connection ~ 5400 3600
$Comp
L CP C?
U 1 1 5B53A0BF
P 8100 3850
F 0 "C?" H 8125 3950 50  0000 L CNN
F 1 "CP" H 8125 3750 50  0000 L CNN
F 2 "Capacitors_THT:CP_Radial_D12.5mm_P5.00mm" H 8138 3700 50  0001 C CNN
F 3 "" H 8100 3850 50  0001 C CNN
	1    8100 3850
	1    0    0    -1  
$EndComp
$Comp
L CP C?
U 1 1 5B53A0C0
P 8350 3850
F 0 "C?" H 8375 3950 50  0000 L CNN
F 1 "CP" H 8375 3750 50  0000 L CNN
F 2 "Capacitors_THT:CP_Radial_D10.0mm_P2.50mm" H 8388 3700 50  0001 C CNN
F 3 "" H 8350 3850 50  0001 C CNN
	1    8350 3850
	1    0    0    -1  
$EndComp
Wire Wire Line
	7950 3600 8850 3600
Wire Wire Line
	8100 3600 8100 3700
Wire Wire Line
	8350 3600 8350 3700
Connection ~ 8100 3600
Connection ~ 7650 4000
Connection ~ 8100 4000
$Comp
L Fuse_Small F?
U 1 1 5B53A0C1
P 2750 3850
F 0 "F?" H 2750 3790 50  0000 C CNN
F 1 "Fuse_Small" H 2750 3910 50  0000 C CNN
F 2 "Fuse_Holders_and_Fuses:BladeFuse-Mini_Keystone_3568" H 2750 3850 50  0001 C CNN
F 3 "" H 2750 3850 50  0001 C CNN
	1    2750 3850
	1    0    0    -1  
$EndComp
Text HLabel 8850 3600 2    60   Input ~ 0
VCCD
Text HLabel 8850 4000 2    60   Input ~ 0
GNDD
Connection ~ 8350 3600
Connection ~ 8350 4000
Wire Wire Line
	2550 3850 2650 3850
Text HLabel 2550 4750 0    60   Input ~ 0
TIERRA
Wire Wire Line
	3900 4750 3900 4450
NoConn ~ 3900 4150
$Comp
L PWR_FLAG #FLG?
U 1 1 5B53A0C2
P 2500 6550
F 0 "#FLG?" H 2500 6625 50  0001 C CNN
F 1 "PWR_FLAG" H 2500 6700 50  0000 C CNN
F 2 "" H 2500 6550 50  0001 C CNN
F 3 "" H 2500 6550 50  0001 C CNN
	1    2500 6550
	1    0    0    -1  
$EndComp
$Comp
L PWR_FLAG #FLG?
U 1 1 5B53A0C3
P 2900 6550
F 0 "#FLG?" H 2900 6625 50  0001 C CNN
F 1 "PWR_FLAG" H 2900 6700 50  0000 C CNN
F 2 "" H 2900 6550 50  0001 C CNN
F 3 "" H 2900 6550 50  0001 C CNN
	1    2900 6550
	1    0    0    -1  
$EndComp
Wire Wire Line
	2500 6600 2500 6550
Wire Wire Line
	2900 6550 3200 6550
$Comp
L +5VD #PWR?
U 1 1 5B53A0C4
P 3200 6550
F 0 "#PWR?" H 3200 6400 50  0001 C CNN
F 1 "+5VD" H 3200 6690 50  0000 C CNN
F 2 "" H 3200 6550 50  0001 C CNN
F 3 "" H 3200 6550 50  0001 C CNN
	1    3200 6550
	1    0    0    -1  
$EndComp
$Comp
L +5VD #PWR?
U 1 1 5B53A0C5
P 5400 3600
F 0 "#PWR?" H 5400 3450 50  0001 C CNN
F 1 "+5VD" H 5400 3740 50  0000 C CNN
F 2 "" H 5400 3600 50  0001 C CNN
F 3 "" H 5400 3600 50  0001 C CNN
	1    5400 3600
	1    0    0    -1  
$EndComp
Wire Wire Line
	5650 3950 5650 4100
Wire Wire Line
	5400 3950 5400 4000
Connection ~ 5400 4000
Wire Wire Line
	5650 3600 5650 3650
Connection ~ 5650 3600
$Comp
L GNDD #PWR?
U 1 1 5B53A0C6
P 2500 6600
F 0 "#PWR?" H 2500 6350 50  0001 C CNN
F 1 "GNDD" H 2500 6475 50  0000 C CNN
F 2 "" H 2500 6600 50  0001 C CNN
F 3 "" H 2500 6600 50  0001 C CNN
	1    2500 6600
	1    0    0    -1  
$EndComp
Wire Wire Line
	5400 3650 5400 3650
Wire Wire Line
	5400 3650 5400 3600
$Comp
L C_Small C?
U 1 1 5B53A0C7
P 8600 3800
F 0 "C?" H 8610 3870 50  0000 L CNN
F 1 "C_Small" H 8610 3720 50  0000 L CNN
F 2 "Capacitors_THT:C_Disc_D4.3mm_W1.9mm_P5.00mm" H 8600 3800 50  0001 C CNN
F 3 "" H 8600 3800 50  0001 C CNN
	1    8600 3800
	1    0    0    -1  
$EndComp
Wire Wire Line
	8600 3900 8600 4000
Connection ~ 8600 4000
Wire Wire Line
	8600 3700 8600 3600
Connection ~ 8600 3600
$Comp
L C_Small C?
U 1 1 5B53A0C8
P 4950 3800
F 0 "C?" H 4960 3870 50  0000 L CNN
F 1 "C_Small" H 4960 3720 50  0000 L CNN
F 2 "Capacitors_THT:C_Rect_L7.0mm_W4.5mm_P5.00mm" H 4950 3800 50  0001 C CNN
F 3 "" H 4950 3800 50  0001 C CNN
	1    4950 3800
	1    0    0    -1  
$EndComp
Wire Wire Line
	4950 3700 4950 3600
Connection ~ 4950 3600
Wire Wire Line
	4950 3900 4950 4000
Connection ~ 4950 4000
$Comp
L Transformer_1P_2S T?
U 1 1 5B53A0C9
P 3500 4050
F 0 "T?" H 3500 4550 50  0000 C CNN
F 1 "Transformer_1P_2S" H 3500 3550 50  0000 C CNN
F 2 "Transformers_THT:Transformer_Breve_TEZ-22x24" H 3500 4050 50  0001 C CNN
F 3 "" H 3500 4050 50  0001 C CNN
	1    3500 4050
	1    0    0    -1  
$EndComp
Wire Wire Line
	3900 4750 2550 4750
$Comp
L BC517 Q?
U 1 1 5B53A0CA
P 6450 3550
F 0 "Q?" H 6650 3625 50  0000 L CNN
F 1 "BC517" H 6650 3550 50  0000 L CNN
F 2 "TO_SOT_Packages_THT:TO-92_Inline_Wide" H 6650 3475 50  0001 L CIN
F 3 "" H 6450 3550 50  0001 L CNN
	1    6450 3550
	0    -1   -1   0   
$EndComp
$Comp
L D_Zener_Small D?
U 1 1 5B53A0CB
P 6450 3900
F 0 "D?" H 6450 3990 50  0000 C CNN
F 1 "D_Zener_Small" H 6450 3810 50  0000 C CNN
F 2 "Diodes_THT:D_A-405_P7.62mm_Horizontal" V 6450 3900 50  0001 C CNN
F 3 "" V 6450 3900 50  0001 C CNN
	1    6450 3900
	0    1    1    0   
$EndComp
$Comp
L R R?
U 1 1 5B53A0CC
P 6000 3600
F 0 "R?" V 6080 3600 50  0000 C CNN
F 1 "R" V 6000 3600 50  0000 C CNN
F 2 "Resistors_THT:R_Axial_DIN0207_L6.3mm_D2.5mm_P10.16mm_Horizontal" V 5930 3600 50  0001 C CNN
F 3 "" H 6000 3600 50  0001 C CNN
	1    6000 3600
	1    0    0    -1  
$EndComp
Wire Wire Line
	5800 3450 6250 3450
Wire Wire Line
	6000 3750 6450 3750
Wire Wire Line
	6450 3750 6450 3800
Connection ~ 6000 3450
Wire Wire Line
	6650 3450 7200 3450
Connection ~ 6450 4000
$Comp
L CP C?
U 1 1 5B53A0CD
P 6950 3700
F 0 "C?" H 6975 3800 50  0000 L CNN
F 1 "CP" H 6975 3600 50  0000 L CNN
F 2 "Capacitors_THT:CP_Radial_D12.5mm_P5.00mm" H 6988 3550 50  0001 C CNN
F 3 "" H 6950 3700 50  0001 C CNN
	1    6950 3700
	1    0    0    -1  
$EndComp
Wire Wire Line
	6950 3250 6950 3550
Connection ~ 6950 3450
Wire Wire Line
	6950 3850 6950 4000
Connection ~ 6950 4000
Wire Wire Line
	7200 3450 7200 3600
Wire Wire Line
	7200 3600 7350 3600
Wire Wire Line
	5800 3600 5800 3450
$Comp
L GNDD #PWR?
U 1 1 5B53A0CE
P 5650 4100
F 0 "#PWR?" H 5650 3850 50  0001 C CNN
F 1 "GNDD" H 5650 3975 50  0000 C CNN
F 2 "" H 5650 4100 50  0001 C CNN
F 3 "" H 5650 4100 50  0001 C CNN
	1    5650 4100
	1    0    0    -1  
$EndComp
$Comp
L VD #PWR?
U 1 1 5B53A0CF
P 6950 3250
F 0 "#PWR?" H 6950 3100 50  0001 C CNN
F 1 "VD" H 6950 3400 50  0000 C CNN
F 2 "" H 6950 3250 50  0001 C CNN
F 3 "" H 6950 3250 50  0001 C CNN
	1    6950 3250
	1    0    0    -1  
$EndComp
$Comp
L VD #PWR?
U 1 1 5B53A0D0
P 3650 6550
F 0 "#PWR?" H 3650 6400 50  0001 C CNN
F 1 "VD" H 3650 6700 50  0000 C CNN
F 2 "" H 3650 6550 50  0001 C CNN
F 3 "" H 3650 6550 50  0001 C CNN
	1    3650 6550
	1    0    0    -1  
$EndComp
$Comp
L PWR_FLAG #FLG?
U 1 1 5B53A0D1
P 3800 6550
F 0 "#FLG?" H 3800 6625 50  0001 C CNN
F 1 "PWR_FLAG" H 3800 6700 50  0000 C CNN
F 2 "" H 3800 6550 50  0001 C CNN
F 3 "" H 3800 6550 50  0001 C CNN
	1    3800 6550
	1    0    0    -1  
$EndComp
Wire Wire Line
	3800 6550 3650 6550
$Comp
L D D?
U 1 1 5B53A0D2
P 4500 3700
F 0 "D?" H 4500 3800 50  0000 C CNN
F 1 "D" H 4500 3600 50  0000 C CNN
F 2 "Diodes_THT:D_DO-15_P12.70mm_Horizontal" H 4500 3700 50  0001 C CNN
F 3 "" H 4500 3700 50  0001 C CNN
	1    4500 3700
	1    0    0    -1  
$EndComp
$Comp
L D D?
U 1 1 5B53A0D3
P 4500 4050
F 0 "D?" H 4500 4150 50  0000 C CNN
F 1 "D" H 4500 3950 50  0000 C CNN
F 2 "Diodes_THT:D_DO-15_P12.70mm_Horizontal" H 4500 4050 50  0001 C CNN
F 3 "" H 4500 4050 50  0001 C CNN
	1    4500 4050
	1    0    0    -1  
$EndComp
$Comp
L D D?
U 1 1 5B53A0D4
P 4500 3900
F 0 "D?" H 4500 4000 50  0000 C CNN
F 1 "D" H 4500 3800 50  0000 C CNN
F 2 "Diodes_THT:D_DO-15_P12.70mm_Horizontal" H 4500 3900 50  0001 C CNN
F 3 "" H 4500 3900 50  0001 C CNN
	1    4500 3900
	-1   0    0    1   
$EndComp
$Comp
L D D?
U 1 1 5B53A0D5
P 4500 3550
F 0 "D?" H 4500 3650 50  0000 C CNN
F 1 "D" H 4500 3450 50  0000 C CNN
F 2 "Diodes_THT:D_DO-15_P12.70mm_Horizontal" H 4500 3550 50  0001 C CNN
F 3 "" H 4500 3550 50  0001 C CNN
	1    4500 3550
	-1   0    0    1   
$EndComp
Wire Wire Line
	4650 3550 4750 3550
Wire Wire Line
	4750 3550 4750 3900
Wire Wire Line
	4750 3900 4650 3900
Wire Wire Line
	4650 3700 4700 3700
Wire Wire Line
	4700 3700 4700 4050
Wire Wire Line
	4700 4050 4650 4050
Wire Wire Line
	4350 4050 4350 3900
Wire Wire Line
	4350 3550 4350 3700
Connection ~ 4750 3600
Connection ~ 4700 4000
$EndSCHEMATC
