M48
; DRILL file {KiCad 5.1.10-6.fc34} date Sat Sep  4 10:59:40 2021
; FORMAT={-:-/ absolute / metric / decimal}
; #@! TF.CreationDate,2021-09-04T10:59:40-03:00
; #@! TF.GenerationSoftware,Kicad,Pcbnew,5.1.10-6.fc34
; #@! TF.FileFunction,Plated,1,2,PTH
FMAT,2
METRIC
T1C0.650
T2C0.800
T3C1.000
%
G90
G05
T1
X68.717Y-38.921
X68.717Y-75.921
X69.987Y-38.921
X69.987Y-75.921
X71.257Y-38.921
X71.257Y-75.921
X72.527Y-38.921
X72.527Y-75.921
X73.797Y-38.921
X73.797Y-75.921
X112.517Y-38.921
X112.517Y-75.921
X113.787Y-38.921
X113.787Y-75.921
X115.057Y-38.921
X115.057Y-75.921
X116.327Y-38.921
X116.327Y-75.921
X117.597Y-38.921
X117.597Y-75.921
T2
X56.017Y-47.303
X56.017Y-84.303
X62.338Y-46.942
X62.338Y-83.942
X63.338Y-42.192
X64.938Y-78.942
X75.188Y-52.142
X75.188Y-89.142
X75.263Y-32.867
X75.263Y-69.867
X75.613Y-47.392
X75.613Y-84.392
X76.713Y-46.717
X76.713Y-83.717
X77.938Y-23.742
X77.938Y-60.742
X78.938Y-50.692
X78.938Y-87.692
X80.213Y-43.242
X80.213Y-80.242
X80.738Y-32.792
X80.738Y-69.792
X82.507Y-28.804
X82.507Y-65.804
X83.777Y-28.804
X83.777Y-65.804
X84.863Y-41.342
X84.863Y-45.442
X84.863Y-78.342
X84.863Y-82.442
X85.047Y-28.804
X85.047Y-65.804
X87.188Y-52.317
X87.188Y-89.317
X87.238Y-50.067
X87.238Y-87.067
X88.988Y-23.792
X88.988Y-60.792
X89.013Y-45.442
X89.013Y-82.442
X89.038Y-48.992
X89.038Y-53.717
X89.038Y-85.992
X89.038Y-90.717
X89.063Y-32.742
X89.063Y-41.342
X89.063Y-69.742
X89.063Y-78.342
X91.038Y-51.867
X91.038Y-88.867
X91.063Y-48.942
X91.063Y-85.942
X92.813Y-45.492
X92.813Y-52.317
X92.813Y-82.492
X92.813Y-89.317
X92.863Y-50.617
X92.863Y-87.617
X92.888Y-48.617
X92.888Y-85.617
X92.913Y-41.342
X92.913Y-78.342
X99.817Y-47.303
X99.817Y-84.303
X106.138Y-46.942
X106.138Y-83.942
X108.738Y-41.942
X108.738Y-78.942
X118.988Y-52.142
X118.988Y-89.142
X119.063Y-32.867
X119.063Y-69.867
X119.413Y-47.392
X119.413Y-84.392
X120.513Y-46.717
X120.513Y-83.717
X121.738Y-23.742
X121.738Y-60.742
X122.738Y-50.692
X122.738Y-87.692
X124.013Y-43.242
X124.013Y-80.242
X124.538Y-32.792
X124.538Y-69.792
X126.307Y-28.804
X126.307Y-65.804
X127.577Y-28.804
X127.577Y-65.804
X128.663Y-41.342
X128.663Y-45.442
X128.663Y-78.342
X128.663Y-82.442
X128.847Y-28.804
X128.847Y-65.804
X130.988Y-52.317
X130.988Y-89.317
X131.038Y-50.067
X131.038Y-87.067
X132.788Y-23.792
X132.788Y-60.792
X132.813Y-45.442
X132.813Y-82.442
X132.838Y-48.992
X132.838Y-53.717
X132.838Y-85.992
X132.838Y-90.717
X132.863Y-32.742
X132.863Y-41.342
X132.863Y-69.742
X132.863Y-78.342
X134.838Y-51.867
X134.838Y-88.867
X134.863Y-48.942
X134.863Y-85.942
X136.613Y-45.492
X136.613Y-52.317
X136.613Y-82.492
X136.613Y-89.317
X136.663Y-50.617
X136.663Y-87.617
X136.688Y-48.617
X136.688Y-85.617
X136.713Y-41.342
X136.713Y-78.342
T3
X56.017Y-40.953
X56.017Y-77.953
X58.557Y-40.953
X58.557Y-77.953
X99.817Y-40.953
X99.817Y-77.953
X102.357Y-40.953
X102.357Y-77.953
T0
M30
