(kicad_pcb (version 20171130) (host pcbnew 5.1.2-f72e74a~84~ubuntu19.04.1)

  (general
    (thickness 1.6)
    (drawings 10)
    (tracks 138)
    (zones 0)
    (modules 26)
    (nets 21)
  )

  (page A4)
  (layers
    (0 F.Cu signal)
    (31 B.Cu signal)
    (32 B.Adhes user)
    (33 F.Adhes user)
    (34 B.Paste user)
    (35 F.Paste user)
    (36 B.SilkS user)
    (37 F.SilkS user)
    (38 B.Mask user)
    (39 F.Mask user)
    (40 Dwgs.User user)
    (41 Cmts.User user)
    (42 Eco1.User user)
    (43 Eco2.User user hide)
    (44 Edge.Cuts user)
    (45 Margin user)
    (46 B.CrtYd user)
    (47 F.CrtYd user)
    (48 B.Fab user)
    (49 F.Fab user)
  )

  (setup
    (last_trace_width 0.25)
    (user_trace_width 0.4)
    (user_trace_width 0.5)
    (user_trace_width 0.75)
    (user_trace_width 1)
    (user_trace_width 1.25)
    (user_trace_width 1.5)
    (user_trace_width 2)
    (user_trace_width 3)
    (trace_clearance 0.2)
    (zone_clearance 0.1508)
    (zone_45_only no)
    (trace_min 0.2)
    (via_size 0.6)
    (via_drill 0.4)
    (via_min_size 0.4)
    (via_min_drill 0.3)
    (user_via 1.5 0.75)
    (user_via 1.75 1)
    (user_via 2 0.75)
    (user_via 2 1)
    (uvia_size 0.3)
    (uvia_drill 0.1)
    (uvias_allowed no)
    (uvia_min_size 0.2)
    (uvia_min_drill 0.1)
    (edge_width 0.15)
    (segment_width 0.2)
    (pcb_text_width 0.3)
    (pcb_text_size 1.5 1.5)
    (mod_edge_width 0.15)
    (mod_text_size 1 1)
    (mod_text_width 0.15)
    (pad_size 1.524 1.524)
    (pad_drill 0.762)
    (pad_to_mask_clearance 0.2)
    (aux_axis_origin 0 0)
    (grid_origin 112.26292 96.61652)
    (visible_elements FFFFFF7F)
    (pcbplotparams
      (layerselection 0x00030_80000001)
      (usegerberextensions false)
      (usegerberattributes false)
      (usegerberadvancedattributes false)
      (creategerberjobfile false)
      (excludeedgelayer true)
      (linewidth 0.100000)
      (plotframeref false)
      (viasonmask false)
      (mode 1)
      (useauxorigin false)
      (hpglpennumber 1)
      (hpglpenspeed 20)
      (hpglpendiameter 15.000000)
      (psnegative false)
      (psa4output false)
      (plotreference true)
      (plotvalue true)
      (plotinvisibletext false)
      (padsonsilk false)
      (subtractmaskfromsilk false)
      (outputformat 1)
      (mirror false)
      (drillshape 1)
      (scaleselection 1)
      (outputdirectory ""))
  )

  (net 0 "")
  (net 1 GND)
  (net 2 +3.3VP)
  (net 3 /Puertos_IO/INT)
  (net 4 /Puertos_IO/SDI)
  (net 5 "Net-(L1-Pad2)")
  (net 6 "/CPU PIC18lF26f20/Vbat")
  (net 7 /Fuente/Vccbat)
  (net 8 "/CPU PIC18lF26f20/PulMed")
  (net 9 "/CPU PIC18lF26f20/En_Hall")
  (net 10 "/CPU PIC18lF26f20/VPP")
  (net 11 "/CPU PIC18lF26f20/PGD")
  (net 12 "/CPU PIC18lF26f20/PGC")
  (net 13 "/CPU PIC18lF26f20/CS")
  (net 14 "/CPU PIC18lF26f20/!Reset")
  (net 15 "/CPU PIC18lF26f20/Wake")
  (net 16 "/CPU PIC18lF26f20/SCK")
  (net 17 "/CPU PIC18lF26f20/SDI")
  (net 18 "Net-(R8-Pad2)")
  (net 19 "/CPU PIC18lF26f20/AN1")
  (net 20 /Fuente/2.5V)

  (net_class Default "Esta es la clase de red por defecto."
    (clearance 0.2)
    (trace_width 0.25)
    (via_dia 0.6)
    (via_drill 0.4)
    (uvia_dia 0.3)
    (uvia_drill 0.1)
    (add_net +3.3VP)
    (add_net "/CPU PIC18lF26f20/!Reset")
    (add_net "/CPU PIC18lF26f20/AN1")
    (add_net "/CPU PIC18lF26f20/CS")
    (add_net "/CPU PIC18lF26f20/En_Hall")
    (add_net "/CPU PIC18lF26f20/PGC")
    (add_net "/CPU PIC18lF26f20/PGD")
    (add_net "/CPU PIC18lF26f20/PulMed")
    (add_net "/CPU PIC18lF26f20/SCK")
    (add_net "/CPU PIC18lF26f20/SDI")
    (add_net "/CPU PIC18lF26f20/VPP")
    (add_net "/CPU PIC18lF26f20/Vbat")
    (add_net "/CPU PIC18lF26f20/Wake")
    (add_net /Fuente/2.5V)
    (add_net /Fuente/Vccbat)
    (add_net /Puertos_IO/INT)
    (add_net /Puertos_IO/SDI)
    (add_net GND)
    (add_net "Net-(L1-Pad2)")
    (add_net "Net-(R8-Pad2)")
  )

  (module Package_SO:SOIC-28W_7.5x17.9mm_P1.27mm (layer B.Cu) (tedit 5C97300E) (tstamp 5D25AE40)
    (at 109.72292 122.01652)
    (descr "SOIC, 28 Pin (JEDEC MS-013AE, https://www.analog.com/media/en/package-pcb-resources/package/35833120341221rw_28.pdf), generated with kicad-footprint-generator ipc_gullwing_generator.py")
    (tags "SOIC SO")
    (path /5B5B4E88/5D2839D0)
    (attr smd)
    (fp_text reference U1 (at 0 9.9) (layer B.SilkS)
      (effects (font (size 1 1) (thickness 0.15)) (justify mirror))
    )
    (fp_text value PIC18LF26J50_SO (at 0 -9.9) (layer B.Fab)
      (effects (font (size 1 1) (thickness 0.15)) (justify mirror))
    )
    (fp_line (start 0 -9.06) (end 3.86 -9.06) (layer B.SilkS) (width 0.12))
    (fp_line (start 3.86 -9.06) (end 3.86 -8.815) (layer B.SilkS) (width 0.12))
    (fp_line (start 0 -9.06) (end -3.86 -9.06) (layer B.SilkS) (width 0.12))
    (fp_line (start -3.86 -9.06) (end -3.86 -8.815) (layer B.SilkS) (width 0.12))
    (fp_line (start 0 9.06) (end 3.86 9.06) (layer B.SilkS) (width 0.12))
    (fp_line (start 3.86 9.06) (end 3.86 8.815) (layer B.SilkS) (width 0.12))
    (fp_line (start 0 9.06) (end -3.86 9.06) (layer B.SilkS) (width 0.12))
    (fp_line (start -3.86 9.06) (end -3.86 8.815) (layer B.SilkS) (width 0.12))
    (fp_line (start -3.86 8.815) (end -5.675 8.815) (layer B.SilkS) (width 0.12))
    (fp_line (start -2.75 8.95) (end 3.75 8.95) (layer B.Fab) (width 0.1))
    (fp_line (start 3.75 8.95) (end 3.75 -8.95) (layer B.Fab) (width 0.1))
    (fp_line (start 3.75 -8.95) (end -3.75 -8.95) (layer B.Fab) (width 0.1))
    (fp_line (start -3.75 -8.95) (end -3.75 7.95) (layer B.Fab) (width 0.1))
    (fp_line (start -3.75 7.95) (end -2.75 8.95) (layer B.Fab) (width 0.1))
    (fp_line (start -5.93 9.2) (end -5.93 -9.2) (layer B.CrtYd) (width 0.05))
    (fp_line (start -5.93 -9.2) (end 5.93 -9.2) (layer B.CrtYd) (width 0.05))
    (fp_line (start 5.93 -9.2) (end 5.93 9.2) (layer B.CrtYd) (width 0.05))
    (fp_line (start 5.93 9.2) (end -5.93 9.2) (layer B.CrtYd) (width 0.05))
    (fp_text user %R (at 0 0) (layer B.Fab)
      (effects (font (size 1 1) (thickness 0.15)) (justify mirror))
    )
    (pad 1 smd roundrect (at -4.65 8.255) (size 2.05 0.6) (layers B.Cu B.Paste B.Mask) (roundrect_rratio 0.25)
      (net 10 "/CPU PIC18lF26f20/VPP"))
    (pad 2 smd roundrect (at -4.65 6.985) (size 2.05 0.6) (layers B.Cu B.Paste B.Mask) (roundrect_rratio 0.25)
      (net 6 "/CPU PIC18lF26f20/Vbat"))
    (pad 3 smd roundrect (at -4.65 5.715) (size 2.05 0.6) (layers B.Cu B.Paste B.Mask) (roundrect_rratio 0.25)
      (net 19 "/CPU PIC18lF26f20/AN1"))
    (pad 4 smd roundrect (at -4.65 4.445) (size 2.05 0.6) (layers B.Cu B.Paste B.Mask) (roundrect_rratio 0.25))
    (pad 5 smd roundrect (at -4.65 3.175) (size 2.05 0.6) (layers B.Cu B.Paste B.Mask) (roundrect_rratio 0.25))
    (pad 6 smd roundrect (at -4.65 1.905) (size 2.05 0.6) (layers B.Cu B.Paste B.Mask) (roundrect_rratio 0.25)
      (net 20 /Fuente/2.5V))
    (pad 7 smd roundrect (at -4.65 0.635) (size 2.05 0.6) (layers B.Cu B.Paste B.Mask) (roundrect_rratio 0.25))
    (pad 8 smd roundrect (at -4.65 -0.635) (size 2.05 0.6) (layers B.Cu B.Paste B.Mask) (roundrect_rratio 0.25)
      (net 1 GND))
    (pad 9 smd roundrect (at -4.65 -1.905) (size 2.05 0.6) (layers B.Cu B.Paste B.Mask) (roundrect_rratio 0.25))
    (pad 10 smd roundrect (at -4.65 -3.175) (size 2.05 0.6) (layers B.Cu B.Paste B.Mask) (roundrect_rratio 0.25))
    (pad 11 smd roundrect (at -4.65 -4.445) (size 2.05 0.6) (layers B.Cu B.Paste B.Mask) (roundrect_rratio 0.25)
      (net 8 "/CPU PIC18lF26f20/PulMed"))
    (pad 12 smd roundrect (at -4.65 -5.715) (size 2.05 0.6) (layers B.Cu B.Paste B.Mask) (roundrect_rratio 0.25)
      (net 9 "/CPU PIC18lF26f20/En_Hall"))
    (pad 13 smd roundrect (at -4.65 -6.985) (size 2.05 0.6) (layers B.Cu B.Paste B.Mask) (roundrect_rratio 0.25))
    (pad 14 smd roundrect (at -4.65 -8.255) (size 2.05 0.6) (layers B.Cu B.Paste B.Mask) (roundrect_rratio 0.25))
    (pad 15 smd roundrect (at 4.65 -8.255) (size 2.05 0.6) (layers B.Cu B.Paste B.Mask) (roundrect_rratio 0.25)
      (net 13 "/CPU PIC18lF26f20/CS"))
    (pad 16 smd roundrect (at 4.65 -6.985) (size 2.05 0.6) (layers B.Cu B.Paste B.Mask) (roundrect_rratio 0.25)
      (net 14 "/CPU PIC18lF26f20/!Reset"))
    (pad 17 smd roundrect (at 4.65 -5.715) (size 2.05 0.6) (layers B.Cu B.Paste B.Mask) (roundrect_rratio 0.25)
      (net 15 "/CPU PIC18lF26f20/Wake"))
    (pad 18 smd roundrect (at 4.65 -4.445) (size 2.05 0.6) (layers B.Cu B.Paste B.Mask) (roundrect_rratio 0.25)
      (net 4 /Puertos_IO/SDI))
    (pad 19 smd roundrect (at 4.65 -3.175) (size 2.05 0.6) (layers B.Cu B.Paste B.Mask) (roundrect_rratio 0.25)
      (net 1 GND))
    (pad 20 smd roundrect (at 4.65 -1.905) (size 2.05 0.6) (layers B.Cu B.Paste B.Mask) (roundrect_rratio 0.25)
      (net 2 +3.3VP))
    (pad 21 smd roundrect (at 4.65 -0.635) (size 2.05 0.6) (layers B.Cu B.Paste B.Mask) (roundrect_rratio 0.25)
      (net 3 /Puertos_IO/INT))
    (pad 22 smd roundrect (at 4.65 0.635) (size 2.05 0.6) (layers B.Cu B.Paste B.Mask) (roundrect_rratio 0.25))
    (pad 23 smd roundrect (at 4.65 1.905) (size 2.05 0.6) (layers B.Cu B.Paste B.Mask) (roundrect_rratio 0.25))
    (pad 24 smd roundrect (at 4.65 3.175) (size 2.05 0.6) (layers B.Cu B.Paste B.Mask) (roundrect_rratio 0.25))
    (pad 25 smd roundrect (at 4.65 4.445) (size 2.05 0.6) (layers B.Cu B.Paste B.Mask) (roundrect_rratio 0.25)
      (net 16 "/CPU PIC18lF26f20/SCK"))
    (pad 26 smd roundrect (at 4.65 5.715) (size 2.05 0.6) (layers B.Cu B.Paste B.Mask) (roundrect_rratio 0.25)
      (net 17 "/CPU PIC18lF26f20/SDI"))
    (pad 27 smd roundrect (at 4.65 6.985) (size 2.05 0.6) (layers B.Cu B.Paste B.Mask) (roundrect_rratio 0.25)
      (net 12 "/CPU PIC18lF26f20/PGC"))
    (pad 28 smd roundrect (at 4.65 8.255) (size 2.05 0.6) (layers B.Cu B.Paste B.Mask) (roundrect_rratio 0.25)
      (net 11 "/CPU PIC18lF26f20/PGD"))
    (model ${KISYS3DMOD}/Package_SO.3dshapes/SOIC-28W_7.5x17.9mm_P1.27mm.wrl
      (at (xyz 0 0 0))
      (scale (xyz 1 1 1))
      (rotate (xyz 0 0 0))
    )
  )

  (module LOGOS:otro (layer F.Cu) (tedit 0) (tstamp 5D263927)
    (at 95.11792 114.39652)
    (fp_text reference G*** (at 0 0) (layer F.SilkS) hide
      (effects (font (size 1.524 1.524) (thickness 0.3)))
    )
    (fp_text value LOGO (at 0.75 0) (layer F.SilkS) hide
      (effects (font (size 1.524 1.524) (thickness 0.3)))
    )
    (fp_poly (pts (xy -7.133783 -9.693771) (xy -6.526159 -9.432237) (xy -6.176084 -9.161947) (xy -5.711236 -8.60232)
      (xy -5.473847 -8.004686) (xy -5.463967 -7.391025) (xy -5.681649 -6.783317) (xy -6.126945 -6.203541)
      (xy -6.16903 -6.162268) (xy -6.714648 -5.748009) (xy -7.276957 -5.558089) (xy -7.894234 -5.582655)
      (xy -8.161665 -5.649297) (xy -8.458344 -5.794528) (xy -8.796233 -6.037411) (xy -8.910641 -6.138959)
      (xy -9.371853 -6.71178) (xy -9.605978 -7.320992) (xy -9.610323 -7.715745) (xy -9.394709 -7.715745)
      (xy -9.313095 -7.102756) (xy -9.02078 -6.531884) (xy -8.919289 -6.406548) (xy -8.61309 -6.125952)
      (xy -8.283475 -5.920852) (xy -8.190135 -5.884488) (xy -7.623693 -5.808402) (xy -7.02805 -5.885461)
      (xy -6.507192 -6.098963) (xy -6.400583 -6.171903) (xy -6.096857 -6.495137) (xy -5.846207 -6.921305)
      (xy -5.810408 -7.007693) (xy -5.681265 -7.617701) (xy -5.750669 -8.177028) (xy -5.983886 -8.664866)
      (xy -6.346184 -9.060412) (xy -6.802828 -9.342859) (xy -7.319087 -9.491402) (xy -7.860226 -9.485235)
      (xy -8.391512 -9.303553) (xy -8.878213 -8.925551) (xy -8.925359 -8.873575) (xy -9.265504 -8.322227)
      (xy -9.394709 -7.715745) (xy -9.610323 -7.715745) (xy -9.612825 -7.943022) (xy -9.392205 -8.554299)
      (xy -8.943929 -9.131249) (xy -8.934796 -9.140179) (xy -8.369246 -9.547496) (xy -7.758527 -9.732109)
      (xy -7.133783 -9.693771)) (layer Eco1.User) (width 0.01))
    (fp_poly (pts (xy -6.97984 -11.223137) (xy -6.598344 -11.193827) (xy -6.311021 -11.128279) (xy -6.047452 -11.012933)
      (xy -5.863845 -10.909734) (xy -5.321021 -10.514604) (xy -4.804406 -10.005014) (xy -4.373908 -9.449446)
      (xy -4.089439 -8.916386) (xy -4.067766 -8.856611) (xy -3.899486 -8.068945) (xy -3.897475 -7.246067)
      (xy -4.058284 -6.474457) (xy -4.174297 -6.184888) (xy -4.571366 -5.540237) (xy -5.107755 -4.937273)
      (xy -5.707997 -4.455754) (xy -5.938426 -4.320534) (xy -6.332012 -4.18428) (xy -6.8716 -4.084546)
      (xy -7.470084 -4.028549) (xy -8.040361 -4.023508) (xy -8.495326 -4.07664) (xy -8.58502 -4.101214)
      (xy -9.248613 -4.396542) (xy -9.876538 -4.852073) (xy -10.091269 -5.047887) (xy -10.661082 -5.742253)
      (xy -11.028795 -6.521562) (xy -11.194348 -7.35037) (xy -11.174651 -7.803124) (xy -10.961529 -7.803124)
      (xy -10.909784 -6.999482) (xy -10.684448 -6.230465) (xy -10.291147 -5.534782) (xy -9.735507 -4.951138)
      (xy -9.23178 -4.618684) (xy -8.825847 -4.427723) (xy -8.446238 -4.316418) (xy -8.009923 -4.269614)
      (xy -7.433872 -4.272156) (xy -7.349537 -4.275128) (xy -6.688926 -4.329855) (xy -6.192029 -4.445649)
      (xy -5.930404 -4.557292) (xy -5.245136 -5.038135) (xy -4.698375 -5.680587) (xy -4.31764 -6.43891)
      (xy -4.13045 -7.267364) (xy -4.11574 -7.573524) (xy -4.220207 -8.50621) (xy -4.530286 -9.328034)
      (xy -5.040994 -10.030142) (xy -5.747349 -10.603685) (xy -5.860104 -10.672357) (xy -6.145811 -10.826594)
      (xy -6.41006 -10.922234) (xy -6.723396 -10.972922) (xy -7.156366 -10.992304) (xy -7.525926 -10.994583)
      (xy -8.253106 -10.96487) (xy -8.818226 -10.85884) (xy -9.288982 -10.650429) (xy -9.733067 -10.313575)
      (xy -10.018965 -10.034733) (xy -10.521746 -9.359457) (xy -10.834059 -8.602685) (xy -10.961529 -7.803124)
      (xy -11.174651 -7.803124) (xy -11.157679 -8.193233) (xy -10.918726 -9.014706) (xy -10.477427 -9.779345)
      (xy -10.100242 -10.211246) (xy -9.602 -10.662733) (xy -9.147627 -10.961205) (xy -8.66383 -11.135661)
      (xy -8.077315 -11.2151) (xy -7.525926 -11.229768) (xy -6.97984 -11.223137)) (layer Eco1.User) (width 0.01))
    (fp_poly (pts (xy -6.695558 -12.729111) (xy -5.752121 -12.458098) (xy -4.869386 -12.005618) (xy -4.077725 -11.388918)
      (xy -3.407508 -10.625246) (xy -2.889105 -9.731851) (xy -2.712654 -9.289815) (xy -2.480167 -8.277923)
      (xy -2.468219 -7.26553) (xy -2.663975 -6.281248) (xy -3.0546 -5.353688) (xy -3.627257 -4.511462)
      (xy -4.369111 -3.783183) (xy -5.267325 -3.197463) (xy -5.496171 -3.085232) (xy -5.872025 -2.929663)
      (xy -6.235495 -2.830512) (xy -6.664822 -2.7732) (xy -7.238245 -2.743147) (xy -7.349537 -2.739868)
      (xy -8.07774 -2.74229) (xy -8.658405 -2.790406) (xy -8.995833 -2.862751) (xy -9.85815 -3.227234)
      (xy -10.613603 -3.735089) (xy -10.795258 -3.888633) (xy -11.53695 -4.679048) (xy -12.074604 -5.548367)
      (xy -12.414624 -6.470494) (xy -12.563416 -7.419332) (xy -12.541925 -7.985638) (xy -12.324669 -7.985638)
      (xy -12.315232 -7.414185) (xy -12.13248 -6.326747) (xy -11.751719 -5.358383) (xy -11.183416 -4.522704)
      (xy -10.438037 -3.833319) (xy -9.526051 -3.303838) (xy -8.995833 -3.098326) (xy -8.574686 -3.014747)
      (xy -7.968547 -2.973346) (xy -7.349537 -2.973798) (xy -6.767648 -2.997528) (xy -6.340433 -3.043468)
      (xy -5.98745 -3.127987) (xy -5.62826 -3.267448) (xy -5.409259 -3.368574) (xy -4.507463 -3.921287)
      (xy -3.77081 -4.641158) (xy -3.202961 -5.524548) (xy -3.165597 -5.600796) (xy -2.827258 -6.568656)
      (xy -2.700731 -7.586462) (xy -2.781856 -8.611052) (xy -3.066475 -9.599267) (xy -3.550428 -10.507947)
      (xy -3.652336 -10.651559) (xy -4.30878 -11.352772) (xy -5.112178 -11.909084) (xy -6.016061 -12.304005)
      (xy -6.973961 -12.521044) (xy -7.939411 -12.543713) (xy -8.643055 -12.422558) (xy -9.673302 -12.038114)
      (xy -10.556309 -11.485169) (xy -11.277513 -10.783586) (xy -11.82235 -9.953227) (xy -12.176257 -9.013957)
      (xy -12.324669 -7.985638) (xy -12.541925 -7.985638) (xy -12.527384 -8.368782) (xy -12.312934 -9.292747)
      (xy -11.92647 -10.16513) (xy -11.374398 -10.959834) (xy -10.663123 -11.650762) (xy -9.799051 -12.211815)
      (xy -8.788585 -12.616896) (xy -8.643055 -12.657743) (xy -7.669326 -12.801408) (xy -6.695558 -12.729111)) (layer Eco1.User) (width 0.01))
    (fp_poly (pts (xy 4.771329 -4.112003) (xy 5.386358 -3.705467) (xy 5.472711 -3.628525) (xy 5.913986 -3.123911)
      (xy 6.155072 -2.580723) (xy 6.219871 -1.935856) (xy 6.206708 -1.690758) (xy 6.038819 -1.022124)
      (xy 5.64947 -0.420795) (xy 5.136603 0.045695) (xy 4.804161 0.195528) (xy 4.331849 0.293081)
      (xy 3.810768 0.330388) (xy 3.332023 0.299481) (xy 3.057408 0.227523) (xy 2.713657 0.016644)
      (xy 2.332443 -0.314047) (xy 1.998833 -0.683617) (xy 1.829447 -0.940741) (xy 1.620234 -1.58953)
      (xy 1.620947 -1.902062) (xy 1.85482 -1.902062) (xy 1.908398 -1.363612) (xy 2.029899 -0.996785)
      (xy 2.379116 -0.506442) (xy 2.82891 -0.13099) (xy 3.057468 -0.014517) (xy 3.499861 0.084469)
      (xy 4.044817 0.102077) (xy 4.575014 0.040366) (xy 4.868368 -0.046319) (xy 5.186243 -0.245195)
      (xy 5.508663 -0.545256) (xy 5.599545 -0.654527) (xy 5.780824 -0.919287) (xy 5.883206 -1.17135)
      (xy 5.928476 -1.494118) (xy 5.938426 -1.951899) (xy 5.899736 -2.566431) (xy 5.761626 -3.02326)
      (xy 5.491035 -3.390312) (xy 5.07788 -3.71995) (xy 4.485621 -3.991821) (xy 3.853064 -4.05906)
      (xy 3.22879 -3.934779) (xy 2.661381 -3.632091) (xy 2.199418 -3.164107) (xy 2.036848 -2.899162)
      (xy 1.897771 -2.450686) (xy 1.85482 -1.902062) (xy 1.620947 -1.902062) (xy 1.621738 -2.248049)
      (xy 1.814494 -2.877765) (xy 2.179041 -3.440146) (xy 2.695913 -3.896658) (xy 3.345647 -4.208769)
      (xy 3.502945 -4.253838) (xy 4.136879 -4.296903) (xy 4.771329 -4.112003)) (layer Eco1.User) (width 0.01))
    (fp_poly (pts (xy 4.265117 14.087208) (xy 4.302134 14.120509) (xy 4.521472 14.358294) (xy 4.558975 14.54396)
      (xy 4.41414 14.759914) (xy 4.297475 14.880808) (xy 4.043904 15.103099) (xy 3.854908 15.14219)
      (xy 3.646925 14.997545) (xy 3.528178 14.875888) (xy 3.349857 14.653862) (xy 3.327469 14.476507)
      (xy 3.359144 14.403923) (xy 3.570751 14.403923) (xy 3.582563 14.622724) (xy 3.711448 14.838181)
      (xy 3.886555 14.934259) (xy 4.036936 14.859797) (xy 4.166138 14.749471) (xy 4.331205 14.526092)
      (xy 4.291413 14.34403) (xy 4.176035 14.229946) (xy 3.91845 14.142557) (xy 3.674968 14.247276)
      (xy 3.570751 14.403923) (xy 3.359144 14.403923) (xy 3.408915 14.289874) (xy 3.656074 13.993212)
      (xy 3.947383 13.924536) (xy 4.265117 14.087208)) (layer Eco1.User) (width 0.01))
    (fp_poly (pts (xy -5.993767 -14.519707) (xy -4.866754 -14.159584) (xy -3.811119 -13.610837) (xy -2.84907 -12.882105)
      (xy -2.002817 -11.982024) (xy -1.294569 -10.919235) (xy -0.880934 -10.054167) (xy -0.740101 -9.690033)
      (xy -0.644677 -9.372732) (xy -0.58559 -9.0402) (xy -0.553766 -8.63037) (xy -0.540133 -8.081178)
      (xy -0.537127 -7.702315) (xy -0.537648 -7.054117) (xy -0.552933 -6.577687) (xy -0.591765 -6.209686)
      (xy -0.66293 -5.886775) (xy -0.775211 -5.545611) (xy -0.871453 -5.291667) (xy -1.443849 -4.116848)
      (xy -2.183118 -3.085677) (xy -3.068125 -2.212919) (xy -4.077738 -1.513341) (xy -5.190825 -1.001712)
      (xy -6.386253 -0.692797) (xy -7.584722 -0.600593) (xy -8.169956 -0.633695) (xy -8.790316 -0.712019)
      (xy -9.297598 -0.815347) (xy -10.459132 -1.246182) (xy -11.530079 -1.892943) (xy -12.263803 -2.511593)
      (xy -12.97078 -3.251673) (xy -13.510193 -3.97298) (xy -13.931106 -4.748306) (xy -14.177224 -5.350463)
      (xy -14.332971 -5.800386) (xy -14.433795 -6.182605) (xy -14.491291 -6.57407) (xy -14.517049 -7.051731)
      (xy -14.522685 -7.643519) (xy -14.2875 -7.643519) (xy -14.280898 -7.01577) (xy -14.253398 -6.546263)
      (xy -14.193455 -6.158239) (xy -14.089527 -5.774941) (xy -13.943471 -5.355957) (xy -13.407349 -4.216239)
      (xy -12.702713 -3.219497) (xy -11.853156 -2.378259) (xy -10.882267 -1.705052) (xy -9.813637 -1.212405)
      (xy -8.670858 -0.912847) (xy -7.477519 -0.818904) (xy -6.257212 -0.943106) (xy -5.820833 -1.042327)
      (xy -4.603012 -1.472831) (xy -3.530115 -2.087942) (xy -2.606634 -2.883611) (xy -1.83706 -3.855789)
      (xy -1.225885 -5.000429) (xy -1.106638 -5.291667) (xy -0.96381 -5.677084) (xy -0.867656 -6.004181)
      (xy -0.809391 -6.336298) (xy -0.780231 -6.736775) (xy -0.771392 -7.268953) (xy -0.772312 -7.702315)
      (xy -0.779867 -8.353243) (xy -0.800682 -8.831089) (xy -0.843831 -9.197917) (xy -0.918388 -9.515794)
      (xy -1.033424 -9.846783) (xy -1.116119 -10.054167) (xy -1.69794 -11.210784) (xy -2.429831 -12.210423)
      (xy -3.295737 -13.034784) (xy -4.279609 -13.665566) (xy -4.287439 -13.669543) (xy -5.47049 -14.148124)
      (xy -6.669794 -14.406649) (xy -7.861998 -14.454146) (xy -9.023751 -14.29964) (xy -10.131699 -13.952159)
      (xy -11.16249 -13.420728) (xy -12.092772 -12.714376) (xy -12.899193 -11.842128) (xy -13.5584 -10.813012)
      (xy -13.944733 -9.936574) (xy -14.099591 -9.485008) (xy -14.199746 -9.1001) (xy -14.256745 -8.704612)
      (xy -14.282134 -8.2213) (xy -14.2875 -7.643519) (xy -14.522685 -7.643519) (xy -14.515879 -8.273941)
      (xy -14.48778 -8.74678) (xy -14.426867 -9.139434) (xy -14.321619 -9.529303) (xy -14.181355 -9.936574)
      (xy -13.96297 -10.469065) (xy -13.703575 -11.000942) (xy -13.455228 -11.426474) (xy -13.428706 -11.465278)
      (xy -12.946704 -12.071917) (xy -12.360907 -12.683303) (xy -11.733037 -13.242854) (xy -11.124818 -13.69399)
      (xy -10.771425 -13.901188) (xy -9.580987 -14.381946) (xy -8.373093 -14.639526) (xy -7.16995 -14.682567)
      (xy -5.993767 -14.519707)) (layer Eco1.User) (width 0.01))
    (fp_poly (pts (xy 27.119471 -14.311343) (xy 27.891969 -13.062168) (xy 28.447683 -11.75385) (xy 28.788707 -10.408193)
      (xy 28.917136 -9.047002) (xy 28.835064 -7.692083) (xy 28.544584 -6.365238) (xy 28.047793 -5.088274)
      (xy 27.346783 -3.882994) (xy 26.443649 -2.771203) (xy 25.965969 -2.30181) (xy 24.809254 -1.391529)
      (xy 23.565044 -0.692937) (xy 22.251001 -0.210411) (xy 20.884784 0.051668) (xy 19.484054 0.088922)
      (xy 18.066471 -0.10303) (xy 17.580093 -0.222297) (xy 16.357943 -0.639792) (xy 15.26444 -1.200728)
      (xy 14.230751 -1.942867) (xy 13.855922 -2.26533) (xy 12.86091 -3.306911) (xy 12.063948 -4.456462)
      (xy 11.467253 -5.691718) (xy 11.073041 -6.990416) (xy 10.883528 -8.330292) (xy 10.893049 -9.07381)
      (xy 11.105597 -9.07381) (xy 11.191363 -7.703247) (xy 11.48554 -6.352889) (xy 11.988799 -5.049812)
      (xy 12.580261 -4.001418) (xy 13.416591 -2.935787) (xy 14.410517 -2.025456) (xy 15.53428 -1.280963)
      (xy 16.76012 -0.712849) (xy 18.060279 -0.331653) (xy 19.406997 -0.147914) (xy 20.772516 -0.172171)
      (xy 22.068294 -0.399112) (xy 23.409535 -0.858865) (xy 24.635069 -1.509479) (xy 25.728674 -2.331576)
      (xy 26.674128 -3.305777) (xy 27.455209 -4.4127) (xy 28.055695 -5.632967) (xy 28.459364 -6.947199)
      (xy 28.645202 -8.256207) (xy 28.669879 -9.154903) (xy 28.62958 -9.982816) (xy 28.584298 -10.348854)
      (xy 28.353101 -11.329072) (xy 27.97721 -12.362518) (xy 27.495933 -13.355947) (xy 26.961041 -14.199306)
      (xy 26.331483 -15.051852) (xy 13.458263 -15.051852) (xy 12.833233 -14.216636) (xy 12.09206 -13.035992)
      (xy 11.556616 -11.767257) (xy 11.227572 -10.437505) (xy 11.105597 -9.07381) (xy 10.893049 -9.07381)
      (xy 10.900929 -9.689081) (xy 11.127462 -11.04452) (xy 11.565341 -12.374345) (xy 12.216784 -13.656292)
      (xy 12.656265 -14.318205) (xy 13.34676 -15.272404) (xy 19.878361 -15.279721) (xy 26.409963 -15.287037)
      (xy 27.119471 -14.311343)) (layer Eco1.User) (width 0.01))
    (fp_poly (pts (xy 4.50612 -6.049085) (xy 4.90819 -6.020485) (xy 5.215863 -5.95752) (xy 5.499441 -5.847676)
      (xy 5.714349 -5.739836) (xy 6.508921 -5.20184) (xy 7.193058 -4.504372) (xy 7.706043 -3.709482)
      (xy 7.711132 -3.699158) (xy 7.882915 -3.320133) (xy 7.986249 -2.987915) (xy 8.037853 -2.617016)
      (xy 8.054443 -2.121945) (xy 8.055093 -1.940278) (xy 8.045555 -1.391857) (xy 8.00587 -0.992935)
      (xy 7.919429 -0.658218) (xy 7.769625 -0.302409) (xy 7.71361 -0.186463) (xy 7.215276 0.593014)
      (xy 6.556846 1.269699) (xy 5.798583 1.783953) (xy 5.646772 1.85904) (xy 5.026529 2.066593)
      (xy 4.303639 2.184488) (xy 3.571821 2.205623) (xy 2.924794 2.122899) (xy 2.763426 2.077492)
      (xy 1.848327 1.665799) (xy 1.084486 1.100321) (xy 0.482119 0.409713) (xy 0.051443 -0.377369)
      (xy -0.197327 -1.23227) (xy -0.242576 -1.94646) (xy -0.014699 -1.94646) (xy 0.092553 -1.008163)
      (xy 0.400745 -0.140778) (xy 0.889529 0.620551) (xy 1.538558 1.24068) (xy 1.999074 1.531763)
      (xy 2.813922 1.840043) (xy 3.713236 1.971359) (xy 4.624755 1.923922) (xy 5.476218 1.695942)
      (xy 5.646772 1.622097) (xy 6.444842 1.125375) (xy 7.087201 0.453322) (xy 7.49255 -0.215335)
      (xy 7.657013 -0.582312) (xy 7.75569 -0.913898) (xy 7.80455 -1.294232) (xy 7.819561 -1.807456)
      (xy 7.819908 -1.940278) (xy 7.810188 -2.490341) (xy 7.770165 -2.890377) (xy 7.68354 -3.225129)
      (xy 7.534016 -3.579338) (xy 7.485326 -3.679987) (xy 6.963248 -4.497146) (xy 6.275518 -5.150297)
      (xy 5.703241 -5.50954) (xy 5.39998 -5.656301) (xy 5.117119 -5.748426) (xy 4.784773 -5.798243)
      (xy 4.333057 -5.818082) (xy 3.939352 -5.820743) (xy 3.390544 -5.816201) (xy 3.003097 -5.791806)
      (xy 2.703221 -5.731558) (xy 2.417123 -5.619453) (xy 2.071012 -5.43949) (xy 1.999074 -5.399994)
      (xy 1.21238 -4.84274) (xy 0.612487 -4.14668) (xy 0.207863 -3.326336) (xy 0.006976 -2.396229)
      (xy -0.014699 -1.94646) (xy -0.242576 -1.94646) (xy -0.253973 -2.126333) (xy -0.108279 -3.030904)
      (xy 0.249971 -3.917326) (xy 0.486853 -4.307992) (xy 0.980279 -4.906736) (xy 1.602408 -5.408795)
      (xy 2.162829 -5.739062) (xy 2.470696 -5.888257) (xy 2.754371 -5.981947) (xy 3.084207 -6.032678)
      (xy 3.530556 -6.052994) (xy 3.939352 -6.055838) (xy 4.50612 -6.049085)) (layer Eco1.User) (width 0.01))
    (fp_poly (pts (xy 4.508392 12.516496) (xy 4.797738 12.630705) (xy 5.184896 12.906942) (xy 5.570087 13.297421)
      (xy 5.855086 13.701802) (xy 5.865262 13.721204) (xy 5.968288 14.09215) (xy 5.990316 14.572581)
      (xy 5.930843 15.051003) (xy 5.872149 15.249983) (xy 5.626259 15.674696) (xy 5.247049 16.089998)
      (xy 4.82082 16.402337) (xy 4.797738 16.414665) (xy 4.437821 16.525274) (xy 3.973308 16.571045)
      (xy 3.509186 16.550168) (xy 3.150443 16.460833) (xy 3.116204 16.443648) (xy 2.708505 16.149671)
      (xy 2.315714 15.7557) (xy 2.037573 15.362121) (xy 1.904633 14.930148) (xy 1.867946 14.40281)
      (xy 1.871982 14.371232) (xy 2.092116 14.371232) (xy 2.147698 14.944585) (xy 2.370741 15.486794)
      (xy 2.761191 15.948845) (xy 2.934165 16.080387) (xy 3.447133 16.297721) (xy 4.038061 16.352039)
      (xy 4.615475 16.243428) (xy 4.950897 16.078443) (xy 5.394664 15.655293) (xy 5.664889 15.128922)
      (xy 5.762223 14.550245) (xy 5.687321 13.970175) (xy 5.440836 13.439626) (xy 5.02342 13.009513)
      (xy 4.910566 12.93455) (xy 4.38938 12.740602) (xy 3.786462 12.707813) (xy 3.190524 12.835291)
      (xy 2.930687 12.954445) (xy 2.483556 13.327148) (xy 2.204051 13.815749) (xy 2.092116 14.371232)
      (xy 1.871982 14.371232) (xy 1.932046 13.901307) (xy 1.97756 13.758333) (xy 2.290619 13.244918)
      (xy 2.756362 12.841583) (xy 3.318659 12.570772) (xy 3.921379 12.454929) (xy 4.508392 12.516496)) (layer Eco1.User) (width 0.01))
    (fp_poly (pts (xy 32.925926 18.109259) (xy -33.161111 18.109259) (xy -33.161111 -17.756482) (xy -32.925926 -17.756482)
      (xy -32.925926 17.874074) (xy 32.690741 17.874074) (xy 32.690741 -2.469445) (xy 30.691667 -2.469445)
      (xy 30.691667 -15.287037) (xy 30.926852 -15.287037) (xy 30.926852 -2.70463) (xy 32.690741 -2.70463)
      (xy 32.690741 -15.287037) (xy 30.926852 -15.287037) (xy 30.691667 -15.287037) (xy 30.691667 -15.522222)
      (xy 32.690741 -15.522222) (xy 32.690741 -17.756482) (xy 25.4 -17.756482) (xy 25.4 -16.815741)
      (xy 0.470371 -16.815741) (xy 0.470371 -17.756482) (xy 0.705556 -17.756482) (xy 0.705556 -17.050926)
      (xy 25.164815 -17.050926) (xy 25.164815 -17.756482) (xy 0.705556 -17.756482) (xy 0.470371 -17.756482)
      (xy -32.925926 -17.756482) (xy -33.161111 -17.756482) (xy -33.161111 -17.991667) (xy 32.925926 -17.991667)
      (xy 32.925926 18.109259)) (layer Eco1.User) (width 0.01))
    (fp_poly (pts (xy 33.866667 19.05) (xy -33.984259 19.05) (xy -33.984259 -18.697222) (xy -33.749074 -18.697222)
      (xy -33.749074 18.814815) (xy 33.631482 18.814815) (xy 33.631482 -18.697222) (xy -33.749074 -18.697222)
      (xy -33.984259 -18.697222) (xy -33.984259 -18.932408) (xy 33.866667 -18.932408) (xy 33.866667 19.05)) (layer Eco1.User) (width 0.01))
    (fp_poly (pts (xy 34.925 20.108333) (xy -35.042592 20.108333) (xy -35.042592 -19.755556) (xy -34.807407 -19.755556)
      (xy -34.807407 19.873148) (xy 34.689815 19.873148) (xy 34.689815 -19.755556) (xy -34.807407 -19.755556)
      (xy -35.042592 -19.755556) (xy -35.042592 -19.990741) (xy 34.925 -19.990741) (xy 34.925 20.108333)) (layer Eco1.User) (width 0.01))
  )

  (module Battery_Holders:Keystone_1058_1x2032-CoinCell (layer F.Cu) (tedit 589EE147) (tstamp 5D25B277)
    (at 101.39292 120.11152)
    (descr http://www.keyelco.com/product-pdf.cfm?p=14028)
    (tags "Keystone type 1058 coin cell retainer")
    (path /5B6B20A1)
    (attr smd)
    (fp_text reference BT1 (at 0 7.62) (layer F.SilkS)
      (effects (font (size 1 1) (thickness 0.15)))
    )
    (fp_text value Battery_Cell (at 0 -9.398) (layer F.Fab)
      (effects (font (size 1 1) (thickness 0.15)))
    )
    (fp_arc (start 0 0) (end 11.06 4.11) (angle 139.2) (layer F.CrtYd) (width 0.05))
    (fp_arc (start 0 0) (end -11.06 -4.11) (angle 139.2) (layer F.CrtYd) (width 0.05))
    (fp_line (start 11.06 4.11) (end 16.45 4.11) (layer F.CrtYd) (width 0.05))
    (fp_line (start 16.45 4.11) (end 16.45 -4.11) (layer F.CrtYd) (width 0.05))
    (fp_line (start 16.45 -4.11) (end 11.06 -4.11) (layer F.CrtYd) (width 0.05))
    (fp_line (start -16.45 -4.11) (end -11.06 -4.11) (layer F.CrtYd) (width 0.05))
    (fp_line (start -16.45 -4.11) (end -16.45 4.11) (layer F.CrtYd) (width 0.05))
    (fp_line (start -16.45 4.11) (end -11.06 4.11) (layer F.CrtYd) (width 0.05))
    (fp_arc (start 0 0) (end -10.692 3.61) (angle -27.3) (layer F.SilkS) (width 0.12))
    (fp_arc (start 0 0) (end 10.692 -3.61) (angle -27.3) (layer F.SilkS) (width 0.12))
    (fp_arc (start 0 0) (end 10.692 3.61) (angle 27.3) (layer F.SilkS) (width 0.12))
    (fp_arc (start 0 0) (end -10.692 -3.61) (angle 27.3) (layer F.SilkS) (width 0.12))
    (fp_line (start -14.31 1.9) (end -14.31 3.61) (layer F.SilkS) (width 0.12))
    (fp_line (start -10.692 3.61) (end -14.31 3.61) (layer F.SilkS) (width 0.12))
    (fp_line (start -3.86 8.11) (end -7.8473 8.11) (layer F.SilkS) (width 0.12))
    (fp_line (start -1.66 5.91) (end -3.86 8.11) (layer F.SilkS) (width 0.12))
    (fp_line (start 1.66 5.91) (end -1.66 5.91) (layer F.SilkS) (width 0.12))
    (fp_line (start 1.66 5.91) (end 3.86 8.11) (layer F.SilkS) (width 0.12))
    (fp_line (start 7.8473 8.11) (end 3.86 8.11) (layer F.SilkS) (width 0.12))
    (fp_line (start 14.31 1.9) (end 14.31 3.61) (layer F.SilkS) (width 0.12))
    (fp_line (start 14.31 3.61) (end 10.692 3.61) (layer F.SilkS) (width 0.12))
    (fp_line (start 10.692 -3.61) (end 14.31 -3.61) (layer F.SilkS) (width 0.12))
    (fp_line (start 14.31 -1.9) (end 14.31 -3.61) (layer F.SilkS) (width 0.12))
    (fp_line (start -7.8473 -8.11) (end 7.8473 -8.11) (layer F.SilkS) (width 0.12))
    (fp_line (start -14.31 -1.9) (end -14.31 -3.61) (layer F.SilkS) (width 0.12))
    (fp_line (start -14.31 -3.61) (end -10.692 -3.61) (layer F.SilkS) (width 0.12))
    (fp_arc (start 0 0) (end -10.61275 3.5) (angle -27.4635) (layer F.Fab) (width 0.1))
    (fp_arc (start 0 0) (end 10.61275 -3.5) (angle -27.4635) (layer F.Fab) (width 0.1))
    (fp_arc (start 0 0) (end 10.61275 3.5) (angle 27.4635) (layer F.Fab) (width 0.1))
    (fp_line (start 14.2 1.9) (end 14.2 3.5) (layer F.Fab) (width 0.1))
    (fp_line (start 14.2 3.5) (end 10.61275 3.5) (layer F.Fab) (width 0.1))
    (fp_line (start 10.61275 -3.5) (end 14.2 -3.5) (layer F.Fab) (width 0.1))
    (fp_line (start 14.2 -3.5) (end 14.2 -1.9) (layer F.Fab) (width 0.1))
    (fp_line (start -14.2 1.9) (end -14.2 3.5) (layer F.Fab) (width 0.1))
    (fp_line (start -14.2 3.5) (end -10.61275 3.5) (layer F.Fab) (width 0.1))
    (fp_line (start 3.9 8) (end 7.8026 8) (layer F.Fab) (width 0.1))
    (fp_line (start 1.7 5.8) (end 3.9 8) (layer F.Fab) (width 0.1))
    (fp_line (start -1.7 5.8) (end -3.9 8) (layer F.Fab) (width 0.1))
    (fp_line (start -1.7 5.8) (end 1.7 5.8) (layer F.Fab) (width 0.1))
    (fp_line (start -14.2 -3.5) (end -10.61275 -3.5) (layer F.Fab) (width 0.1))
    (fp_line (start -14.2 -3.5) (end -14.2 -1.9) (layer F.Fab) (width 0.1))
    (fp_line (start -3.9 8) (end -7.8026 8) (layer F.Fab) (width 0.1))
    (fp_line (start -7.8026 -8) (end 7.8026 -8) (layer F.Fab) (width 0.1))
    (fp_arc (start 0 0) (end -10.61275 -3.5) (angle 27.4635) (layer F.Fab) (width 0.1))
    (fp_circle (center 0 0) (end 10 0) (layer Dwgs.User) (width 0.15))
    (pad 1 smd rect (at -14.68 0) (size 2.54 3.51) (layers F.Cu F.Paste F.Mask)
      (net 6 "/CPU PIC18lF26f20/Vbat"))
    (pad 2 smd rect (at 14.68 0) (size 2.54 3.51) (layers F.Cu F.Paste F.Mask)
      (net 1 GND))
  )

  (module Pin_Headers:Pin_Header_Straight_1x05_Pitch2.54mm (layer F.Cu) (tedit 59650532) (tstamp 5B65C8A5)
    (at 90.03792 106.77652 90)
    (descr "Through hole straight pin header, 1x05, 2.54mm pitch, single row")
    (tags "Through hole pin header THT 1x05 2.54mm single row")
    (path /5B5B4E89/5B5B5661)
    (fp_text reference J2 (at 0 -2.33 90) (layer F.SilkS)
      (effects (font (size 1 1) (thickness 0.15)))
    )
    (fp_text value Conn_01x05_Male (at 0 12.49 90) (layer F.Fab)
      (effects (font (size 1 1) (thickness 0.15)))
    )
    (fp_line (start -0.635 -1.27) (end 1.27 -1.27) (layer F.Fab) (width 0.1))
    (fp_line (start 1.27 -1.27) (end 1.27 11.43) (layer F.Fab) (width 0.1))
    (fp_line (start 1.27 11.43) (end -1.27 11.43) (layer F.Fab) (width 0.1))
    (fp_line (start -1.27 11.43) (end -1.27 -0.635) (layer F.Fab) (width 0.1))
    (fp_line (start -1.27 -0.635) (end -0.635 -1.27) (layer F.Fab) (width 0.1))
    (fp_line (start -1.33 11.49) (end 1.33 11.49) (layer F.SilkS) (width 0.12))
    (fp_line (start -1.33 1.27) (end -1.33 11.49) (layer F.SilkS) (width 0.12))
    (fp_line (start 1.33 1.27) (end 1.33 11.49) (layer F.SilkS) (width 0.12))
    (fp_line (start -1.33 1.27) (end 1.33 1.27) (layer F.SilkS) (width 0.12))
    (fp_line (start -1.33 0) (end -1.33 -1.33) (layer F.SilkS) (width 0.12))
    (fp_line (start -1.33 -1.33) (end 0 -1.33) (layer F.SilkS) (width 0.12))
    (fp_line (start -1.8 -1.8) (end -1.8 11.95) (layer F.CrtYd) (width 0.05))
    (fp_line (start -1.8 11.95) (end 1.8 11.95) (layer F.CrtYd) (width 0.05))
    (fp_line (start 1.8 11.95) (end 1.8 -1.8) (layer F.CrtYd) (width 0.05))
    (fp_line (start 1.8 -1.8) (end -1.8 -1.8) (layer F.CrtYd) (width 0.05))
    (fp_text user %R (at 0 5.08 180) (layer F.Fab)
      (effects (font (size 1 1) (thickness 0.15)))
    )
    (pad 1 thru_hole rect (at 0 0 90) (size 1.7 1.7) (drill 1) (layers *.Cu *.Mask)
      (net 10 "/CPU PIC18lF26f20/VPP"))
    (pad 2 thru_hole oval (at 0 2.54 90) (size 1.7 1.7) (drill 1) (layers *.Cu *.Mask)
      (net 2 +3.3VP))
    (pad 3 thru_hole oval (at 0 5.08 90) (size 1.7 1.7) (drill 1) (layers *.Cu *.Mask)
      (net 1 GND))
    (pad 4 thru_hole oval (at 0 7.62 90) (size 1.7 1.7) (drill 1) (layers *.Cu *.Mask)
      (net 11 "/CPU PIC18lF26f20/PGD"))
    (pad 5 thru_hole oval (at 0 10.16 90) (size 1.7 1.7) (drill 1) (layers *.Cu *.Mask)
      (net 12 "/CPU PIC18lF26f20/PGC"))
    (model ${KISYS3DMOD}/Pin_Headers.3dshapes/Pin_Header_Straight_1x05_Pitch2.54mm.wrl
      (at (xyz 0 0 0))
      (scale (xyz 1 1 1))
      (rotate (xyz 0 0 0))
    )
  )

  (module Capacitors_SMD:C_1206_HandSoldering (layer B.Cu) (tedit 58AA84D1) (tstamp 5B65CCEB)
    (at 101.84892 117.69852)
    (descr "Capacitor SMD 1206, hand soldering")
    (tags "capacitor 1206")
    (path /5B5B4E91/5B655FA3)
    (attr smd)
    (fp_text reference C4 (at 0 1.75) (layer B.SilkS)
      (effects (font (size 1 1) (thickness 0.15)) (justify mirror))
    )
    (fp_text value CP (at 0 -2) (layer B.Fab)
      (effects (font (size 1 1) (thickness 0.15)) (justify mirror))
    )
    (fp_text user %R (at 0 1.75) (layer B.Fab)
      (effects (font (size 1 1) (thickness 0.15)) (justify mirror))
    )
    (fp_line (start -1.6 -0.8) (end -1.6 0.8) (layer B.Fab) (width 0.1))
    (fp_line (start 1.6 -0.8) (end -1.6 -0.8) (layer B.Fab) (width 0.1))
    (fp_line (start 1.6 0.8) (end 1.6 -0.8) (layer B.Fab) (width 0.1))
    (fp_line (start -1.6 0.8) (end 1.6 0.8) (layer B.Fab) (width 0.1))
    (fp_line (start 1 1.02) (end -1 1.02) (layer B.SilkS) (width 0.12))
    (fp_line (start -1 -1.02) (end 1 -1.02) (layer B.SilkS) (width 0.12))
    (fp_line (start -3.25 1.05) (end 3.25 1.05) (layer B.CrtYd) (width 0.05))
    (fp_line (start -3.25 1.05) (end -3.25 -1.05) (layer B.CrtYd) (width 0.05))
    (fp_line (start 3.25 -1.05) (end 3.25 1.05) (layer B.CrtYd) (width 0.05))
    (fp_line (start 3.25 -1.05) (end -3.25 -1.05) (layer B.CrtYd) (width 0.05))
    (pad 1 smd rect (at -2 0) (size 2 1.6) (layers B.Cu B.Paste B.Mask)
      (net 2 +3.3VP))
    (pad 2 smd rect (at 2 0) (size 2 1.6) (layers B.Cu B.Paste B.Mask)
      (net 1 GND))
    (model Capacitors_SMD.3dshapes/C_1206.wrl
      (at (xyz 0 0 0))
      (scale (xyz 1 1 1))
      (rotate (xyz 0 0 0))
    )
  )

  (module Capacitors_SMD:C_1206_HandSoldering (layer B.Cu) (tedit 58AA84D1) (tstamp 5B6A13A5)
    (at 101.86416 122.5042)
    (descr "Capacitor SMD 1206, hand soldering")
    (tags "capacitor 1206")
    (path /5B5B4E91/5B65FC15)
    (attr smd)
    (fp_text reference C3 (at 0 1.75) (layer B.SilkS)
      (effects (font (size 1 1) (thickness 0.15)) (justify mirror))
    )
    (fp_text value C (at 0 -2) (layer B.Fab)
      (effects (font (size 1 1) (thickness 0.15)) (justify mirror))
    )
    (fp_text user %R (at 0 1.75) (layer B.Fab)
      (effects (font (size 1 1) (thickness 0.15)) (justify mirror))
    )
    (fp_line (start -1.6 -0.8) (end -1.6 0.8) (layer B.Fab) (width 0.1))
    (fp_line (start 1.6 -0.8) (end -1.6 -0.8) (layer B.Fab) (width 0.1))
    (fp_line (start 1.6 0.8) (end 1.6 -0.8) (layer B.Fab) (width 0.1))
    (fp_line (start -1.6 0.8) (end 1.6 0.8) (layer B.Fab) (width 0.1))
    (fp_line (start 1 1.02) (end -1 1.02) (layer B.SilkS) (width 0.12))
    (fp_line (start -1 -1.02) (end 1 -1.02) (layer B.SilkS) (width 0.12))
    (fp_line (start -3.25 1.05) (end 3.25 1.05) (layer B.CrtYd) (width 0.05))
    (fp_line (start -3.25 1.05) (end -3.25 -1.05) (layer B.CrtYd) (width 0.05))
    (fp_line (start 3.25 -1.05) (end 3.25 1.05) (layer B.CrtYd) (width 0.05))
    (fp_line (start 3.25 -1.05) (end -3.25 -1.05) (layer B.CrtYd) (width 0.05))
    (pad 1 smd rect (at -2 0) (size 2 1.6) (layers B.Cu B.Paste B.Mask)
      (net 7 /Fuente/Vccbat))
    (pad 2 smd rect (at 2 0) (size 2 1.6) (layers B.Cu B.Paste B.Mask)
      (net 1 GND))
    (model Capacitors_SMD.3dshapes/C_1206.wrl
      (at (xyz 0 0 0))
      (scale (xyz 1 1 1))
      (rotate (xyz 0 0 0))
    )
  )

  (module Capacitors_SMD:C_1206_HandSoldering (layer B.Cu) (tedit 58AA84D1) (tstamp 5B6A13AA)
    (at 105.8418 107.02544)
    (descr "Capacitor SMD 1206, hand soldering")
    (tags "capacitor 1206")
    (path /5B5B4E88/5B5B5835)
    (attr smd)
    (fp_text reference C1 (at 0 1.75) (layer B.SilkS)
      (effects (font (size 1 1) (thickness 0.15)) (justify mirror))
    )
    (fp_text value C_Small (at 0 -2) (layer B.Fab)
      (effects (font (size 1 1) (thickness 0.15)) (justify mirror))
    )
    (fp_text user %R (at 0 1.75) (layer B.Fab)
      (effects (font (size 1 1) (thickness 0.15)) (justify mirror))
    )
    (fp_line (start -1.6 -0.8) (end -1.6 0.8) (layer B.Fab) (width 0.1))
    (fp_line (start 1.6 -0.8) (end -1.6 -0.8) (layer B.Fab) (width 0.1))
    (fp_line (start 1.6 0.8) (end 1.6 -0.8) (layer B.Fab) (width 0.1))
    (fp_line (start -1.6 0.8) (end 1.6 0.8) (layer B.Fab) (width 0.1))
    (fp_line (start 1 1.02) (end -1 1.02) (layer B.SilkS) (width 0.12))
    (fp_line (start -1 -1.02) (end 1 -1.02) (layer B.SilkS) (width 0.12))
    (fp_line (start -3.25 1.05) (end 3.25 1.05) (layer B.CrtYd) (width 0.05))
    (fp_line (start -3.25 1.05) (end -3.25 -1.05) (layer B.CrtYd) (width 0.05))
    (fp_line (start 3.25 -1.05) (end 3.25 1.05) (layer B.CrtYd) (width 0.05))
    (fp_line (start 3.25 -1.05) (end -3.25 -1.05) (layer B.CrtYd) (width 0.05))
    (pad 1 smd rect (at -2 0) (size 2 1.6) (layers B.Cu B.Paste B.Mask)
      (net 2 +3.3VP))
    (pad 2 smd rect (at 2 0) (size 2 1.6) (layers B.Cu B.Paste B.Mask)
      (net 1 GND))
    (model Capacitors_SMD.3dshapes/C_1206.wrl
      (at (xyz 0 0 0))
      (scale (xyz 1 1 1))
      (rotate (xyz 0 0 0))
    )
  )

  (module Capacitors_SMD:C_1206_HandSoldering (layer B.Cu) (tedit 58AA84D1) (tstamp 5D25B152)
    (at 105.8418 110.1852)
    (descr "Capacitor SMD 1206, hand soldering")
    (tags "capacitor 1206")
    (path /5B5B4E88/5B5B5836)
    (attr smd)
    (fp_text reference C2 (at 0 1.75) (layer B.SilkS)
      (effects (font (size 1 1) (thickness 0.15)) (justify mirror))
    )
    (fp_text value CP_Small (at 0 -2) (layer B.Fab)
      (effects (font (size 1 1) (thickness 0.15)) (justify mirror))
    )
    (fp_text user %R (at 0 1.75) (layer B.Fab)
      (effects (font (size 1 1) (thickness 0.15)) (justify mirror))
    )
    (fp_line (start -1.6 -0.8) (end -1.6 0.8) (layer B.Fab) (width 0.1))
    (fp_line (start 1.6 -0.8) (end -1.6 -0.8) (layer B.Fab) (width 0.1))
    (fp_line (start 1.6 0.8) (end 1.6 -0.8) (layer B.Fab) (width 0.1))
    (fp_line (start -1.6 0.8) (end 1.6 0.8) (layer B.Fab) (width 0.1))
    (fp_line (start 1 1.02) (end -1 1.02) (layer B.SilkS) (width 0.12))
    (fp_line (start -1 -1.02) (end 1 -1.02) (layer B.SilkS) (width 0.12))
    (fp_line (start -3.25 1.05) (end 3.25 1.05) (layer B.CrtYd) (width 0.05))
    (fp_line (start -3.25 1.05) (end -3.25 -1.05) (layer B.CrtYd) (width 0.05))
    (fp_line (start 3.25 -1.05) (end 3.25 1.05) (layer B.CrtYd) (width 0.05))
    (fp_line (start 3.25 -1.05) (end -3.25 -1.05) (layer B.CrtYd) (width 0.05))
    (pad 1 smd rect (at -2 0) (size 2 1.6) (layers B.Cu B.Paste B.Mask)
      (net 2 +3.3VP))
    (pad 2 smd rect (at 2 0) (size 2 1.6) (layers B.Cu B.Paste B.Mask)
      (net 1 GND))
    (model Capacitors_SMD.3dshapes/C_1206.wrl
      (at (xyz 0 0 0))
      (scale (xyz 1 1 1))
      (rotate (xyz 0 0 0))
    )
  )

  (module Resistors_SMD:R_0805_HandSoldering (layer B.Cu) (tedit 58E0A804) (tstamp 5B6B59DE)
    (at 98.38944 112.99952 180)
    (descr "Resistor SMD 0805, hand soldering")
    (tags "resistor 0805")
    (path /5B5B4E91/5B6559C4)
    (attr smd)
    (fp_text reference R8 (at 0 1.7 180) (layer B.SilkS)
      (effects (font (size 1 1) (thickness 0.15)) (justify mirror))
    )
    (fp_text value R (at 0 -1.75 180) (layer B.Fab)
      (effects (font (size 1 1) (thickness 0.15)) (justify mirror))
    )
    (fp_text user %R (at 0 0 180) (layer B.Fab)
      (effects (font (size 0.5 0.5) (thickness 0.075)) (justify mirror))
    )
    (fp_line (start -1 -0.62) (end -1 0.62) (layer B.Fab) (width 0.1))
    (fp_line (start 1 -0.62) (end -1 -0.62) (layer B.Fab) (width 0.1))
    (fp_line (start 1 0.62) (end 1 -0.62) (layer B.Fab) (width 0.1))
    (fp_line (start -1 0.62) (end 1 0.62) (layer B.Fab) (width 0.1))
    (fp_line (start 0.6 -0.88) (end -0.6 -0.88) (layer B.SilkS) (width 0.12))
    (fp_line (start -0.6 0.88) (end 0.6 0.88) (layer B.SilkS) (width 0.12))
    (fp_line (start -2.35 0.9) (end 2.35 0.9) (layer B.CrtYd) (width 0.05))
    (fp_line (start -2.35 0.9) (end -2.35 -0.9) (layer B.CrtYd) (width 0.05))
    (fp_line (start 2.35 -0.9) (end 2.35 0.9) (layer B.CrtYd) (width 0.05))
    (fp_line (start 2.35 -0.9) (end -2.35 -0.9) (layer B.CrtYd) (width 0.05))
    (pad 1 smd rect (at -1.35 0 180) (size 1.5 1.3) (layers B.Cu B.Paste B.Mask)
      (net 2 +3.3VP))
    (pad 2 smd rect (at 1.35 0 180) (size 1.5 1.3) (layers B.Cu B.Paste B.Mask)
      (net 18 "Net-(R8-Pad2)"))
    (model ${KISYS3DMOD}/Resistors_SMD.3dshapes/R_0805.wrl
      (at (xyz 0 0 0))
      (scale (xyz 1 1 1))
      (rotate (xyz 0 0 0))
    )
  )

  (module Resistors_SMD:R_0805_HandSoldering (layer B.Cu) (tedit 58E0A804) (tstamp 5B6B59EE)
    (at 98.38944 110.98784)
    (descr "Resistor SMD 0805, hand soldering")
    (tags "resistor 0805")
    (path /5B5B4E91/5B655A58)
    (attr smd)
    (fp_text reference R9 (at 0 1.7) (layer B.SilkS)
      (effects (font (size 1 1) (thickness 0.15)) (justify mirror))
    )
    (fp_text value R (at 0 -1.75) (layer B.Fab)
      (effects (font (size 1 1) (thickness 0.15)) (justify mirror))
    )
    (fp_text user %R (at 0 0) (layer B.Fab)
      (effects (font (size 0.5 0.5) (thickness 0.075)) (justify mirror))
    )
    (fp_line (start -1 -0.62) (end -1 0.62) (layer B.Fab) (width 0.1))
    (fp_line (start 1 -0.62) (end -1 -0.62) (layer B.Fab) (width 0.1))
    (fp_line (start 1 0.62) (end 1 -0.62) (layer B.Fab) (width 0.1))
    (fp_line (start -1 0.62) (end 1 0.62) (layer B.Fab) (width 0.1))
    (fp_line (start 0.6 -0.88) (end -0.6 -0.88) (layer B.SilkS) (width 0.12))
    (fp_line (start -0.6 0.88) (end 0.6 0.88) (layer B.SilkS) (width 0.12))
    (fp_line (start -2.35 0.9) (end 2.35 0.9) (layer B.CrtYd) (width 0.05))
    (fp_line (start -2.35 0.9) (end -2.35 -0.9) (layer B.CrtYd) (width 0.05))
    (fp_line (start 2.35 -0.9) (end 2.35 0.9) (layer B.CrtYd) (width 0.05))
    (fp_line (start 2.35 -0.9) (end -2.35 -0.9) (layer B.CrtYd) (width 0.05))
    (pad 1 smd rect (at -1.35 0) (size 1.5 1.3) (layers B.Cu B.Paste B.Mask)
      (net 18 "Net-(R8-Pad2)"))
    (pad 2 smd rect (at 1.35 0) (size 1.5 1.3) (layers B.Cu B.Paste B.Mask)
      (net 1 GND))
    (model ${KISYS3DMOD}/Resistors_SMD.3dshapes/R_0805.wrl
      (at (xyz 0 0 0))
      (scale (xyz 1 1 1))
      (rotate (xyz 0 0 0))
    )
  )

  (module Resistors_SMD:R_0805_HandSoldering (layer B.Cu) (tedit 58E0A804) (tstamp 5B6B59FE)
    (at 90.16292 111.01652)
    (descr "Resistor SMD 0805, hand soldering")
    (tags "resistor 0805")
    (path /5B5B4E88/5B5B5832)
    (attr smd)
    (fp_text reference R2 (at 0 1.7) (layer B.SilkS)
      (effects (font (size 1 1) (thickness 0.15)) (justify mirror))
    )
    (fp_text value R (at 0 -1.75) (layer B.Fab)
      (effects (font (size 1 1) (thickness 0.15)) (justify mirror))
    )
    (fp_text user %R (at 0 0) (layer B.Fab)
      (effects (font (size 0.5 0.5) (thickness 0.075)) (justify mirror))
    )
    (fp_line (start -1 -0.62) (end -1 0.62) (layer B.Fab) (width 0.1))
    (fp_line (start 1 -0.62) (end -1 -0.62) (layer B.Fab) (width 0.1))
    (fp_line (start 1 0.62) (end 1 -0.62) (layer B.Fab) (width 0.1))
    (fp_line (start -1 0.62) (end 1 0.62) (layer B.Fab) (width 0.1))
    (fp_line (start 0.6 -0.88) (end -0.6 -0.88) (layer B.SilkS) (width 0.12))
    (fp_line (start -0.6 0.88) (end 0.6 0.88) (layer B.SilkS) (width 0.12))
    (fp_line (start -2.35 0.9) (end 2.35 0.9) (layer B.CrtYd) (width 0.05))
    (fp_line (start -2.35 0.9) (end -2.35 -0.9) (layer B.CrtYd) (width 0.05))
    (fp_line (start 2.35 -0.9) (end 2.35 0.9) (layer B.CrtYd) (width 0.05))
    (fp_line (start 2.35 -0.9) (end -2.35 -0.9) (layer B.CrtYd) (width 0.05))
    (pad 1 smd rect (at -1.35 0) (size 1.5 1.3) (layers B.Cu B.Paste B.Mask)
      (net 2 +3.3VP))
    (pad 2 smd rect (at 1.35 0) (size 1.5 1.3) (layers B.Cu B.Paste B.Mask)
      (net 10 "/CPU PIC18lF26f20/VPP"))
    (model ${KISYS3DMOD}/Resistors_SMD.3dshapes/R_0805.wrl
      (at (xyz 0 0 0))
      (scale (xyz 1 1 1))
      (rotate (xyz 0 0 0))
    )
  )

  (module Resistors_SMD:R_0805_HandSoldering (layer B.Cu) (tedit 58E0A804) (tstamp 5B6B5A0E)
    (at 96.46292 90.91652 270)
    (descr "Resistor SMD 0805, hand soldering")
    (tags "resistor 0805")
    (path /5B5B4E88/5B5B5838)
    (attr smd)
    (fp_text reference R5 (at 0 1.7 270) (layer B.SilkS)
      (effects (font (size 1 1) (thickness 0.15)) (justify mirror))
    )
    (fp_text value R (at 0 -1.75 270) (layer B.Fab)
      (effects (font (size 1 1) (thickness 0.15)) (justify mirror))
    )
    (fp_text user %R (at 0 0 270) (layer B.Fab)
      (effects (font (size 0.5 0.5) (thickness 0.075)) (justify mirror))
    )
    (fp_line (start -1 -0.62) (end -1 0.62) (layer B.Fab) (width 0.1))
    (fp_line (start 1 -0.62) (end -1 -0.62) (layer B.Fab) (width 0.1))
    (fp_line (start 1 0.62) (end 1 -0.62) (layer B.Fab) (width 0.1))
    (fp_line (start -1 0.62) (end 1 0.62) (layer B.Fab) (width 0.1))
    (fp_line (start 0.6 -0.88) (end -0.6 -0.88) (layer B.SilkS) (width 0.12))
    (fp_line (start -0.6 0.88) (end 0.6 0.88) (layer B.SilkS) (width 0.12))
    (fp_line (start -2.35 0.9) (end 2.35 0.9) (layer B.CrtYd) (width 0.05))
    (fp_line (start -2.35 0.9) (end -2.35 -0.9) (layer B.CrtYd) (width 0.05))
    (fp_line (start 2.35 -0.9) (end 2.35 0.9) (layer B.CrtYd) (width 0.05))
    (fp_line (start 2.35 -0.9) (end -2.35 -0.9) (layer B.CrtYd) (width 0.05))
    (pad 1 smd rect (at -1.35 0 270) (size 1.5 1.3) (layers B.Cu B.Paste B.Mask)
      (net 16 "/CPU PIC18lF26f20/SCK"))
    (pad 2 smd rect (at 1.35 0 270) (size 1.5 1.3) (layers B.Cu B.Paste B.Mask)
      (net 2 +3.3VP))
    (model ${KISYS3DMOD}/Resistors_SMD.3dshapes/R_0805.wrl
      (at (xyz 0 0 0))
      (scale (xyz 1 1 1))
      (rotate (xyz 0 0 0))
    )
  )

  (module Resistors_SMD:R_0805_HandSoldering (layer B.Cu) (tedit 58E0A804) (tstamp 5B6B5A1E)
    (at 111.66292 92.61652)
    (descr "Resistor SMD 0805, hand soldering")
    (tags "resistor 0805")
    (path /5B5B4E88/5B5B5839)
    (attr smd)
    (fp_text reference R6 (at 0 1.7) (layer B.SilkS)
      (effects (font (size 1 1) (thickness 0.15)) (justify mirror))
    )
    (fp_text value R (at 0 -1.75) (layer B.Fab)
      (effects (font (size 1 1) (thickness 0.15)) (justify mirror))
    )
    (fp_text user %R (at 0 0) (layer B.Fab)
      (effects (font (size 0.5 0.5) (thickness 0.075)) (justify mirror))
    )
    (fp_line (start -1 -0.62) (end -1 0.62) (layer B.Fab) (width 0.1))
    (fp_line (start 1 -0.62) (end -1 -0.62) (layer B.Fab) (width 0.1))
    (fp_line (start 1 0.62) (end 1 -0.62) (layer B.Fab) (width 0.1))
    (fp_line (start -1 0.62) (end 1 0.62) (layer B.Fab) (width 0.1))
    (fp_line (start 0.6 -0.88) (end -0.6 -0.88) (layer B.SilkS) (width 0.12))
    (fp_line (start -0.6 0.88) (end 0.6 0.88) (layer B.SilkS) (width 0.12))
    (fp_line (start -2.35 0.9) (end 2.35 0.9) (layer B.CrtYd) (width 0.05))
    (fp_line (start -2.35 0.9) (end -2.35 -0.9) (layer B.CrtYd) (width 0.05))
    (fp_line (start 2.35 -0.9) (end 2.35 0.9) (layer B.CrtYd) (width 0.05))
    (fp_line (start 2.35 -0.9) (end -2.35 -0.9) (layer B.CrtYd) (width 0.05))
    (pad 1 smd rect (at -1.35 0) (size 1.5 1.3) (layers B.Cu B.Paste B.Mask)
      (net 2 +3.3VP))
    (pad 2 smd rect (at 1.35 0) (size 1.5 1.3) (layers B.Cu B.Paste B.Mask)
      (net 4 /Puertos_IO/SDI))
    (model ${KISYS3DMOD}/Resistors_SMD.3dshapes/R_0805.wrl
      (at (xyz 0 0 0))
      (scale (xyz 1 1 1))
      (rotate (xyz 0 0 0))
    )
  )

  (module Resistors_SMD:R_0805_HandSoldering (layer B.Cu) (tedit 58E0A804) (tstamp 5B6B5A2E)
    (at 93.96292 90.91652 90)
    (descr "Resistor SMD 0805, hand soldering")
    (tags "resistor 0805")
    (path /5B5B4E88/5B5B583A)
    (attr smd)
    (fp_text reference R3 (at 0 1.7 90) (layer B.SilkS)
      (effects (font (size 1 1) (thickness 0.15)) (justify mirror))
    )
    (fp_text value R (at 0 -1.75 90) (layer B.Fab)
      (effects (font (size 1 1) (thickness 0.15)) (justify mirror))
    )
    (fp_text user %R (at 0 0 90) (layer B.Fab)
      (effects (font (size 0.5 0.5) (thickness 0.075)) (justify mirror))
    )
    (fp_line (start -1 -0.62) (end -1 0.62) (layer B.Fab) (width 0.1))
    (fp_line (start 1 -0.62) (end -1 -0.62) (layer B.Fab) (width 0.1))
    (fp_line (start 1 0.62) (end 1 -0.62) (layer B.Fab) (width 0.1))
    (fp_line (start -1 0.62) (end 1 0.62) (layer B.Fab) (width 0.1))
    (fp_line (start 0.6 -0.88) (end -0.6 -0.88) (layer B.SilkS) (width 0.12))
    (fp_line (start -0.6 0.88) (end 0.6 0.88) (layer B.SilkS) (width 0.12))
    (fp_line (start -2.35 0.9) (end 2.35 0.9) (layer B.CrtYd) (width 0.05))
    (fp_line (start -2.35 0.9) (end -2.35 -0.9) (layer B.CrtYd) (width 0.05))
    (fp_line (start 2.35 -0.9) (end 2.35 0.9) (layer B.CrtYd) (width 0.05))
    (fp_line (start 2.35 -0.9) (end -2.35 -0.9) (layer B.CrtYd) (width 0.05))
    (pad 1 smd rect (at -1.35 0 90) (size 1.5 1.3) (layers B.Cu B.Paste B.Mask)
      (net 2 +3.3VP))
    (pad 2 smd rect (at 1.35 0 90) (size 1.5 1.3) (layers B.Cu B.Paste B.Mask)
      (net 17 "/CPU PIC18lF26f20/SDI"))
    (model ${KISYS3DMOD}/Resistors_SMD.3dshapes/R_0805.wrl
      (at (xyz 0 0 0))
      (scale (xyz 1 1 1))
      (rotate (xyz 0 0 0))
    )
  )

  (module Resistors_SMD:R_0805_HandSoldering (layer B.Cu) (tedit 58E0A804) (tstamp 5B6C7BA1)
    (at 103.9368 113.01984)
    (descr "Resistor SMD 0805, hand soldering")
    (tags "resistor 0805")
    (path /5B5B4E91/5B6C7F68)
    (attr smd)
    (fp_text reference R7 (at 0 1.7) (layer B.SilkS)
      (effects (font (size 1 1) (thickness 0.15)) (justify mirror))
    )
    (fp_text value R (at 0 -1.75) (layer B.Fab)
      (effects (font (size 1 1) (thickness 0.15)) (justify mirror))
    )
    (fp_text user %R (at 0 0) (layer B.Fab)
      (effects (font (size 0.5 0.5) (thickness 0.075)) (justify mirror))
    )
    (fp_line (start -1 -0.62) (end -1 0.62) (layer B.Fab) (width 0.1))
    (fp_line (start 1 -0.62) (end -1 -0.62) (layer B.Fab) (width 0.1))
    (fp_line (start 1 0.62) (end 1 -0.62) (layer B.Fab) (width 0.1))
    (fp_line (start -1 0.62) (end 1 0.62) (layer B.Fab) (width 0.1))
    (fp_line (start 0.6 -0.88) (end -0.6 -0.88) (layer B.SilkS) (width 0.12))
    (fp_line (start -0.6 0.88) (end 0.6 0.88) (layer B.SilkS) (width 0.12))
    (fp_line (start -2.35 0.9) (end 2.35 0.9) (layer B.CrtYd) (width 0.05))
    (fp_line (start -2.35 0.9) (end -2.35 -0.9) (layer B.CrtYd) (width 0.05))
    (fp_line (start 2.35 -0.9) (end 2.35 0.9) (layer B.CrtYd) (width 0.05))
    (fp_line (start 2.35 -0.9) (end -2.35 -0.9) (layer B.CrtYd) (width 0.05))
    (pad 1 smd rect (at -1.35 0) (size 1.5 1.3) (layers B.Cu B.Paste B.Mask)
      (net 1 GND))
    (pad 2 smd rect (at 1.35 0) (size 1.5 1.3) (layers B.Cu B.Paste B.Mask)
      (net 1 GND))
    (model ${KISYS3DMOD}/Resistors_SMD.3dshapes/R_0805.wrl
      (at (xyz 0 0 0))
      (scale (xyz 1 1 1))
      (rotate (xyz 0 0 0))
    )
  )

  (module Resistors_SMD:R_0805_HandSoldering (layer B.Cu) (tedit 58E0A804) (tstamp 5B6CA60E)
    (at 115.61572 106.89844 180)
    (descr "Resistor SMD 0805, hand soldering")
    (tags "resistor 0805")
    (path /5B5B4E88/5B6CBF5C)
    (attr smd)
    (fp_text reference R4 (at 0 1.7 180) (layer B.SilkS)
      (effects (font (size 1 1) (thickness 0.15)) (justify mirror))
    )
    (fp_text value R (at 0 -1.75 180) (layer B.Fab)
      (effects (font (size 1 1) (thickness 0.15)) (justify mirror))
    )
    (fp_text user %R (at 0 0 180) (layer B.Fab)
      (effects (font (size 0.5 0.5) (thickness 0.075)) (justify mirror))
    )
    (fp_line (start -1 -0.62) (end -1 0.62) (layer B.Fab) (width 0.1))
    (fp_line (start 1 -0.62) (end -1 -0.62) (layer B.Fab) (width 0.1))
    (fp_line (start 1 0.62) (end 1 -0.62) (layer B.Fab) (width 0.1))
    (fp_line (start -1 0.62) (end 1 0.62) (layer B.Fab) (width 0.1))
    (fp_line (start 0.6 -0.88) (end -0.6 -0.88) (layer B.SilkS) (width 0.12))
    (fp_line (start -0.6 0.88) (end 0.6 0.88) (layer B.SilkS) (width 0.12))
    (fp_line (start -2.35 0.9) (end 2.35 0.9) (layer B.CrtYd) (width 0.05))
    (fp_line (start -2.35 0.9) (end -2.35 -0.9) (layer B.CrtYd) (width 0.05))
    (fp_line (start 2.35 -0.9) (end 2.35 0.9) (layer B.CrtYd) (width 0.05))
    (fp_line (start 2.35 -0.9) (end -2.35 -0.9) (layer B.CrtYd) (width 0.05))
    (pad 1 smd rect (at -1.35 0 180) (size 1.5 1.3) (layers B.Cu B.Paste B.Mask)
      (net 8 "/CPU PIC18lF26f20/PulMed"))
    (pad 2 smd rect (at 1.35 0 180) (size 1.5 1.3) (layers B.Cu B.Paste B.Mask)
      (net 9 "/CPU PIC18lF26f20/En_Hall"))
    (model ${KISYS3DMOD}/Resistors_SMD.3dshapes/R_0805.wrl
      (at (xyz 0 0 0))
      (scale (xyz 1 1 1))
      (rotate (xyz 0 0 0))
    )
  )

  (module Resistors_SMD:R_0805_HandSoldering (layer B.Cu) (tedit 58E0A804) (tstamp 5D25B32F)
    (at 111.5568 117.61724)
    (descr "Resistor SMD 0805, hand soldering")
    (tags "resistor 0805")
    (path /5B5B4E91/5B6CEE58)
    (attr smd)
    (fp_text reference R10 (at 0 1.7) (layer B.SilkS)
      (effects (font (size 1 1) (thickness 0.15)) (justify mirror))
    )
    (fp_text value R (at 0 -1.75) (layer B.Fab)
      (effects (font (size 1 1) (thickness 0.15)) (justify mirror))
    )
    (fp_text user %R (at 0 0) (layer B.Fab)
      (effects (font (size 0.5 0.5) (thickness 0.075)) (justify mirror))
    )
    (fp_line (start -1 -0.62) (end -1 0.62) (layer B.Fab) (width 0.1))
    (fp_line (start 1 -0.62) (end -1 -0.62) (layer B.Fab) (width 0.1))
    (fp_line (start 1 0.62) (end 1 -0.62) (layer B.Fab) (width 0.1))
    (fp_line (start -1 0.62) (end 1 0.62) (layer B.Fab) (width 0.1))
    (fp_line (start 0.6 -0.88) (end -0.6 -0.88) (layer B.SilkS) (width 0.12))
    (fp_line (start -0.6 0.88) (end 0.6 0.88) (layer B.SilkS) (width 0.12))
    (fp_line (start -2.35 0.9) (end 2.35 0.9) (layer B.CrtYd) (width 0.05))
    (fp_line (start -2.35 0.9) (end -2.35 -0.9) (layer B.CrtYd) (width 0.05))
    (fp_line (start 2.35 -0.9) (end 2.35 0.9) (layer B.CrtYd) (width 0.05))
    (fp_line (start 2.35 -0.9) (end -2.35 -0.9) (layer B.CrtYd) (width 0.05))
    (pad 1 smd rect (at -1.35 0) (size 1.5 1.3) (layers B.Cu B.Paste B.Mask)
      (net 1 GND))
    (pad 2 smd rect (at 1.35 0) (size 1.5 1.3) (layers B.Cu B.Paste B.Mask)
      (net 1 GND))
    (model ${KISYS3DMOD}/Resistors_SMD.3dshapes/R_0805.wrl
      (at (xyz 0 0 0))
      (scale (xyz 1 1 1))
      (rotate (xyz 0 0 0))
    )
  )

  (module Resistors_SMD:R_0805_HandSoldering (layer B.Cu) (tedit 58E0A804) (tstamp 5B6F079F)
    (at 98.40976 115.0112)
    (descr "Resistor SMD 0805, hand soldering")
    (tags "resistor 0805")
    (path /5B5B4E89/5B6F08F0)
    (attr smd)
    (fp_text reference R1 (at 0 1.7) (layer B.SilkS)
      (effects (font (size 1 1) (thickness 0.15)) (justify mirror))
    )
    (fp_text value R (at 0 -1.75) (layer B.Fab)
      (effects (font (size 1 1) (thickness 0.15)) (justify mirror))
    )
    (fp_text user %R (at 0 0) (layer B.Fab)
      (effects (font (size 0.5 0.5) (thickness 0.075)) (justify mirror))
    )
    (fp_line (start -1 -0.62) (end -1 0.62) (layer B.Fab) (width 0.1))
    (fp_line (start 1 -0.62) (end -1 -0.62) (layer B.Fab) (width 0.1))
    (fp_line (start 1 0.62) (end 1 -0.62) (layer B.Fab) (width 0.1))
    (fp_line (start -1 0.62) (end 1 0.62) (layer B.Fab) (width 0.1))
    (fp_line (start 0.6 -0.88) (end -0.6 -0.88) (layer B.SilkS) (width 0.12))
    (fp_line (start -0.6 0.88) (end 0.6 0.88) (layer B.SilkS) (width 0.12))
    (fp_line (start -2.35 0.9) (end 2.35 0.9) (layer B.CrtYd) (width 0.05))
    (fp_line (start -2.35 0.9) (end -2.35 -0.9) (layer B.CrtYd) (width 0.05))
    (fp_line (start 2.35 -0.9) (end 2.35 0.9) (layer B.CrtYd) (width 0.05))
    (fp_line (start 2.35 -0.9) (end -2.35 -0.9) (layer B.CrtYd) (width 0.05))
    (pad 1 smd rect (at -1.35 0) (size 1.5 1.3) (layers B.Cu B.Paste B.Mask)
      (net 2 +3.3VP))
    (pad 2 smd rect (at 1.35 0) (size 1.5 1.3) (layers B.Cu B.Paste B.Mask)
      (net 2 +3.3VP))
    (model ${KISYS3DMOD}/Resistors_SMD.3dshapes/R_0805.wrl
      (at (xyz 0 0 0))
      (scale (xyz 1 1 1))
      (rotate (xyz 0 0 0))
    )
  )

  (module Inductors_SMD:L_1812_HandSoldering (layer B.Cu) (tedit 58307D36) (tstamp 5C0BD034)
    (at 94.99092 127.09652 180)
    (descr "Resistor SMD 1812, hand soldering, Panasonic (see ERJ12)")
    (tags "resistor 1812")
    (path /5B5B4E91/5B656F85)
    (attr smd)
    (fp_text reference L1 (at 0 3.17 180) (layer B.SilkS)
      (effects (font (size 1 1) (thickness 0.15)) (justify mirror))
    )
    (fp_text value L (at 0 -3.17 180) (layer B.Fab)
      (effects (font (size 1 1) (thickness 0.15)) (justify mirror))
    )
    (fp_text user %R (at 0 0 180) (layer B.Fab)
      (effects (font (size 1 1) (thickness 0.15)) (justify mirror))
    )
    (fp_line (start -2.25 -1.6) (end -2.25 1.6) (layer B.Fab) (width 0.1))
    (fp_line (start 2.25 -1.6) (end -2.25 -1.6) (layer B.Fab) (width 0.1))
    (fp_line (start 2.25 1.6) (end 2.25 -1.6) (layer B.Fab) (width 0.1))
    (fp_line (start -2.25 1.6) (end 2.25 1.6) (layer B.Fab) (width 0.1))
    (fp_line (start -5.44 2.24) (end 5.44 2.24) (layer B.CrtYd) (width 0.05))
    (fp_line (start 5.44 2.24) (end 5.44 -2.24) (layer B.CrtYd) (width 0.05))
    (fp_line (start 5.44 -2.24) (end -5.44 -2.24) (layer B.CrtYd) (width 0.05))
    (fp_line (start -5.44 -2.24) (end -5.44 2.24) (layer B.CrtYd) (width 0.05))
    (fp_line (start -1.73 -1.88) (end 1.73 -1.88) (layer B.SilkS) (width 0.12))
    (fp_line (start -1.73 1.88) (end 1.73 1.88) (layer B.SilkS) (width 0.12))
    (pad 1 smd rect (at -3.4 0 180) (size 3.5 3.5) (layers B.Cu B.Paste B.Mask)
      (net 7 /Fuente/Vccbat))
    (pad 2 smd rect (at 3.4 0 180) (size 3.5 3.5) (layers B.Cu B.Paste B.Mask)
      (net 5 "Net-(L1-Pad2)"))
    (model ${KISYS3DMOD}/Inductors_SMD.3dshapes/L_1812.wrl
      (at (xyz 0 0 0))
      (scale (xyz 1 1 1))
      (rotate (xyz 0 0 0))
    )
  )

  (module Capacitor_SMD:C_1206_3216Metric_Pad1.42x1.75mm_HandSolder (layer B.Cu) (tedit 5B301BBE) (tstamp 5D262321)
    (at 39.807921 92.631521)
    (descr "Capacitor SMD 1206 (3216 Metric), square (rectangular) end terminal, IPC_7351 nominal with elongated pad for handsoldering. (Body size source: http://www.tortai-tech.com/upload/download/2011102023233369053.pdf), generated with kicad-footprint-generator")
    (tags "capacitor handsolder")
    (path /5B5B4E91/5D268944)
    (attr smd)
    (fp_text reference C5 (at 0 1.82) (layer B.SilkS)
      (effects (font (size 1 1) (thickness 0.15)) (justify mirror))
    )
    (fp_text value C (at 0 -1.82) (layer B.Fab)
      (effects (font (size 1 1) (thickness 0.15)) (justify mirror))
    )
    (fp_line (start -1.6 -0.8) (end -1.6 0.8) (layer B.Fab) (width 0.1))
    (fp_line (start -1.6 0.8) (end 1.6 0.8) (layer B.Fab) (width 0.1))
    (fp_line (start 1.6 0.8) (end 1.6 -0.8) (layer B.Fab) (width 0.1))
    (fp_line (start 1.6 -0.8) (end -1.6 -0.8) (layer B.Fab) (width 0.1))
    (fp_line (start -0.602064 0.91) (end 0.602064 0.91) (layer B.SilkS) (width 0.12))
    (fp_line (start -0.602064 -0.91) (end 0.602064 -0.91) (layer B.SilkS) (width 0.12))
    (fp_line (start -2.45 -1.12) (end -2.45 1.12) (layer B.CrtYd) (width 0.05))
    (fp_line (start -2.45 1.12) (end 2.45 1.12) (layer B.CrtYd) (width 0.05))
    (fp_line (start 2.45 1.12) (end 2.45 -1.12) (layer B.CrtYd) (width 0.05))
    (fp_line (start 2.45 -1.12) (end -2.45 -1.12) (layer B.CrtYd) (width 0.05))
    (fp_text user %R (at 0 0) (layer B.Fab)
      (effects (font (size 0.8 0.8) (thickness 0.12)) (justify mirror))
    )
    (pad 1 smd roundrect (at -1.4875 0) (size 1.425 1.75) (layers B.Cu B.Paste B.Mask) (roundrect_rratio 0.175439)
      (net 20 /Fuente/2.5V))
    (pad 2 smd roundrect (at 1.4875 0) (size 1.425 1.75) (layers B.Cu B.Paste B.Mask) (roundrect_rratio 0.175439)
      (net 1 GND))
    (model ${KISYS3DMOD}/Capacitor_SMD.3dshapes/C_1206_3216Metric.wrl
      (at (xyz 0 0 0))
      (scale (xyz 1 1 1))
      (rotate (xyz 0 0 0))
    )
  )

  (module Button_Switch_SMD:SW_SPST_B3U-1000P locked (layer B.Cu) (tedit 5A02FC95) (tstamp 5D262337)
    (at 99.13292 112.49152)
    (descr "Ultra-small-sized Tactile Switch with High Contact Reliability, Top-actuated Model, without Ground Terminal, without Boss")
    (tags "Tactile Switch")
    (path /5D2AF2A1)
    (attr smd)
    (fp_text reference SW1 (at 0 2.5) (layer B.SilkS)
      (effects (font (size 1 1) (thickness 0.15)) (justify mirror))
    )
    (fp_text value SW_Push (at 0 -2.5) (layer B.Fab)
      (effects (font (size 1 1) (thickness 0.15)) (justify mirror))
    )
    (fp_text user %R (at 0 2.5) (layer B.Fab)
      (effects (font (size 1 1) (thickness 0.15)) (justify mirror))
    )
    (fp_line (start -2.4 -1.65) (end 2.4 -1.65) (layer B.CrtYd) (width 0.05))
    (fp_line (start 2.4 -1.65) (end 2.4 1.65) (layer B.CrtYd) (width 0.05))
    (fp_line (start 2.4 1.65) (end -2.4 1.65) (layer B.CrtYd) (width 0.05))
    (fp_line (start -2.4 1.65) (end -2.4 -1.65) (layer B.CrtYd) (width 0.05))
    (fp_line (start -1.65 -1.1) (end -1.65 -1.4) (layer B.SilkS) (width 0.12))
    (fp_line (start -1.65 -1.4) (end 1.65 -1.4) (layer B.SilkS) (width 0.12))
    (fp_line (start 1.65 -1.4) (end 1.65 -1.1) (layer B.SilkS) (width 0.12))
    (fp_line (start -1.65 1.1) (end -1.65 1.4) (layer B.SilkS) (width 0.12))
    (fp_line (start -1.65 1.4) (end 1.65 1.4) (layer B.SilkS) (width 0.12))
    (fp_line (start 1.65 1.4) (end 1.65 1.1) (layer B.SilkS) (width 0.12))
    (fp_line (start -1.5 1.25) (end 1.5 1.25) (layer B.Fab) (width 0.1))
    (fp_line (start 1.5 1.25) (end 1.5 -1.25) (layer B.Fab) (width 0.1))
    (fp_line (start 1.5 -1.25) (end -1.5 -1.25) (layer B.Fab) (width 0.1))
    (fp_line (start -1.5 -1.25) (end -1.5 1.25) (layer B.Fab) (width 0.1))
    (fp_circle (center 0 0) (end 0.75 0) (layer B.Fab) (width 0.1))
    (pad 1 smd rect (at -1.7 0) (size 0.9 1.7) (layers B.Cu B.Paste B.Mask)
      (net 6 "/CPU PIC18lF26f20/Vbat"))
    (pad 2 smd rect (at 1.7 0) (size 0.9 1.7) (layers B.Cu B.Paste B.Mask)
      (net 7 /Fuente/Vccbat))
    (model ${KISYS3DMOD}/Button_Switch_SMD.3dshapes/SW_SPST_B3U-1000P.wrl
      (at (xyz 0 0 0))
      (scale (xyz 1 1 1))
      (rotate (xyz 0 0 0))
    )
  )

  (module Package_TO_SOT_SMD:SOT-23-6 (layer B.Cu) (tedit 5A02FF57) (tstamp 5D262380)
    (at 79.24292 119.47652)
    (descr "6-pin SOT-23 package")
    (tags SOT-23-6)
    (path /5B5B4E91/5B6B35D6)
    (attr smd)
    (fp_text reference U2 (at 0 2.9) (layer B.SilkS)
      (effects (font (size 1 1) (thickness 0.15)) (justify mirror))
    )
    (fp_text value MCP1640 (at 0 -2.9) (layer B.Fab)
      (effects (font (size 1 1) (thickness 0.15)) (justify mirror))
    )
    (fp_text user %R (at 0 0 -90) (layer B.Fab)
      (effects (font (size 0.5 0.5) (thickness 0.075)) (justify mirror))
    )
    (fp_line (start -0.9 -1.61) (end 0.9 -1.61) (layer B.SilkS) (width 0.12))
    (fp_line (start 0.9 1.61) (end -1.55 1.61) (layer B.SilkS) (width 0.12))
    (fp_line (start 1.9 1.8) (end -1.9 1.8) (layer B.CrtYd) (width 0.05))
    (fp_line (start 1.9 -1.8) (end 1.9 1.8) (layer B.CrtYd) (width 0.05))
    (fp_line (start -1.9 -1.8) (end 1.9 -1.8) (layer B.CrtYd) (width 0.05))
    (fp_line (start -1.9 1.8) (end -1.9 -1.8) (layer B.CrtYd) (width 0.05))
    (fp_line (start -0.9 0.9) (end -0.25 1.55) (layer B.Fab) (width 0.1))
    (fp_line (start 0.9 1.55) (end -0.25 1.55) (layer B.Fab) (width 0.1))
    (fp_line (start -0.9 0.9) (end -0.9 -1.55) (layer B.Fab) (width 0.1))
    (fp_line (start 0.9 -1.55) (end -0.9 -1.55) (layer B.Fab) (width 0.1))
    (fp_line (start 0.9 1.55) (end 0.9 -1.55) (layer B.Fab) (width 0.1))
    (pad 1 smd rect (at -1.1 0.95) (size 1.06 0.65) (layers B.Cu B.Paste B.Mask)
      (net 5 "Net-(L1-Pad2)"))
    (pad 2 smd rect (at -1.1 0) (size 1.06 0.65) (layers B.Cu B.Paste B.Mask)
      (net 1 GND))
    (pad 3 smd rect (at -1.1 -0.95) (size 1.06 0.65) (layers B.Cu B.Paste B.Mask)
      (net 19 "/CPU PIC18lF26f20/AN1"))
    (pad 4 smd rect (at 1.1 -0.95) (size 1.06 0.65) (layers B.Cu B.Paste B.Mask)
      (net 18 "Net-(R8-Pad2)"))
    (pad 6 smd rect (at 1.1 0.95) (size 1.06 0.65) (layers B.Cu B.Paste B.Mask)
      (net 7 /Fuente/Vccbat))
    (pad 5 smd rect (at 1.1 0) (size 1.06 0.65) (layers B.Cu B.Paste B.Mask)
      (net 2 +3.3VP))
    (model ${KISYS3DMOD}/Package_TO_SOT_SMD.3dshapes/SOT-23-6.wrl
      (at (xyz 0 0 0))
      (scale (xyz 1 1 1))
      (rotate (xyz 0 0 0))
    )
  )

  (module Package_TO_SOT_SMD:SOT-23 (layer B.Cu) (tedit 5A02FF57) (tstamp 5D262395)
    (at 39.057921 96.551521)
    (descr "SOT-23, Standard")
    (tags SOT-23)
    (path /5B5B4E91/5D25E68C)
    (attr smd)
    (fp_text reference U3 (at 0 2.5) (layer B.SilkS)
      (effects (font (size 1 1) (thickness 0.15)) (justify mirror))
    )
    (fp_text value MCP1700-2502E_SOT23 (at 0 -2.5) (layer B.Fab)
      (effects (font (size 1 1) (thickness 0.15)) (justify mirror))
    )
    (fp_text user %R (at 0 0 -90) (layer B.Fab)
      (effects (font (size 0.5 0.5) (thickness 0.075)) (justify mirror))
    )
    (fp_line (start -0.7 0.95) (end -0.7 -1.5) (layer B.Fab) (width 0.1))
    (fp_line (start -0.15 1.52) (end 0.7 1.52) (layer B.Fab) (width 0.1))
    (fp_line (start -0.7 0.95) (end -0.15 1.52) (layer B.Fab) (width 0.1))
    (fp_line (start 0.7 1.52) (end 0.7 -1.52) (layer B.Fab) (width 0.1))
    (fp_line (start -0.7 -1.52) (end 0.7 -1.52) (layer B.Fab) (width 0.1))
    (fp_line (start 0.76 -1.58) (end 0.76 -0.65) (layer B.SilkS) (width 0.12))
    (fp_line (start 0.76 1.58) (end 0.76 0.65) (layer B.SilkS) (width 0.12))
    (fp_line (start -1.7 1.75) (end 1.7 1.75) (layer B.CrtYd) (width 0.05))
    (fp_line (start 1.7 1.75) (end 1.7 -1.75) (layer B.CrtYd) (width 0.05))
    (fp_line (start 1.7 -1.75) (end -1.7 -1.75) (layer B.CrtYd) (width 0.05))
    (fp_line (start -1.7 -1.75) (end -1.7 1.75) (layer B.CrtYd) (width 0.05))
    (fp_line (start 0.76 1.58) (end -1.4 1.58) (layer B.SilkS) (width 0.12))
    (fp_line (start 0.76 -1.58) (end -0.7 -1.58) (layer B.SilkS) (width 0.12))
    (pad 1 smd rect (at -1 0.95) (size 0.9 0.8) (layers B.Cu B.Paste B.Mask)
      (net 1 GND))
    (pad 2 smd rect (at -1 -0.95) (size 0.9 0.8) (layers B.Cu B.Paste B.Mask)
      (net 20 /Fuente/2.5V))
    (pad 3 smd rect (at 1 0) (size 0.9 0.8) (layers B.Cu B.Paste B.Mask)
      (net 2 +3.3VP))
    (model ${KISYS3DMOD}/Package_TO_SOT_SMD.3dshapes/SOT-23.wrl
      (at (xyz 0 0 0))
      (scale (xyz 1 1 1))
      (rotate (xyz 0 0 0))
    )
  )

  (module Sensor_Current:Allegro_SIP-3 (layer F.Cu) (tedit 5A04BB4E) (tstamp 5D262385)
    (at 114.16792 104.23652)
    (descr "Allegro Microsystems SIP-3, 1.27mm Pitch (http://www.allegromicro.com/~/media/Files/Datasheets/A1369-Datasheet.ashx)")
    (tags "Allegro SIP-3")
    (path /5D2664C3)
    (fp_text reference U4 (at 1.27 -1.8) (layer F.SilkS)
      (effects (font (size 1 1) (thickness 0.15)))
    )
    (fp_text value A1301KUA-T (at 1.27 1.8) (layer F.Fab)
      (effects (font (size 1 1) (thickness 0.15)))
    )
    (fp_text user %R (at 1.27 0) (layer F.Fab)
      (effects (font (size 0.8 0.8) (thickness 0.1)))
    )
    (fp_line (start 3.57 1.05) (end 3.57 -1.05) (layer F.CrtYd) (width 0.05))
    (fp_line (start -1.03 1.05) (end 3.57 1.05) (layer F.CrtYd) (width 0.05))
    (fp_line (start -1.03 -1.05) (end -1.03 1.05) (layer F.CrtYd) (width 0.05))
    (fp_line (start 3.57 -1.05) (end -1.03 -1.05) (layer F.CrtYd) (width 0.05))
    (fp_line (start -0.775 0) (end 0.015 0.79) (layer F.Fab) (width 0.1))
    (fp_line (start 2.525 0.79) (end 0.015 0.79) (layer F.Fab) (width 0.1))
    (fp_line (start 3.315 0) (end 2.525 0.79) (layer F.Fab) (width 0.1))
    (fp_line (start 3.315 -0.73) (end 3.315 0) (layer F.Fab) (width 0.1))
    (fp_line (start -0.775 -0.73) (end 3.315 -0.73) (layer F.Fab) (width 0.1))
    (fp_line (start -0.775 0) (end -0.775 -0.73) (layer F.Fab) (width 0.1))
    (fp_line (start 2.01 -0.85) (end 1.8 -0.85) (layer F.SilkS) (width 0.12))
    (fp_line (start 2.01 0.91) (end 1.8 0.91) (layer F.SilkS) (width 0.12))
    (fp_line (start 3.435 -0.85) (end 3.435 0) (layer F.SilkS) (width 0.12))
    (fp_line (start -0.895 0) (end -0.895 -0.85) (layer F.SilkS) (width 0.12))
    (fp_line (start 3.435 -0.85) (end 3.07 -0.85) (layer F.SilkS) (width 0.12))
    (pad 1 thru_hole rect (at 0 0) (size 1.1 1.6) (drill 0.8) (layers *.Cu *.Mask)
      (net 9 "/CPU PIC18lF26f20/En_Hall"))
    (pad 2 thru_hole oval (at 1.27 0) (size 1.1 1.6) (drill 0.8) (layers *.Cu *.Mask)
      (net 1 GND))
    (pad 3 thru_hole oval (at 2.54 0) (size 1.1 1.6) (drill 0.8) (layers *.Cu *.Mask)
      (net 8 "/CPU PIC18lF26f20/PulMed"))
    (model ${KISYS3DMOD}/Sensor_Current.3dshapes/Allegro_SIP-3.wrl
      (at (xyz 0 0 0))
      (scale (xyz 1 1 1))
      (rotate (xyz 0 0 0))
    )
  )

  (module Connector_PinHeader_1.27mm:PinHeader_1x03_P1.27mm_Vertical (layer F.Cu) (tedit 59FED6E3) (tstamp 5D263439)
    (at 116.70792 104.23652 270)
    (descr "Through hole straight pin header, 1x03, 1.27mm pitch, single row")
    (tags "Through hole pin header THT 1x03 1.27mm single row")
    (path /5B6CB5F4)
    (fp_text reference J1 (at 0 -1.695 90) (layer F.SilkS)
      (effects (font (size 1 1) (thickness 0.15)))
    )
    (fp_text value Conn_01x03_Male (at 0 4.235 90) (layer F.Fab)
      (effects (font (size 1 1) (thickness 0.15)))
    )
    (fp_line (start -0.525 -0.635) (end 1.05 -0.635) (layer F.Fab) (width 0.1))
    (fp_line (start 1.05 -0.635) (end 1.05 3.175) (layer F.Fab) (width 0.1))
    (fp_line (start 1.05 3.175) (end -1.05 3.175) (layer F.Fab) (width 0.1))
    (fp_line (start -1.05 3.175) (end -1.05 -0.11) (layer F.Fab) (width 0.1))
    (fp_line (start -1.05 -0.11) (end -0.525 -0.635) (layer F.Fab) (width 0.1))
    (fp_line (start -1.11 3.235) (end -0.30753 3.235) (layer F.SilkS) (width 0.12))
    (fp_line (start 0.30753 3.235) (end 1.11 3.235) (layer F.SilkS) (width 0.12))
    (fp_line (start -1.11 0.76) (end -1.11 3.235) (layer F.SilkS) (width 0.12))
    (fp_line (start 1.11 0.76) (end 1.11 3.235) (layer F.SilkS) (width 0.12))
    (fp_line (start -1.11 0.76) (end -0.563471 0.76) (layer F.SilkS) (width 0.12))
    (fp_line (start 0.563471 0.76) (end 1.11 0.76) (layer F.SilkS) (width 0.12))
    (fp_line (start -1.11 0) (end -1.11 -0.76) (layer F.SilkS) (width 0.12))
    (fp_line (start -1.11 -0.76) (end 0 -0.76) (layer F.SilkS) (width 0.12))
    (fp_line (start -1.55 -1.15) (end -1.55 3.7) (layer F.CrtYd) (width 0.05))
    (fp_line (start -1.55 3.7) (end 1.55 3.7) (layer F.CrtYd) (width 0.05))
    (fp_line (start 1.55 3.7) (end 1.55 -1.15) (layer F.CrtYd) (width 0.05))
    (fp_line (start 1.55 -1.15) (end -1.55 -1.15) (layer F.CrtYd) (width 0.05))
    (fp_text user %R (at 0 1.27) (layer F.Fab)
      (effects (font (size 1 1) (thickness 0.15)))
    )
    (pad 1 thru_hole rect (at 0 0 270) (size 1 1) (drill 0.65) (layers *.Cu *.Mask)
      (net 1 GND))
    (pad 2 thru_hole oval (at 0 1.27 270) (size 1 1) (drill 0.65) (layers *.Cu *.Mask)
      (net 8 "/CPU PIC18lF26f20/PulMed"))
    (pad 3 thru_hole oval (at 0 2.54 270) (size 1 1) (drill 0.65) (layers *.Cu *.Mask)
      (net 9 "/CPU PIC18lF26f20/En_Hall"))
    (model ${KISYS3DMOD}/Connector_PinHeader_1.27mm.3dshapes/PinHeader_1x03_P1.27mm_Vertical.wrl
      (at (xyz 0 0 0))
      (scale (xyz 1 1 1))
      (rotate (xyz 0 0 0))
    )
  )

  (module Connector_PinHeader_1.27mm:PinHeader_1x09_P1.27mm_Vertical (layer F.Cu) (tedit 59FED6E3) (tstamp 5D263451)
    (at 124.32792 116.93652)
    (descr "Through hole straight pin header, 1x09, 1.27mm pitch, single row")
    (tags "Through hole pin header THT 1x09 1.27mm single row")
    (path /5B5B4E89/5B5B5662)
    (fp_text reference J3 (at 0 -1.695) (layer F.SilkS)
      (effects (font (size 1 1) (thickness 0.15)))
    )
    (fp_text value Conn_01x09_Female (at 0 11.855) (layer F.Fab)
      (effects (font (size 1 1) (thickness 0.15)))
    )
    (fp_line (start -0.525 -0.635) (end 1.05 -0.635) (layer F.Fab) (width 0.1))
    (fp_line (start 1.05 -0.635) (end 1.05 10.795) (layer F.Fab) (width 0.1))
    (fp_line (start 1.05 10.795) (end -1.05 10.795) (layer F.Fab) (width 0.1))
    (fp_line (start -1.05 10.795) (end -1.05 -0.11) (layer F.Fab) (width 0.1))
    (fp_line (start -1.05 -0.11) (end -0.525 -0.635) (layer F.Fab) (width 0.1))
    (fp_line (start -1.11 10.855) (end -0.30753 10.855) (layer F.SilkS) (width 0.12))
    (fp_line (start 0.30753 10.855) (end 1.11 10.855) (layer F.SilkS) (width 0.12))
    (fp_line (start -1.11 0.76) (end -1.11 10.855) (layer F.SilkS) (width 0.12))
    (fp_line (start 1.11 0.76) (end 1.11 10.855) (layer F.SilkS) (width 0.12))
    (fp_line (start -1.11 0.76) (end -0.563471 0.76) (layer F.SilkS) (width 0.12))
    (fp_line (start 0.563471 0.76) (end 1.11 0.76) (layer F.SilkS) (width 0.12))
    (fp_line (start -1.11 0) (end -1.11 -0.76) (layer F.SilkS) (width 0.12))
    (fp_line (start -1.11 -0.76) (end 0 -0.76) (layer F.SilkS) (width 0.12))
    (fp_line (start -1.55 -1.15) (end -1.55 11.3) (layer F.CrtYd) (width 0.05))
    (fp_line (start -1.55 11.3) (end 1.55 11.3) (layer F.CrtYd) (width 0.05))
    (fp_line (start 1.55 11.3) (end 1.55 -1.15) (layer F.CrtYd) (width 0.05))
    (fp_line (start 1.55 -1.15) (end -1.55 -1.15) (layer F.CrtYd) (width 0.05))
    (fp_text user %R (at 0 5.08 90) (layer F.Fab)
      (effects (font (size 1 1) (thickness 0.15)))
    )
    (pad 1 thru_hole rect (at 0 0) (size 1 1) (drill 0.65) (layers *.Cu *.Mask)
      (net 13 "/CPU PIC18lF26f20/CS"))
    (pad 2 thru_hole oval (at 0 1.27) (size 1 1) (drill 0.65) (layers *.Cu *.Mask)
      (net 14 "/CPU PIC18lF26f20/!Reset"))
    (pad 3 thru_hole oval (at 0 2.54) (size 1 1) (drill 0.65) (layers *.Cu *.Mask)
      (net 15 "/CPU PIC18lF26f20/Wake"))
    (pad 4 thru_hole oval (at 0 3.81) (size 1 1) (drill 0.65) (layers *.Cu *.Mask)
      (net 4 /Puertos_IO/SDI))
    (pad 5 thru_hole oval (at 0 5.08) (size 1 1) (drill 0.65) (layers *.Cu *.Mask)
      (net 1 GND))
    (pad 6 thru_hole oval (at 0 6.35) (size 1 1) (drill 0.65) (layers *.Cu *.Mask)
      (net 2 +3.3VP))
    (pad 7 thru_hole oval (at 0 7.62) (size 1 1) (drill 0.65) (layers *.Cu *.Mask)
      (net 3 /Puertos_IO/INT))
    (pad 8 thru_hole oval (at 0 8.89) (size 1 1) (drill 0.65) (layers *.Cu *.Mask)
      (net 16 "/CPU PIC18lF26f20/SCK"))
    (pad 9 thru_hole oval (at 0 10.16) (size 1 1) (drill 0.65) (layers *.Cu *.Mask)
      (net 17 "/CPU PIC18lF26f20/SDI"))
    (model ${KISYS3DMOD}/Connector_PinHeader_1.27mm.3dshapes/PinHeader_1x09_P1.27mm_Vertical.wrl
      (at (xyz 0 0 0))
      (scale (xyz 1 1 1))
      (rotate (xyz 0 0 0))
    )
  )

  (gr_line (start 95.11792 114.39652) (end 95.11792 96.61652) (angle 90) (layer Edge.Cuts) (width 0.15) (tstamp 5D263B21))
  (dimension 20.32 (width 0.15) (layer Eco1.User)
    (gr_text "20,320 mm" (at 147.21792 122.01652 90) (layer Eco1.User)
      (effects (font (size 1 1) (thickness 0.15)))
    )
    (feature1 (pts (xy 46.22292 111.85652) (xy 146.504341 111.85652)))
    (feature2 (pts (xy 46.22292 132.17652) (xy 146.504341 132.17652)))
    (crossbar (pts (xy 145.91792 132.17652) (xy 145.91792 111.85652)))
    (arrow1a (pts (xy 145.91792 111.85652) (xy 146.504341 112.983024)))
    (arrow1b (pts (xy 145.91792 111.85652) (xy 145.331499 112.983024)))
    (arrow2a (pts (xy 145.91792 132.17652) (xy 146.504341 131.050016)))
    (arrow2b (pts (xy 145.91792 132.17652) (xy 145.331499 131.050016)))
  )
  (dimension 2.54 (width 0.15) (layer F.SilkS)
    (gr_text "2,540 mm" (at 28.47292 48.35652 90) (layer F.SilkS)
      (effects (font (size 1 1) (thickness 0.15)))
    )
    (feature1 (pts (xy 23.36292 47.08652) (xy 27.759341 47.08652)))
    (feature2 (pts (xy 23.36292 49.62652) (xy 27.759341 49.62652)))
    (crossbar (pts (xy 27.17292 49.62652) (xy 27.17292 47.08652)))
    (arrow1a (pts (xy 27.17292 47.08652) (xy 27.759341 48.213024)))
    (arrow1b (pts (xy 27.17292 47.08652) (xy 26.586499 48.213024)))
    (arrow2a (pts (xy 27.17292 49.62652) (xy 27.759341 48.500016)))
    (arrow2b (pts (xy 27.17292 49.62652) (xy 26.586499 48.500016)))
  )
  (dimension 40.64 (width 0.15) (layer Eco2.User)
    (gr_text "40,640 mm" (at -63.02708 67.40652 90) (layer Eco2.User)
      (effects (font (size 1 1) (thickness 0.15)))
    )
    (feature1 (pts (xy -49.02708 47.08652) (xy -62.313501 47.08652)))
    (feature2 (pts (xy -49.02708 87.72652) (xy -62.313501 87.72652)))
    (crossbar (pts (xy -61.72708 87.72652) (xy -61.72708 47.08652)))
    (arrow1a (pts (xy -61.72708 47.08652) (xy -61.140659 48.213024)))
    (arrow1b (pts (xy -61.72708 47.08652) (xy -62.313501 48.213024)))
    (arrow2a (pts (xy -61.72708 87.72652) (xy -61.140659 86.600016)))
    (arrow2b (pts (xy -61.72708 87.72652) (xy -62.313501 86.600016)))
  )
  (dimension 69.85 (width 0.15) (layer Eco2.User) (tstamp 5D25AD28)
    (gr_text "69,850 mm" (at -15.37208 33.08652) (layer Eco2.User) (tstamp 5D25AD28)
      (effects (font (size 1 1) (thickness 0.15)))
    )
    (feature1 (pts (xy 19.55292 53.43652) (xy 19.55292 33.800099)))
    (feature2 (pts (xy -50.29708 53.43652) (xy -50.29708 33.800099)))
    (crossbar (pts (xy -50.29708 34.38652) (xy 19.55292 34.38652)))
    (arrow1a (pts (xy 19.55292 34.38652) (xy 18.426416 34.972941)))
    (arrow1b (pts (xy 19.55292 34.38652) (xy 18.426416 33.800099)))
    (arrow2a (pts (xy -50.29708 34.38652) (xy -49.170576 34.972941)))
    (arrow2b (pts (xy -50.29708 34.38652) (xy -49.170576 33.800099)))
  )
  (gr_line (start 95.11792 96.61652) (end 125.36292 96.61652) (angle 90) (layer Edge.Cuts) (width 0.15))
  (gr_line (start 125.36292 131.71652) (end 125.36292 96.61652) (angle 90) (layer Edge.Cuts) (width 0.15) (tstamp 5D264314))
  (gr_line (start 83.68792 131.71652) (end 83.68792 114.39652) (angle 90) (layer Edge.Cuts) (width 0.15))
  (gr_line (start 83.68792 114.39652) (end 95.11792 114.39652) (angle 90) (layer Edge.Cuts) (width 0.15) (tstamp 5D263698))
  (gr_line (start 83.68792 131.71652) (end 125.36292 131.71652) (angle 90) (layer Edge.Cuts) (width 0.15) (tstamp 5D264306))

  (segment (start 93.94292 107.41652) (end 93.94292 106.74452) (width 0.25) (layer B.Cu) (net 1) (status 30))
  (segment (start 93.94292 106.74452) (end 92.82176 105.62336) (width 0.25) (layer B.Cu) (net 1) (tstamp 5B6F09C4) (status 10))
  (segment (start 90.15984 106.5784) (end 90.15984 113.83264) (width 0.25) (layer B.Cu) (net 1) (tstamp 5B6F09C8))
  (segment (start 91.11488 105.62336) (end 90.15984 106.5784) (width 0.25) (layer B.Cu) (net 1) (tstamp 5B6F09C7))
  (segment (start 92.82176 105.62336) (end 91.11488 105.62336) (width 0.25) (layer B.Cu) (net 1) (tstamp 5B6F09C5))
  (segment (start 102.5868 113.01984) (end 102.5868 112.52328) (width 1) (layer B.Cu) (net 1) (status 30))
  (segment (start 102.5868 112.52328) (end 101.05136 110.98784) (width 1) (layer B.Cu) (net 1) (tstamp 5B6F0818) (status 10))
  (segment (start 101.05136 110.98784) (end 99.73944 110.98784) (width 1) (layer B.Cu) (net 1) (tstamp 5B6F0819) (status 20))
  (segment (start 111.7219 95.5421) (end 111.7219 89.7355) (width 0.4) (layer B.Cu) (net 17) (status 20))
  (segment (start 111.7219 89.7355) (end 111.70292 89.71652) (width 0.4) (layer B.Cu) (net 17) (tstamp 5B6DD407) (status 30))
  (segment (start 99.73944 110.98784) (end 99.71292 110.3146) (width 0.4) (layer B.Cu) (net 1) (status 10))
  (segment (start 100.3046 104.88676) (end 100.3046 100.8634) (width 0.4) (layer B.Cu) (net 1) (tstamp 5B6DD3CF))
  (segment (start 101.00564 105.5878) (end 100.3046 104.88676) (width 0.4) (layer B.Cu) (net 1) (tstamp 5B6DD3CE))
  (segment (start 101.00564 109.02188) (end 101.00564 105.5878) (width 0.4) (layer B.Cu) (net 1) (tstamp 5B6DD3C9))
  (segment (start 99.71292 110.3146) (end 101.00564 109.02188) (width 0.4) (layer B.Cu) (net 1) (tstamp 5B6DD3C4))
  (segment (start 87.11692 131.41452) (end 102.86492 131.41452) (width 1) (layer B.Cu) (net 1))
  (segment (start 87.26932 119.07012) (end 85.59292 120.74652) (width 0.5) (layer B.Cu) (net 1) (tstamp 5B6C7DDF))
  (segment (start 85.59292 120.74652) (end 85.59292 129.89052) (width 0.5) (layer B.Cu) (net 1) (tstamp 5B6C7DE9))
  (segment (start 85.59292 129.89052) (end 86.86292 131.41452) (width 0.5) (layer B.Cu) (net 1) (tstamp 5B6C7DED))
  (segment (start 86.86292 131.41452) (end 87.11692 131.41452) (width 0.5) (layer B.Cu) (net 1) (tstamp 5B6C7DEE))
  (segment (start 89.86648 119.07012) (end 87.26932 119.07012) (width 0.5) (layer B.Cu) (net 1))
  (segment (start 106.67492 127.85852) (end 106.67492 119.26316) (width 1) (layer B.Cu) (net 1) (tstamp 5B6C7DF8))
  (segment (start 102.86492 131.41452) (end 106.67492 127.85852) (width 1) (layer B.Cu) (net 1) (tstamp 5B6C7DF5))
  (segment (start 103.86416 119.31904) (end 103.86416 117.71376) (width 1) (layer B.Cu) (net 1) (status 20))
  (segment (start 103.86416 117.71376) (end 103.84892 117.69852) (width 1) (layer B.Cu) (net 1) (tstamp 5B6C7C9C) (status 30))
  (segment (start 102.5428 113.06384) (end 102.5868 113.01984) (width 0.75) (layer B.Cu) (net 1) (tstamp 5B6C7C18) (status 30))
  (segment (start 93.94292 107.41652) (end 93.94292 108.77652) (width 0.75) (layer B.Cu) (net 1) (status 10))
  (segment (start 99.71292 111.24452) (end 99.73944 110.98784) (width 0.75) (layer B.Cu) (net 1) (tstamp 5B6C7C15) (status 30))
  (segment (start 98.75012 109.52988) (end 99.71292 111.24452) (width 0.75) (layer B.Cu) (net 1) (tstamp 5B6C7C14) (status 20))
  (segment (start 95.44812 109.52988) (end 98.75012 109.52988) (width 0.75) (layer B.Cu) (net 1) (tstamp 5B6C7C13))
  (segment (start 93.94292 108.77652) (end 95.44812 109.52988) (width 0.75) (layer B.Cu) (net 1) (tstamp 5B6C7C12))
  (segment (start 103.86416 122.5042) (end 103.86416 119.31904) (width 1) (layer B.Cu) (net 1) (status 10))
  (segment (start 103.86416 119.31904) (end 103.80828 119.26316) (width 1) (layer B.Cu) (net 1) (tstamp 5B6C7034))
  (segment (start 124.20092 119.47652) (end 119.52092 119.43052) (width 1) (layer F.Cu) (net 1))
  (segment (start 118.56756 119.17716) (end 106.67492 119.26316) (width 1) (layer B.Cu) (net 1) (tstamp 5B6C702C))
  (segment (start 106.67492 119.26316) (end 103.80828 119.26316) (width 1) (layer B.Cu) (net 1) (tstamp 5B6C7DFF))
  (segment (start 119.12092 119.73052) (end 118.56756 119.17716) (width 1) (layer B.Cu) (net 1) (tstamp 5B6C702B))
  (via (at 119.12092 119.73052) (size 2) (drill 0.75) (layers F.Cu B.Cu) (net 1))
  (segment (start 119.22092 119.73052) (end 119.12092 119.73052) (width 1) (layer F.Cu) (net 1) (tstamp 5B6C7027))
  (segment (start 119.52092 119.43052) (end 119.22092 119.73052) (width 1) (layer F.Cu) (net 1) (tstamp 5B6C7025))
  (segment (start 99.96508 115.21652) (end 103.5232 115.21652) (width 1) (layer B.Cu) (net 2) (status 10))
  (segment (start 103.88092 114.8588) (end 103.5232 115.21652) (width 0.75) (layer B.Cu) (net 2) (tstamp 5B6CA85B))
  (segment (start 103.88092 114.65052) (end 103.88092 110.22432) (width 0.75) (layer B.Cu) (net 2) (status 20))
  (segment (start 103.88092 114.65052) (end 103.88092 114.8588) (width 0.25) (layer B.Cu) (net 2))
  (segment (start 99.96508 115.21652) (end 99.75976 115.0112) (width 1) (layer B.Cu) (net 2) (tstamp 5B6F07C6) (status 30))
  (segment (start 91.51292 107.52652) (end 91.40292 107.41652) (width 1) (layer B.Cu) (net 2) (tstamp 5B6F07B6) (status 30))
  (segment (start 97.05976 115.0112) (end 93.45168 115.0112) (width 1) (layer B.Cu) (net 2) (status 10))
  (segment (start 93.45168 115.0112) (end 91.51292 113.07244) (width 1) (layer B.Cu) (net 2) (tstamp 5B6F07B2))
  (segment (start 96.51492 118.46052) (end 97.27692 117.69852) (width 1) (layer B.Cu) (net 2))
  (segment (start 95.90532 119.07012) (end 96.51492 118.46052) (width 0.5) (layer B.Cu) (net 2) (tstamp 5B6C7CF5))
  (segment (start 97.27692 117.69852) (end 99.84892 117.69852) (width 1) (layer B.Cu) (net 2) (tstamp 5B6C7CF8) (status 20))
  (segment (start 103.88092 110.22432) (end 103.8418 110.1852) (width 0.75) (layer B.Cu) (net 2) (tstamp 5B6C7C0B) (status 30))
  (segment (start 99.81692 117.44452) (end 99.84892 116.93652) (width 1) (layer B.Cu) (net 2) (status 30))
  (segment (start 99.84892 116.93652) (end 99.87544 113.13552) (width 1) (layer B.Cu) (net 2) (tstamp 5B6C7C2D) (status 30))
  (segment (start 99.87544 113.13552) (end 99.73944 112.99952) (width 1) (layer B.Cu) (net 2) (tstamp 5B6C7C05) (status 30))
  (segment (start 103.8418 107.02544) (end 103.8418 110.1852) (width 1) (layer B.Cu) (net 2) (status 30))
  (segment (start 105.36292 101.41652) (end 105.36292 100.11652) (width 0.5) (layer B.Cu) (net 2))
  (segment (start 105.36292 105.21652) (end 105.36292 101.41652) (width 0.5) (layer B.Cu) (net 2) (tstamp 5B6C6B54))
  (segment (start 103.8418 106.73764) (end 105.36292 105.21652) (width 0.5) (layer B.Cu) (net 2) (tstamp 5B6C6B43) (status 10))
  (segment (start 102.83792 101.54152) (end 104.26292 100.11652) (width 0.5) (layer B.Cu) (net 2) (tstamp 5B6C6BCE))
  (segment (start 104.26292 100.11652) (end 105.36292 100.11652) (width 0.5) (layer B.Cu) (net 2) (tstamp 5B6C6BD1))
  (segment (start 102.83792 105.41652) (end 103.8418 106.4204) (width 0.5) (layer B.Cu) (net 2) (tstamp 5B6C6BBA) (status 20))
  (segment (start 102.83792 105.41652) (end 102.83792 101.74152) (width 0.5) (layer B.Cu) (net 2) (tstamp 5B6C6BBF))
  (segment (start 102.83792 101.74152) (end 102.83792 101.54152) (width 0.5) (layer B.Cu) (net 2))
  (segment (start 103.8418 107.02544) (end 103.8418 106.4204) (width 0.5) (layer B.Cu) (net 2) (status 30))
  (segment (start 103.8418 107.02544) (end 103.8418 106.73764) (width 0.5) (layer B.Cu) (net 2) (status 30))
  (segment (start 89.6874 120.1992) (end 89.6874 121.15292) (width 0.5) (layer B.Cu) (net 5))
  (segment (start 90.2322 122.75436) (end 89.6874 122.20956) (width 1) (layer B.Cu) (net 5) (tstamp 5B6BB062))
  (segment (start 89.6874 122.20956) (end 89.6874 121.15292) (width 1) (layer B.Cu) (net 5) (tstamp 5B6BB063))
  (segment (start 90.2322 122.75436) (end 90.2322 127.92456) (width 1) (layer B.Cu) (net 5) (status 20))
  (segment (start 89.6874 120.1992) (end 89.86648 120.02012) (width 0.5) (layer B.Cu) (net 5) (tstamp 5B6BB066))
  (segment (start 91.4616 126.69516) (end 90.2322 127.92456) (width 1) (layer B.Cu) (net 5) (tstamp 5B6BAEF9) (status 30))
  (segment (start 92.56648 120.02012) (end 93.84288 120.02012) (width 0.25) (layer B.Cu) (net 7))
  (segment (start 94.36652 120.02012) (end 93.84288 120.02012) (width 0.25) (layer B.Cu) (net 7) (tstamp 5B6F092E))
  (segment (start 95.01292 120.73804) (end 95.01292 120.66652) (width 0.25) (layer B.Cu) (net 7))
  (segment (start 95.01292 120.66652) (end 94.36652 120.02012) (width 0.25) (layer B.Cu) (net 7) (tstamp 5B6F092D))
  (segment (start 99.86416 122.5042) (end 99.77648 122.41652) (width 0.25) (layer B.Cu) (net 7) (status 30))
  (segment (start 99.77648 122.41652) (end 96.6914 122.41652) (width 0.25) (layer B.Cu) (net 7) (tstamp 5B6F0921) (status 10))
  (segment (start 96.6914 122.41652) (end 95.01292 120.73804) (width 0.25) (layer B.Cu) (net 7) (tstamp 5B6F0925))
  (segment (start 92.56648 120.02012) (end 93.44664 120.02012) (width 0.25) (layer B.Cu) (net 7))
  (segment (start 99.30892 119.98452) (end 99.30892 121.94896) (width 0.25) (layer B.Cu) (net 7) (status 20))
  (segment (start 99.30892 121.94896) (end 99.86416 122.5042) (width 0.25) (layer B.Cu) (net 7) (tstamp 5B6F08FD) (status 30))
  (segment (start 99.30892 119.98452) (end 99.30892 120.74652) (width 1) (layer B.Cu) (net 7))
  (segment (start 99.40892 119.88452) (end 99.30892 119.98452) (width 1) (layer F.Cu) (net 7) (tstamp 5B6C6FAD))
  (via (at 99.30892 119.98452) (size 2) (drill 0.75) (layers F.Cu B.Cu) (net 7))
  (segment (start 99.86416 121.30176) (end 99.86416 122.5042) (width 1) (layer B.Cu) (net 7) (tstamp 5B6C7C97) (status 20))
  (segment (start 99.30892 120.74652) (end 99.86416 121.30176) (width 1) (layer B.Cu) (net 7) (tstamp 5B6C7C96))
  (segment (start 95.01292 120.66652) (end 95.76292 121.41652) (width 1) (layer B.Cu) (net 7))
  (segment (start 94.96292 120.61652) (end 95.01292 120.66652) (width 1) (layer B.Cu) (net 7))
  (segment (start 95.01292 120.66652) (end 95.81292 121.46652) (width 1) (layer B.Cu) (net 7) (tstamp 5B6C6FA9))
  (segment (start 95.81292 121.46652) (end 96.76292 122.41652) (width 1) (layer B.Cu) (net 7) (tstamp 5B6C6F52))
  (segment (start 94.36652 120.02012) (end 94.96292 120.61652) (width 0.5) (layer B.Cu) (net 7) (tstamp 5B6C6F19))
  (segment (start 93.44664 120.02012) (end 94.36652 120.02012) (width 0.5) (layer B.Cu) (net 7) (tstamp 5B6F0911))
  (segment (start 96.76292 122.41652) (end 99.77648 122.41652) (width 1) (layer B.Cu) (net 7) (tstamp 5B6C6F26) (status 20))
  (segment (start 99.77648 122.41652) (end 99.86416 122.5042) (width 1) (layer B.Cu) (net 7) (tstamp 5B6C6F29) (status 30))
  (segment (start 99.9122 127.92456) (end 99.9122 122.55224) (width 1) (layer B.Cu) (net 7) (status 30))
  (segment (start 99.9122 122.55224) (end 99.86416 122.5042) (width 1) (layer B.Cu) (net 7) (tstamp 5B6C6ECB) (status 30))
  (segment (start 89.931209 100.713741) (end 91.4019 103.1621) (width 0.5) (layer B.Cu) (net 7) (tstamp 5B6BB11B))
  (segment (start 87.86368 100.711) (end 89.931209 100.713741) (width 0.5) (layer B.Cu) (net 7) (tstamp 5B6BB11A))
  (segment (start 87.23884 101.58984) (end 87.86368 100.711) (width 0.5) (layer B.Cu) (net 7) (tstamp 5B6BB118))
  (segment (start 87.23884 114.44732) (end 87.23884 101.58984) (width 0.75) (layer B.Cu) (net 7) (tstamp 5B6BB115))
  (segment (start 89.04732 116.9162) (end 87.23884 114.44732) (width 0.75) (layer B.Cu) (net 7) (tstamp 5B6BB114))
  (segment (start 92.56648 120.02012) (end 91.4248 120.02012) (width 0.5) (layer B.Cu) (net 7))
  (segment (start 90.678 116.92128) (end 89.16416 116.9162) (width 0.5) (layer B.Cu) (net 7) (tstamp 5B6BB110))
  (segment (start 91.27236 117.56136) (end 90.678 116.92128) (width 0.5) (layer B.Cu) (net 7) (tstamp 5B6BB10F))
  (segment (start 91.27236 119.86768) (end 91.27236 117.56136) (width 0.5) (layer B.Cu) (net 7) (tstamp 5B6BB10E))
  (segment (start 91.4248 120.02012) (end 91.27236 119.86768) (width 0.5) (layer B.Cu) (net 7) (tstamp 5B6BB10D))
  (segment (start 99.92004 127.91672) (end 99.9122 127.92456) (width 0.5) (layer B.Cu) (net 7) (tstamp 5B6BB079) (status 30))
  (segment (start 99.63404 125.89764) (end 99.9122 127.92456) (width 1) (layer B.Cu) (net 7) (tstamp 5B6BABAB) (status 30))
  (segment (start 95.21444 102.32136) (end 95.21444 101.99624) (width 0.5) (layer B.Cu) (net 11))
  (segment (start 96.54794 107.19618) (end 95.21444 105.26268) (width 0.5) (layer B.Cu) (net 11) (tstamp 5B6BB19B) (status 10))
  (segment (start 95.21444 105.26268) (end 95.21444 102.32136) (width 0.5) (layer B.Cu) (net 11) (tstamp 5B6BB1A0))
  (segment (start 88.8619 97.02038) (end 88.8619 95.5421) (width 0.5) (layer B.Cu) (net 11) (tstamp 5B6BB1DB))
  (segment (start 89.90076 98.78568) (end 88.8619 97.02038) (width 0.5) (layer B.Cu) (net 11) (tstamp 5B6BB1D8))
  (segment (start 92.79636 98.7806) (end 89.90076 98.78568) (width 0.5) (layer B.Cu) (net 11) (tstamp 5B6BB1D5))
  (segment (start 95.21444 101.99624) (end 92.79636 98.7806) (width 0.5) (layer B.Cu) (net 11) (tstamp 5B6BB1D1))
  (segment (start 91.4019 96.95434) (end 91.4019 95.5421) (width 0.5) (layer B.Cu) (net 10) (tstamp 5B6BB281))
  (segment (start 92.16292 97.71652) (end 91.4019 96.95434) (width 0.5) (layer B.Cu) (net 10) (tstamp 5B6BB27F))
  (segment (start 94.66292 97.71652) (end 92.16292 97.71652) (width 0.5) (layer B.Cu) (net 10) (tstamp 5B6BB27C))
  (segment (start 97.764818 102.038528) (end 94.66292 97.71652) (width 0.5) (layer B.Cu) (net 10) (tstamp 5B6BB276))
  (segment (start 97.75444 105.37444) (end 97.764818 102.038528) (width 0.5) (layer B.Cu) (net 10) (tstamp 5B6BB272))
  (segment (start 99.08794 107.30794) (end 97.75444 105.37444) (width 0.5) (layer B.Cu) (net 10) (tstamp 5B6BB26D) (status 10))
  (segment (start 98.00336 116.6368) (end 98.40976 116.2304) (width 0.5) (layer B.Cu) (net 18) (tstamp 5B6F05BB))
  (segment (start 96.35744 116.6368) (end 98.00336 116.6368) (width 0.5) (layer B.Cu) (net 18) (tstamp 5B6F05B5))
  (segment (start 92.56648 118.12012) (end 94.87412 118.12012) (width 0.5) (layer B.Cu) (net 18))
  (segment (start 97.8408 112.99952) (end 97.03944 112.99952) (width 0.5) (layer B.Cu) (net 18) (tstamp 5B6F05C2) (status 20))
  (segment (start 94.87412 118.12012) (end 96.35744 116.6368) (width 0.5) (layer B.Cu) (net 18) (tstamp 5B6F05AF))
  (segment (start 97.03944 112.99952) (end 97.03944 110.98784) (width 0.5) (layer B.Cu) (net 18) (tstamp 5B6F05C3) (status 30))
  (segment (start 96.98144 112.94152) (end 97.03944 112.99952) (width 0.75) (layer B.Cu) (net 18) (tstamp 5B6C7C25) (status 30))
  (segment (start 96.99544 110.94384) (end 97.03944 110.98784) (width 0.75) (layer B.Cu) (net 18) (tstamp 5B6C7C20) (status 30))
  (segment (start 98.40976 113.56848) (end 97.8408 112.99952) (width 0.5) (layer B.Cu) (net 18) (tstamp 5B6F05C0))
  (segment (start 98.40976 116.2304) (end 98.40976 113.56848) (width 0.5) (layer B.Cu) (net 18) (tstamp 5B6F05BC))
  (segment (start 87.16772 99.75596) (end 91.57716 99.75596) (width 0.5) (layer B.Cu) (net 19))
  (segment (start 87.80784 118.00844) (end 86.0806 115.7732) (width 0.75) (layer B.Cu) (net 19) (tstamp 5B6BB106))
  (segment (start 86.0806 115.7732) (end 86.080642 100.75164) (width 0.75) (layer B.Cu) (net 19) (tstamp 5B6BB107))
  (segment (start 86.080642 100.75164) (end 87.16772 99.75596) (width 0.5) (layer B.Cu) (net 19) (tstamp 5B6BB108))
  (segment (start 91.57716 99.75596) (end 93.9419 103.1621) (width 0.5) (layer B.Cu) (net 19) (tstamp 5B6BB15B))
  (segment (start 87.80784 118.12012) (end 87.8078 118.12016) (width 0.5) (layer B.Cu) (net 19) (tstamp 5B6BB103))

  (zone (net 1) (net_name GND) (layer B.Cu) (tstamp 5D263375) (hatch edge 0.508)
    (connect_pads (clearance 0.508))
    (min_thickness 0.254)
    (fill (arc_segments 16) (thermal_gap 0.508) (thermal_bridge_width 0.508))
    (polygon
      (pts
        (xy 125.59792 131.89077) (xy 83.68792 131.54152) (xy 83.68792 114.39652) (xy 95.11792 114.39652) (xy 95.11792 96.61652)
        (xy 125.59792 96.61652)
      )
    )
  )
)
