EESchema Schematic File Version 4
LIBS:Monitor-Caudal-cache
EELAYER 29 0
EELAYER END
$Descr A4 11693 8268
encoding utf-8
Sheet 1 4
Title ""
Date ""
Rev ""
Comp ""
Comment1 ""
Comment2 ""
Comment3 ""
Comment4 ""
$EndDescr
Text Notes 7350 2200 0    60   ~ 0
ICSP\n
Text Notes 7450 3750 0    60   ~ 0
I2C
Text Notes 7400 3200 0    60   ~ 0
SPI\n
$Comp
L power:PWR_FLAG #FLG02
U 1 1 5B5B4E8C
P 2650 1800
F 0 "#FLG02" H 2650 1875 50  0001 C CNN
F 1 "PWR_FLAG" H 2650 1950 50  0000 C CNN
F 2 "" H 2650 1800 50  0001 C CNN
F 3 "" H 2650 1800 50  0001 C CNN
	1    2650 1800
	1    0    0    -1  
$EndComp
$Comp
L power:+5C #PWR01
U 1 1 5B5B4E8D
P 2100 1850
F 0 "#PWR01" H 2100 1700 50  0001 C CNN
F 1 "+5C" H 2100 1990 50  0000 C CNN
F 2 "" H 2100 1850 50  0001 C CNN
F 3 "" H 2100 1850 50  0001 C CNN
	1    2100 1850
	1    0    0    -1  
$EndComp
$Comp
L power:GND #PWR03
U 1 1 5B5B4E8E
P 2650 1950
F 0 "#PWR03" H 2650 1700 50  0001 C CNN
F 1 "GND" H 2650 1800 50  0000 C CNN
F 2 "" H 2650 1950 50  0001 C CNN
F 3 "" H 2650 1950 50  0001 C CNN
	1    2650 1950
	1    0    0    -1  
$EndComp
$Comp
L power:PWR_FLAG #FLG01
U 1 1 5B5B4E8F
P 1900 1850
F 0 "#FLG01" H 1900 1925 50  0001 C CNN
F 1 "PWR_FLAG" H 1900 2000 50  0000 C CNN
F 2 "" H 1900 1850 50  0001 C CNN
F 3 "" H 1900 1850 50  0001 C CNN
	1    1900 1850
	1    0    0    -1  
$EndComp
Wire Notes Line
	6850 2500 7300 2500
Wire Notes Line
	7300 1850 7300 2950
Wire Notes Line
	7300 1850 6850 1850
Wire Notes Line
	6850 1850 6850 2950
Wire Notes Line
	6850 3650 6850 3900
Wire Notes Line
	6850 3900 7350 3900
Wire Notes Line
	7350 3650 6850 3650
Wire Notes Line
	6850 3000 6850 3500
Wire Notes Line
	6850 3500 7350 3500
Wire Notes Line
	7350 3500 7350 3000
Wire Notes Line
	7350 3000 6850 3000
Wire Notes Line
	6850 2950 7300 2950
Wire Notes Line
	7350 3900 7350 3650
Wire Wire Line
	6300 2000 6950 2000
Wire Wire Line
	6300 2100 6950 2100
Wire Wire Line
	6300 2200 6950 2200
Wire Wire Line
	6300 2300 6950 2300
Wire Wire Line
	6300 3100 6950 3100
Wire Wire Line
	6950 3400 6300 3400
Wire Wire Line
	8250 2000 8400 2000
Wire Wire Line
	8400 2000 8400 1650
Wire Wire Line
	2100 1850 2100 1950
Wire Wire Line
	2100 1950 1900 1950
Wire Wire Line
	1900 1950 1900 1850
Wire Wire Line
	2650 1800 2650 1950
Wire Wire Line
	8400 1650 5000 1650
Wire Wire Line
	4900 1700 8350 1700
Wire Wire Line
	8350 1700 8350 2100
Wire Wire Line
	8350 2100 8250 2100
Wire Wire Line
	6300 4150 6950 4150
Wire Wire Line
	6950 3200 6300 3200
Wire Wire Line
	6950 3300 6300 3300
Wire Wire Line
	6950 4350 6300 4350
Wire Wire Line
	6950 4450 6300 4450
$Comp
L power:Earth_Protective #PWR04
U 1 1 5B5B4E92
P 3150 1850
F 0 "#PWR04" H 3400 1600 50  0001 C CNN
F 1 "Earth_Protective" H 3600 1700 50  0001 C CNN
F 2 "" H 3150 1750 50  0001 C CNN
F 3 "" H 3150 1750 50  0001 C CNN
	1    3150 1850
	1    0    0    -1  
$EndComp
$Comp
L power:PWR_FLAG #FLG03
U 1 1 5B5B4E93
P 3150 1800
F 0 "#FLG03" H 3150 1875 50  0001 C CNN
F 1 "PWR_FLAG" H 3150 1950 50  0000 C CNN
F 2 "" H 3150 1800 50  0001 C CNN
F 3 "" H 3150 1800 50  0001 C CNN
	1    3150 1800
	1    0    0    -1  
$EndComp
Wire Wire Line
	3150 1800 3150 1850
Wire Wire Line
	1600 4600 2600 4600
$Comp
L power:GND #PWR02
U 1 1 5B5B4E95
P 2200 4750
F 0 "#PWR02" H 2200 4500 50  0001 C CNN
F 1 "GND" H 2200 4600 50  0000 C CNN
F 2 "" H 2200 4750 50  0001 C CNN
F 3 "" H 2200 4750 50  0001 C CNN
	1    2200 4750
	1    0    0    -1  
$EndComp
Wire Wire Line
	2200 4050 2200 4700
Wire Wire Line
	1850 4700 2200 4700
Wire Wire Line
	5000 4600 4550 4600
Wire Wire Line
	5000 1650 5000 2000
Wire Wire Line
	4900 4700 4550 4700
Wire Wire Line
	4900 1700 4900 2100
Wire Wire Line
	4900 2100 5450 2100
Connection ~ 4900 2100
Wire Wire Line
	5000 2000 5450 2000
Connection ~ 5000 2000
$Sheet
S 5450 1950 850  2800
U 5B5B4E89
F0 "Puertos_IO" 60
F1 "Puertos_IO.sch" 60
F2 "SDI" I R 6300 3300 60 
F3 "CS" I R 6300 3400 60 
F4 "VCCD" I L 5450 2000 60 
F5 "INT" O R 6300 4150 60 
F6 "SDO" O R 6300 3200 60 
F7 "SCK" I R 6300 3100 60 
F8 "Reset" I R 6300 4450 60 
F9 "GNDD" I L 5450 2100 60 
F10 "VPP" O R 6300 2000 60 
F11 "VCCP" O R 6300 2100 60 
F12 "PGD" B R 6300 2200 60 
F13 "PGC" O R 6300 2300 60 
F14 "Wake" I R 6300 4350 60 
$EndSheet
$Sheet
S 6950 1950 1300 2800
U 5B5B4E88
F0 "CPU PIC18lF26f20" 60
F1 "CPU PIC18lF26j20.sch" 60
F2 "VCCP" I L 6950 2100 60 
F3 "VCCD" I R 8250 2000 60 
F4 "VPP" I L 6950 2000 60 
F5 "PGC" I L 6950 2300 60 
F6 "PGD" I L 6950 2200 60 
F7 "GNDD" O R 8250 2100 60 
F8 "SCK" O L 6950 3100 60 
F9 "SDI" I L 6950 3200 60 
F10 "SDO" O L 6950 3300 60 
F11 "CS" O L 6950 3400 60 
F12 "AN1" I R 8250 3450 60 
F13 "INT0" I L 6950 4150 60 
F14 "Wake" O L 6950 4350 60 
F15 "!Reset" O L 6950 4450 60 
F16 "Vbat" I L 6950 2650 60 
F17 "PulMed" I R 8250 3600 60 
F18 "En_Hall" O R 8250 3750 60 
F19 "Vdd_CORE" I R 8250 2200 50 
$EndSheet
Connection ~ 2200 4700
Wire Wire Line
	2600 3800 5150 3800
Wire Wire Line
	6950 2650 5150 2650
$Comp
L Monitor-Caudal-rescue:Battery_Cell BT1
U 1 1 5B6B20A1
P 1600 4800
F 0 "BT1" H 1700 4900 50  0000 L CNN
F 1 "Battery_Cell" H 1700 4800 50  0000 L CNN
F 2 "Battery_Holders:Keystone_1058_1x2032-CoinCell" V 1600 4860 50  0001 C CNN
F 3 "" V 1600 4860 50  0001 C CNN
	1    1600 4800
	1    0    0    -1  
$EndComp
Wire Wire Line
	1600 4900 1850 4900
Wire Wire Line
	1850 4900 1850 4700
Wire Wire Line
	2600 3800 2600 4600
Wire Wire Line
	5150 2650 5150 3800
$Comp
L Monitor-Caudal-rescue:Conn_01x03_Male J1
U 1 1 5B6CB5F4
P 1950 4150
F 0 "J1" H 1950 4250 50  0000 C CNN
F 1 "Conn_01x03_Male" H 1950 3950 50  0000 C CNN
F 2 "Connector_PinHeader_1.27mm:PinHeader_1x03_P1.27mm_Vertical" H 1950 4150 50  0001 C CNN
F 3 "" H 1950 4150 50  0001 C CNN
	1    1950 4150
	1    0    0    -1  
$EndComp
Wire Wire Line
	2400 4150 2400 5450
Wire Wire Line
	2400 5450 8700 5450
Wire Wire Line
	8700 5450 8700 3600
Wire Wire Line
	8700 3600 8250 3600
Wire Wire Line
	8250 3750 8850 3750
Wire Wire Line
	8850 3750 8850 5600
Wire Wire Line
	8850 5600 2500 5600
Wire Wire Line
	2500 5600 2500 4250
Wire Wire Line
	2500 4250 2150 4250
Wire Wire Line
	2200 4050 2150 4050
Wire Wire Line
	2150 4150 2400 4150
Wire Wire Line
	4900 2100 4900 4700
Wire Wire Line
	5000 2000 5000 4600
Wire Wire Line
	2200 4700 2200 4750
Wire Wire Line
	2200 4700 3550 4700
Wire Wire Line
	4550 4800 4750 4800
Wire Wire Line
	4750 4800 4750 1550
Wire Wire Line
	4750 1550 8450 1550
Wire Wire Line
	8450 1550 8450 2200
Wire Wire Line
	8450 2200 8250 2200
$Comp
L Switch:SW_Push SW1
U 1 1 5D2AF2A1
P 3050 4600
F 0 "SW1" H 3050 4885 50  0000 C CNN
F 1 "SW_Push" H 3050 4794 50  0000 C CNN
F 2 "Button_Switch_SMD:SW_SPST_B3U-1000P" H 3050 4800 50  0001 C CNN
F 3 "~" H 3050 4800 50  0001 C CNN
	1    3050 4600
	1    0    0    -1  
$EndComp
Connection ~ 2600 4600
Wire Wire Line
	2850 4600 2600 4600
Wire Wire Line
	3250 4600 3550 4600
Wire Wire Line
	8550 4850 3550 4850
Wire Wire Line
	8250 3450 8550 3450
Wire Wire Line
	8550 3450 8550 4850
$Sheet
S 3550 4450 1000 800 
U 5B5B4E91
F0 "Fuente" 60
F1 "Fuente.sch" 60
F2 "3.3V" O R 4550 4600 60 
F3 "0v" I R 4550 4700 60 
F4 "0Vbat" O L 3550 4700 60 
F5 "Vccbat" I L 3550 4600 60 
F6 "EN-swth" I L 3550 4850 60 
F7 "2.5V" O R 4550 4800 50 
$EndSheet
$Comp
L Sensor_Magnetic:A1301KUA-T U4
U 1 1 5D2664C3
P 1600 3700
F 0 "U4" V 1233 3700 50  0000 C CNN
F 1 "A1301KUA-T" V 1324 3700 50  0000 C CNN
F 2 "Sensor_Current:Allegro_SIP-3" H 1600 3350 50  0001 L CIN
F 3 "http://www.allegromicro.com/~/media/Files/Datasheets/A1301-2-Datasheet.ashx" H 1500 3700 50  0001 C CNN
	1    1600 3700
	0    1    1    0   
$EndComp
Wire Wire Line
	1200 3600 1200 4050
Wire Wire Line
	1200 4050 2150 4050
Connection ~ 2150 4050
Wire Wire Line
	2150 4250 2000 4250
Wire Wire Line
	2000 4250 2000 3600
Connection ~ 2150 4250
Wire Wire Line
	1600 4000 1600 4150
Wire Wire Line
	1600 4150 2150 4150
Connection ~ 2150 4150
$EndSCHEMATC
