EESchema Schematic File Version 2
LIBS:74xgxx
LIBS:74xx
LIBS:ac-dc
LIBS:actel
LIBS:adc-dac
LIBS:allegro
LIBS:Altera
LIBS:analog_devices
LIBS:analog_switches
LIBS:atmel
LIBS:audio
LIBS:battery_management
LIBS:bbd
LIBS:bosch
LIBS:brooktre
LIBS:cmos4000
LIBS:cmos_ieee
LIBS:conn
LIBS:contrib
LIBS:cypress
LIBS:dc-dc
LIBS:device
LIBS:digital-audio
LIBS:diode
LIBS:display
LIBS:dsp
LIBS:elec-unifil
LIBS:ESD_Protection
LIBS:ftdi
LIBS:gennum
LIBS:graphic_symbols
LIBS:hc11
LIBS:infineon
LIBS:intel
LIBS:interface
LIBS:intersil
LIBS:ir
LIBS:Lattice
LIBS:leds
LIBS:LEM
LIBS:linear
LIBS:logic_programmable
LIBS:maxim
LIBS:mechanical
LIBS:memory
LIBS:microchip
LIBS:microchip_dspic33dsc
LIBS:microchip_pic10mcu
LIBS:microchip_pic12mcu
LIBS:microchip_pic16mcu
LIBS:microchip_pic18mcu
LIBS:microchip_pic24mcu
LIBS:microchip_pic32mcu
LIBS:microcontrollers
LIBS:modules
LIBS:motor_drivers
LIBS:motorola
LIBS:motors
LIBS:msp430
LIBS:nordicsemi
LIBS:nxp
LIBS:nxp_armmcu
LIBS:onsemi
LIBS:opto
LIBS:Oscillators
LIBS:philips
LIBS:power
LIBS:powerint
LIBS:Power_Management
LIBS:pspice
LIBS:references
LIBS:regul
LIBS:relays
LIBS:rfcom
LIBS:RFSolutions
LIBS:sensors
LIBS:silabs
LIBS:siliconi
LIBS:stm8
LIBS:stm32
LIBS:supertex
LIBS:switches
LIBS:texas
LIBS:transf
LIBS:transistors
LIBS:triac_thyristor
LIBS:ttl_ieee
LIBS:valves
LIBS:video
LIBS:wiznet
LIBS:Worldsemi
LIBS:Xicor
LIBS:xilinx
LIBS:zetex
LIBS:Zilog
LIBS:Mcus
LIBS:PAN-CO-cache
EELAYER 25 0
EELAYER END
$Descr A4 11693 8268
encoding utf-8
Sheet 4 4
Title ""
Date ""
Rev ""
Comp ""
Comment1 ""
Comment2 ""
Comment3 ""
Comment4 ""
$EndDescr
$Comp
L CP C5
U 1 1 5B59626A
P 5400 3850
F 0 "C5" H 5425 3950 50  0000 L CNN
F 1 "CP" H 5425 3750 50  0000 L CNN
F 2 "Capacitors_THT:CP_Radial_Tantal_D4.5mm_P2.50mm" H 5438 3700 50  0001 C CNN
F 3 "" H 5400 3850 50  0001 C CNN
	1    5400 3850
	1    0    0    -1  
$EndComp
$Comp
L CP C4
U 1 1 5B59626C
P 5000 3850
F 0 "C4" H 5025 3950 50  0000 L CNN
F 1 "CP" H 5025 3750 50  0000 L CNN
F 2 "Capacitors_THT:CP_Radial_Tantal_D9.0mm_P5.00mm" H 5038 3700 50  0001 C CNN
F 3 "" H 5000 3850 50  0001 C CNN
	1    5000 3850
	1    0    0    -1  
$EndComp
$Comp
L CP C7
U 1 1 5B59626D
P 7700 3700
F 0 "C7" H 7725 3800 50  0000 L CNN
F 1 "CP" H 7725 3600 50  0000 L CNN
F 2 "Capacitors_THT:CP_Radial_D8.0mm_P5.00mm" H 7738 3550 50  0001 C CNN
F 3 "" H 7700 3700 50  0001 C CNN
	1    7700 3700
	1    0    0    -1  
$EndComp
Text HLabel 8550 3450 2    60   Output ~ 0
VCC1
Text HLabel 8550 3850 2    60   Input ~ 0
GND1
$Comp
L +5VA #PWR011
U 1 1 5B59626F
P 6800 3350
F 0 "#PWR011" H 6800 3200 50  0001 C CNN
F 1 "+5VA" H 6800 3490 50  0000 C CNN
F 2 "" H 6800 3350 50  0001 C CNN
F 3 "" H 6800 3350 50  0001 C CNN
	1    6800 3350
	1    0    0    -1  
$EndComp
$Comp
L +5VA #PWR012
U 1 1 5B596271
P 4600 5550
F 0 "#PWR012" H 4600 5400 50  0001 C CNN
F 1 "+5VA" H 4600 5690 50  0000 C CNN
F 2 "" H 4600 5550 50  0001 C CNN
F 3 "" H 4600 5550 50  0001 C CNN
	1    4600 5550
	1    0    0    -1  
$EndComp
$Comp
L PWR_FLAG #FLG013
U 1 1 5B596273
P 4300 5550
F 0 "#FLG013" H 4300 5625 50  0001 C CNN
F 1 "PWR_FLAG" H 4300 5700 50  0000 C CNN
F 2 "" H 4300 5550 50  0001 C CNN
F 3 "" H 4300 5550 50  0001 C CNN
	1    4300 5550
	1    0    0    -1  
$EndComp
Wire Wire Line
	5400 3450 5400 3700
Connection ~ 5400 3450
Wire Wire Line
	7250 4000 7250 3750
Connection ~ 5400 4000
Wire Wire Line
	5000 3350 5000 3700
Connection ~ 5000 3450
Wire Wire Line
	7550 3450 7900 3450
Wire Wire Line
	7700 3450 7700 3550
Connection ~ 7700 3450
Connection ~ 7250 3850
Connection ~ 7700 3850
Connection ~ 5000 4000
Wire Wire Line
	4600 5550 4300 5550
$Comp
L C_Small C3
U 1 1 5B596276
P 4550 3650
F 0 "C3" H 4560 3720 50  0000 L CNN
F 1 "C_Small" H 4560 3570 50  0000 L CNN
F 2 "Capacitors_THT:C_Disc_D4.3mm_W1.9mm_P5.00mm" H 4550 3650 50  0001 C CNN
F 3 "" H 4550 3650 50  0001 C CNN
	1    4550 3650
	1    0    0    -1  
$EndComp
Wire Wire Line
	4550 3450 4550 3550
Connection ~ 4550 3450
Wire Wire Line
	4550 4000 4550 3750
Connection ~ 4550 4000
$Comp
L Polyfuse F1
U 1 1 5B596277
P 4000 3450
F 0 "F1" V 3900 3450 50  0000 C CNN
F 1 "Polyfuse" V 4100 3450 50  0000 C CNN
F 2 "Varistors:RV_Disc_D7_W3.4_P5" H 4050 3250 50  0001 L CNN
F 3 "" H 4000 3450 50  0001 C CNN
	1    4000 3450
	0    1    1    0   
$EndComp
$Comp
L Varistor RV2
U 1 1 5B596278
P 3850 3750
F 0 "RV2" V 3975 3750 50  0000 C CNN
F 1 "Varistor" V 3725 3750 50  0000 C CNN
F 2 "Varistors:RV_Disc_D9_W4.2_P5" V 3780 3750 50  0001 C CNN
F 3 "" H 3850 3750 50  0001 C CNN
	1    3850 3750
	1    0    0    -1  
$EndComp
$Comp
L Polyfuse F2
U 1 1 5B596279
P 4150 4000
F 0 "F2" V 4050 4000 50  0000 C CNN
F 1 "Polyfuse" V 4250 4000 50  0000 C CNN
F 2 "Varistors:RV_Disc_D7_W3.4_P5" H 4200 3800 50  0001 L CNN
F 3 "" H 4150 4000 50  0001 C CNN
	1    4150 4000
	0    1    1    0   
$EndComp
Wire Wire Line
	8100 3450 8550 3450
Wire Wire Line
	8100 3850 8550 3850
Wire Wire Line
	3850 4350 3850 3900
$Comp
L Earth_Protective #PWR014
U 1 1 5B59627A
P 3850 4350
F 0 "#PWR014" H 4100 4100 50  0001 C CNN
F 1 "Earth_Protective" H 4300 4200 50  0001 C CNN
F 2 "" H 3850 4250 50  0001 C CNN
F 3 "" H 3850 4250 50  0001 C CNN
	1    3850 4350
	1    0    0    -1  
$EndComp
$Comp
L Varistor RV1
U 1 1 5B59627B
P 3650 4150
F 0 "RV1" V 3775 4150 50  0000 C CNN
F 1 "Varistor" V 3525 4150 50  0000 C CNN
F 2 "Varistors:RV_Disc_D9_W4.2_P5" V 3580 4150 50  0001 C CNN
F 3 "" H 3650 4150 50  0001 C CNN
	1    3650 4150
	1    0    0    -1  
$EndComp
Wire Wire Line
	3550 4350 3850 4350
$Comp
L BC517 Q1
U 1 1 5B59627C
P 6050 3550
F 0 "Q1" H 6250 3625 50  0000 L CNN
F 1 "BC517" H 6250 3550 50  0000 L CNN
F 2 "TO_SOT_Packages_THT:TO-92_Inline_Wide" H 6250 3475 50  0001 L CIN
F 3 "" H 6050 3550 50  0001 L CNN
	1    6050 3550
	0    -1   -1   0   
$EndComp
$Comp
L D_Zener_Small D2
U 1 1 5B59627D
P 6050 3900
F 0 "D2" H 6050 3990 50  0000 C CNN
F 1 "D_Zener_Small" H 6050 3810 50  0000 C CNN
F 2 "Diodes_THT:D_A-405_P7.62mm_Horizontal" V 6050 3900 50  0001 C CNN
F 3 "" V 6050 3900 50  0001 C CNN
	1    6050 3900
	0    1    1    0   
$EndComp
$Comp
L R R7
U 1 1 5B59627E
P 5700 3600
F 0 "R7" V 5780 3600 50  0000 C CNN
F 1 "R" V 5700 3600 50  0000 C CNN
F 2 "Resistors_THT:R_Axial_DIN0204_L3.6mm_D1.6mm_P5.08mm_Horizontal" V 5630 3600 50  0001 C CNN
F 3 "" H 5700 3600 50  0001 C CNN
	1    5700 3600
	1    0    0    -1  
$EndComp
Wire Wire Line
	5700 3750 6050 3750
Wire Wire Line
	6050 3750 6050 3800
Connection ~ 5700 3450
Wire Wire Line
	6250 3450 6950 3450
Connection ~ 6050 4000
Wire Wire Line
	7250 3850 7900 3850
$Comp
L CP C6
U 1 1 5B59627F
P 6800 3700
F 0 "C6" H 6825 3800 50  0000 L CNN
F 1 "CP" H 6825 3600 50  0000 L CNN
F 2 "Capacitors_THT:CP_Radial_D12.5mm_P5.00mm" H 6838 3550 50  0001 C CNN
F 3 "" H 6800 3700 50  0001 C CNN
	1    6800 3700
	1    0    0    -1  
$EndComp
Wire Wire Line
	6800 4000 6800 3850
Connection ~ 6800 4000
Wire Wire Line
	6800 3350 6800 3550
Connection ~ 6800 3450
Wire Wire Line
	3650 4350 3650 4300
$Comp
L PWR_FLAG #FLG015
U 1 1 5B596282
P 3650 5550
F 0 "#FLG015" H 3650 5625 50  0001 C CNN
F 1 "PWR_FLAG" H 3650 5700 50  0000 C CNN
F 2 "" H 3650 5550 50  0001 C CNN
F 3 "" H 3650 5550 50  0001 C CNN
	1    3650 5550
	1    0    0    -1  
$EndComp
$Comp
L +6V #PWR016
U 1 1 5B596283
P 5000 3350
F 0 "#PWR016" H 5000 3200 50  0001 C CNN
F 1 "+6V" H 5000 3490 50  0000 C CNN
F 2 "" H 5000 3350 50  0001 C CNN
F 3 "" H 5000 3350 50  0001 C CNN
	1    5000 3350
	1    0    0    -1  
$EndComp
$Comp
L +6V #PWR017
U 1 1 5B596284
P 3900 5550
F 0 "#PWR017" H 3900 5400 50  0001 C CNN
F 1 "+6V" H 3900 5690 50  0000 C CNN
F 2 "" H 3900 5550 50  0001 C CNN
F 3 "" H 3900 5550 50  0001 C CNN
	1    3900 5550
	1    0    0    -1  
$EndComp
Wire Wire Line
	3900 5550 3650 5550
Text HLabel 3450 3450 0    60   Input ~ 0
6Vcc
Text HLabel 3450 4000 0    60   Output ~ 0
0Vcc
Connection ~ 3650 4000
$Comp
L 1N5817 D1
U 1 1 5B59A956
P 4300 3450
F 0 "D1" H 4300 3550 50  0000 C CNN
F 1 "1N5817" H 4300 3350 50  0000 C CNN
F 2 "Diodes_THT:D_DO-41_SOD81_P7.62mm_Horizontal" H 4300 3275 50  0001 C CNN
F 3 "" H 4300 3450 50  0001 C CNN
	1    4300 3450
	-1   0    0    1   
$EndComp
Wire Wire Line
	3450 3450 3850 3450
Wire Wire Line
	4450 3450 5850 3450
Wire Wire Line
	3450 4000 4000 4000
Wire Wire Line
	4300 4000 7250 4000
Wire Wire Line
	4150 3450 4150 3450
$Comp
L LD1117S33TR_SOT223 U2
U 1 1 5B59C861
P 7250 3450
F 0 "U2" H 7100 3575 50  0000 C CNN
F 1 "LD1117S33TR_SOT223" H 7250 3575 50  0000 L CNN
F 2 "TO_SOT_Packages_SMD:SOT-223-3Lead_TabPin2" H 7250 3650 50  0001 C CNN
F 3 "" H 7350 3200 50  0001 C CNN
	1    7250 3450
	1    0    0    -1  
$EndComp
$Comp
L LED D3
U 1 1 5B59C9E1
P 6500 3900
F 0 "D3" H 6500 4000 50  0000 C CNN
F 1 "LED" H 6500 3800 50  0000 C CNN
F 2 "LEDs:LED_D5.0mm" H 6500 3900 50  0001 C CNN
F 3 "" H 6500 3900 50  0001 C CNN
	1    6500 3900
	0    -1   -1   0   
$EndComp
$Comp
L R R8
U 1 1 5B59CC7E
P 6500 3600
F 0 "R8" V 6580 3600 50  0000 C CNN
F 1 "R" V 6500 3600 50  0000 C CNN
F 2 "Resistors_THT:R_Axial_DIN0204_L3.6mm_D1.6mm_P7.62mm_Horizontal" V 6430 3600 50  0001 C CNN
F 3 "" H 6500 3600 50  0001 C CNN
	1    6500 3600
	1    0    0    -1  
$EndComp
Wire Wire Line
	6500 4050 6400 4050
Wire Wire Line
	6400 4050 6400 4000
Connection ~ 6400 4000
Connection ~ 6500 3450
$Comp
L Ferrite_Bead_Small L1
U 1 1 5B59E285
P 8000 3450
F 0 "L1" H 8075 3500 50  0000 L CNN
F 1 "Ferrite_Bead_Small" H 8075 3400 50  0000 L CNN
F 2 "Inductors_THT:L_Axial_L9.5mm_D4.0mm_P12.70mm_Horizontal_Fastron_SMCC" V 7930 3450 50  0001 C CNN
F 3 "" H 8000 3450 50  0001 C CNN
	1    8000 3450
	0    1    1    0   
$EndComp
$Comp
L Ferrite_Bead_Small L2
U 1 1 5B59E488
P 8000 3850
F 0 "L2" H 8075 3900 50  0000 L CNN
F 1 "Ferrite_Bead_Small" H 8075 3800 50  0000 L CNN
F 2 "Inductors_THT:L_Axial_L9.5mm_D4.0mm_P12.70mm_Horizontal_Fastron_SMCC" V 7930 3850 50  0001 C CNN
F 3 "" H 8000 3850 50  0001 C CNN
	1    8000 3850
	0    1    1    0   
$EndComp
Text HLabel 3450 4450 0    60   Input ~ 0
GP
Wire Wire Line
	3450 4450 3550 4450
Wire Wire Line
	3550 4450 3550 4350
Connection ~ 3650 4350
Wire Wire Line
	3850 3450 3850 3600
Text HLabel 6300 2900 0    60   Input ~ 0
VDD
Text HLabel 5400 4200 0    60   Input ~ 0
GND
Wire Wire Line
	5400 4200 5600 4200
Wire Wire Line
	5600 4000 5600 4400
Connection ~ 5600 4000
Wire Wire Line
	6300 2900 6500 2900
Wire Wire Line
	6500 2900 6500 3450
$Comp
L PWR_FLAG #FLG018
U 1 1 5B5B8ACD
P 5100 5550
F 0 "#FLG018" H 5100 5625 50  0001 C CNN
F 1 "PWR_FLAG" H 5100 5700 50  0000 C CNN
F 2 "" H 5100 5550 50  0001 C CNN
F 3 "" H 5100 5550 50  0001 C CNN
	1    5100 5550
	1    0    0    -1  
$EndComp
$Comp
L Earth #PWR019
U 1 1 5B5B99B0
P 5100 5650
F 0 "#PWR019" H 5100 5400 50  0001 C CNN
F 1 "Earth" H 5100 5500 50  0001 C CNN
F 2 "" H 5100 5650 50  0001 C CNN
F 3 "" H 5100 5650 50  0001 C CNN
	1    5100 5650
	1    0    0    -1  
$EndComp
Wire Wire Line
	5100 5550 5100 5650
$Comp
L Earth #PWR020
U 1 1 5B5B9A9B
P 5600 4400
F 0 "#PWR020" H 5600 4150 50  0001 C CNN
F 1 "Earth" H 5600 4250 50  0001 C CNN
F 2 "" H 5600 4400 50  0001 C CNN
F 3 "" H 5600 4400 50  0001 C CNN
	1    5600 4400
	1    0    0    -1  
$EndComp
Connection ~ 5600 4200
$Comp
L GNDA #PWR021
U 1 1 5B5BE31F
P 8300 4200
F 0 "#PWR021" H 8300 3950 50  0001 C CNN
F 1 "GNDA" H 8300 4050 50  0000 C CNN
F 2 "" H 8300 4200 50  0001 C CNN
F 3 "" H 8300 4200 50  0001 C CNN
	1    8300 4200
	1    0    0    -1  
$EndComp
Wire Wire Line
	8300 3800 8300 4200
Connection ~ 8300 3850
$Comp
L PWR_FLAG #FLG022
U 1 1 5B5BE3FB
P 8300 3800
F 0 "#FLG022" H 8300 3875 50  0001 C CNN
F 1 "PWR_FLAG" H 8300 3950 50  0000 C CNN
F 2 "" H 8300 3800 50  0001 C CNN
F 3 "" H 8300 3800 50  0001 C CNN
	1    8300 3800
	1    0    0    -1  
$EndComp
$Comp
L +3.3V #PWR023
U 1 1 5B5BE4AF
P 8300 3300
F 0 "#PWR023" H 8300 3150 50  0001 C CNN
F 1 "+3.3V" H 8300 3440 50  0000 C CNN
F 2 "" H 8300 3300 50  0001 C CNN
F 3 "" H 8300 3300 50  0001 C CNN
	1    8300 3300
	1    0    0    -1  
$EndComp
Wire Wire Line
	8300 3300 8300 3450
Connection ~ 8300 3450
$Comp
L PWR_FLAG #FLG024
U 1 1 5B5BE7DC
P 8550 3300
F 0 "#FLG024" H 8550 3375 50  0001 C CNN
F 1 "PWR_FLAG" H 8550 3450 50  0000 C CNN
F 2 "" H 8550 3300 50  0001 C CNN
F 3 "" H 8550 3300 50  0001 C CNN
	1    8550 3300
	1    0    0    -1  
$EndComp
Wire Wire Line
	8550 3300 8550 3350
Wire Wire Line
	8550 3350 8300 3350
Connection ~ 8300 3350
$EndSCHEMATC
