(export (version D)
  (design
    (source /home/cba/KICAD/RED-CSDLP/GATEWAY-Tcpip-Rs/Fuente_gral/schema-gral.sch)
    (date "sáb 08 dic 2018 14:29:06 -03")
    (tool "Eeschema 4.0.7")
    (sheet (number 1) (name /) (tstamps /)
      (title_block
        (title)
        (company)
        (rev)
        (date)
        (source schema-gral.sch)
        (comment (number 1) (value ""))
        (comment (number 2) (value ""))
        (comment (number 3) (value ""))
        (comment (number 4) (value ""))))
    (sheet (number 2) (name /Fuente_swicht_485_1/) (tstamps /5B4E24F0/)
      (title_block
        (title)
        (company)
        (rev)
        (date)
        (source Fuente_swicht_485_1.sch)
        (comment (number 1) (value ""))
        (comment (number 2) (value ""))
        (comment (number 3) (value ""))
        (comment (number 4) (value ""))))
    (sheet (number 3) (name /Fuente_gral/) (tstamps /5B4E24F2/)
      (title_block
        (title)
        (company)
        (rev)
        (date)
        (source Fuente_gral.sch)
        (comment (number 1) (value ""))
        (comment (number 2) (value ""))
        (comment (number 3) (value ""))
        (comment (number 4) (value "")))))
  (components
    (comp (ref J1)
      (value Screw_Terminal_01x03)
      (footprint Connectors_Molex:Molex_KK-41791-03_03x3.96mm_Straight)
      (libsource (lib conn) (part Screw_Terminal_01x03))
      (sheetpath (names /) (tstamps /))
      (tstamp 5B53A886))
    (comp (ref J2)
      (value Screw_Terminal_01x05)
      (footprint Connectors_Molex:Molex_KK-6410-05_05x2.54mm_Straight)
      (libsource (lib conn) (part Screw_Terminal_01x05))
      (sheetpath (names /) (tstamps /))
      (tstamp 5B522D59))
    (comp (ref C3)
      (value CP)
      (footprint Capacitors_THT:CP_Radial_Tantal_D4.5mm_P2.50mm)
      (libsource (lib device) (part CP))
      (sheetpath (names /Fuente_swicht_485_1/) (tstamps /5B4E24F0/))
      (tstamp 5B519C16))
    (comp (ref U1)
      (value LM78L05_TO92)
      (footprint TO_SOT_Packages_THT:TO-92_Inline_Wide)
      (libsource (lib regul) (part LM78L05_TO92))
      (sheetpath (names /Fuente_swicht_485_1/) (tstamps /5B4E24F0/))
      (tstamp 5B519C17))
    (comp (ref C2)
      (value CP)
      (footprint Capacitors_THT:CP_Radial_Tantal_D9.0mm_P5.00mm)
      (libsource (lib device) (part CP))
      (sheetpath (names /Fuente_swicht_485_1/) (tstamps /5B4E24F0/))
      (tstamp 5B519C19))
    (comp (ref C5)
      (value CP)
      (footprint Capacitors_THT:CP_Radial_D8.0mm_P5.00mm)
      (libsource (lib device) (part CP))
      (sheetpath (names /Fuente_swicht_485_1/) (tstamps /5B4E24F0/))
      (tstamp 5B519C1A))
    (comp (ref C6)
      (value CP)
      (footprint Capacitors_THT:CP_Radial_D10.0mm_P2.50mm)
      (libsource (lib device) (part CP))
      (sheetpath (names /Fuente_swicht_485_1/) (tstamps /5B4E24F0/))
      (tstamp 5B519C1B))
    (comp (ref C7)
      (value C_Small)
      (footprint Capacitors_THT:C_Rect_L7.0mm_W4.5mm_P5.00mm)
      (libsource (lib device) (part C_Small))
      (sheetpath (names /Fuente_swicht_485_1/) (tstamps /5B4E24F0/))
      (tstamp 5B519C23))
    (comp (ref C1)
      (value C_Small)
      (footprint Capacitors_THT:C_Disc_D4.3mm_W1.9mm_P5.00mm)
      (libsource (lib device) (part C_Small))
      (sheetpath (names /Fuente_swicht_485_1/) (tstamps /5B4E24F0/))
      (tstamp 5B519C24))
    (comp (ref F2)
      (value Polyfuse)
      (footprint Varistors:RV_Disc_D7_W3.4_P5)
      (libsource (lib device) (part Polyfuse))
      (sheetpath (names /Fuente_swicht_485_1/) (tstamps /5B4E24F0/))
      (tstamp 5B519C25))
    (comp (ref RV1)
      (value Varistor)
      (footprint Varistors:RV_Disc_D9_W4.2_P5)
      (libsource (lib device) (part Varistor))
      (sheetpath (names /Fuente_swicht_485_1/) (tstamps /5B4E24F0/))
      (tstamp 5B519C26))
    (comp (ref F3)
      (value Polyfuse)
      (footprint Varistors:RV_Disc_D7_W3.4_P5)
      (libsource (lib device) (part Polyfuse))
      (sheetpath (names /Fuente_swicht_485_1/) (tstamps /5B4E24F0/))
      (tstamp 5B519C27))
    (comp (ref RV2)
      (value Varistor)
      (footprint Varistors:RV_Disc_D9_W4.2_P5)
      (libsource (lib device) (part Varistor))
      (sheetpath (names /Fuente_swicht_485_1/) (tstamps /5B4E24F0/))
      (tstamp 5B519C29))
    (comp (ref Q1)
      (value BC517)
      (footprint TO_SOT_Packages_THT:TO-92_Inline_Wide)
      (libsource (lib transistors) (part BC517))
      (sheetpath (names /Fuente_swicht_485_1/) (tstamps /5B4E24F0/))
      (tstamp 5B519C2A))
    (comp (ref D5)
      (value D_Zener_Small)
      (footprint Diodes_THT:D_A-405_P7.62mm_Horizontal)
      (libsource (lib device) (part D_Zener_Small))
      (sheetpath (names /Fuente_swicht_485_1/) (tstamps /5B4E24F0/))
      (tstamp 5B519C2B))
    (comp (ref R1)
      (value R)
      (footprint Resistors_THT:R_Axial_DIN0207_L6.3mm_D2.5mm_P10.16mm_Horizontal)
      (libsource (lib device) (part R))
      (sheetpath (names /Fuente_swicht_485_1/) (tstamps /5B4E24F0/))
      (tstamp 5B519C2C))
    (comp (ref C4)
      (value CP)
      (footprint Capacitors_THT:CP_Radial_D12.5mm_P5.00mm)
      (libsource (lib device) (part CP))
      (sheetpath (names /Fuente_swicht_485_1/) (tstamps /5B4E24F0/))
      (tstamp 5B519C2D))
    (comp (ref F1)
      (value Fuse_Small)
      (footprint Fuse_Holders_and_Fuses:BladeFuse-Mini_Keystone_3568)
      (libsource (lib device) (part Fuse_Small))
      (sheetpath (names /Fuente_swicht_485_1/) (tstamps /5B4E24F0/))
      (tstamp 5B51CC15))
    (comp (ref T1)
      (value Transformer_1P_2S)
      (footprint Transformers_THT:Transformer_Breve_TEZ-22x24)
      (libsource (lib device) (part Transformer_1P_2S))
      (sheetpath (names /Fuente_swicht_485_1/) (tstamps /5B4E24F0/))
      (tstamp 5B51CC22))
    (comp (ref D4)
      (value D)
      (footprint Diodes_THT:D_A-405_P7.62mm_Horizontal)
      (libsource (lib device) (part D))
      (sheetpath (names /Fuente_swicht_485_1/) (tstamps /5B4E24F0/))
      (tstamp 5B5305CA))
    (comp (ref D3)
      (value D)
      (footprint Diodes_THT:D_A-405_P7.62mm_Horizontal)
      (libsource (lib device) (part D))
      (sheetpath (names /Fuente_swicht_485_1/) (tstamps /5B4E24F0/))
      (tstamp 5B53070A))
    (comp (ref D2)
      (value D)
      (footprint Diodes_THT:D_A-405_P7.62mm_Horizontal)
      (libsource (lib device) (part D))
      (sheetpath (names /Fuente_swicht_485_1/) (tstamps /5B4E24F0/))
      (tstamp 5B530758))
    (comp (ref D1)
      (value D)
      (footprint Diodes_THT:D_A-405_P7.62mm_Horizontal)
      (libsource (lib device) (part D))
      (sheetpath (names /Fuente_swicht_485_1/) (tstamps /5B4E24F0/))
      (tstamp 5B5307AF))
    (comp (ref C10)
      (value CP)
      (footprint Capacitors_THT:CP_Radial_D8.0mm_P3.50mm)
      (libsource (lib device) (part CP))
      (sheetpath (names /Fuente_gral/) (tstamps /5B4E24F2/))
      (tstamp 5B4E58A5))
    (comp (ref U2)
      (value LM78L05_TO92)
      (footprint TO_SOT_Packages_THT:TO-92_Inline_Wide)
      (libsource (lib regul) (part LM78L05_TO92))
      (sheetpath (names /Fuente_gral/) (tstamps /5B4E24F2/))
      (tstamp 5B4E58A7))
    (comp (ref C9)
      (value CP)
      (footprint Capacitors_THT:CP_Radial_D12.5mm_P5.00mm)
      (libsource (lib device) (part CP))
      (sheetpath (names /Fuente_gral/) (tstamps /5B4E24F2/))
      (tstamp 5B534FA6))
    (comp (ref C12)
      (value CP)
      (footprint Capacitors_THT:CP_Radial_D12.5mm_P5.00mm)
      (libsource (lib device) (part CP))
      (sheetpath (names /Fuente_gral/) (tstamps /5B4E24F2/))
      (tstamp 5B535014))
    (comp (ref C13)
      (value CP)
      (footprint Capacitors_THT:CP_Radial_D10.0mm_P2.50mm)
      (libsource (lib device) (part CP))
      (sheetpath (names /Fuente_gral/) (tstamps /5B4E24F2/))
      (tstamp 5B53507A))
    (comp (ref F4)
      (value Fuse_Small)
      (footprint Fuse_Holders_and_Fuses:BladeFuse-Mini_Keystone_3568)
      (libsource (lib device) (part Fuse_Small))
      (sheetpath (names /Fuente_gral/) (tstamps /5B4E24F2/))
      (tstamp 5B535218))
    (comp (ref C14)
      (value C_Small)
      (footprint Capacitors_THT:C_Disc_D4.3mm_W1.9mm_P5.00mm)
      (libsource (lib device) (part C_Small))
      (sheetpath (names /Fuente_gral/) (tstamps /5B4E24F2/))
      (tstamp 5B512283))
    (comp (ref C8)
      (value C_Small)
      (footprint Capacitors_THT:C_Rect_L7.0mm_W4.5mm_P5.00mm)
      (libsource (lib device) (part C_Small))
      (sheetpath (names /Fuente_gral/) (tstamps /5B4E24F2/))
      (tstamp 5B5124B8))
    (comp (ref T2)
      (value Transformer_1P_2S)
      (footprint Transformers_THT:Transformer_Breve_TEZ-22x24)
      (libsource (lib device) (part Transformer_1P_2S))
      (sheetpath (names /Fuente_gral/) (tstamps /5B4E24F2/))
      (tstamp 5B502E9B))
    (comp (ref Q2)
      (value BC517)
      (footprint TO_SOT_Packages_THT:TO-92_Inline_Wide)
      (libsource (lib transistors) (part BC517))
      (sheetpath (names /Fuente_gral/) (tstamps /5B4E24F2/))
      (tstamp 5B51E390))
    (comp (ref D10)
      (value D_Zener_Small)
      (footprint Diodes_THT:D_A-405_P7.62mm_Horizontal)
      (libsource (lib device) (part D_Zener_Small))
      (sheetpath (names /Fuente_gral/) (tstamps /5B4E24F2/))
      (tstamp 5B51E391))
    (comp (ref R2)
      (value R)
      (footprint Resistors_THT:R_Axial_DIN0207_L6.3mm_D2.5mm_P10.16mm_Horizontal)
      (libsource (lib device) (part R))
      (sheetpath (names /Fuente_gral/) (tstamps /5B4E24F2/))
      (tstamp 5B51E392))
    (comp (ref C11)
      (value CP)
      (footprint Capacitors_THT:CP_Radial_D12.5mm_P5.00mm)
      (libsource (lib device) (part CP))
      (sheetpath (names /Fuente_gral/) (tstamps /5B4E24F2/))
      (tstamp 5B51E393))
    (comp (ref D7)
      (value D)
      (footprint Diodes_THT:D_A-405_P7.62mm_Horizontal)
      (libsource (lib device) (part D))
      (sheetpath (names /Fuente_gral/) (tstamps /5B4E24F2/))
      (tstamp 5B532496))
    (comp (ref D9)
      (value D)
      (footprint Diodes_THT:D_A-405_P7.62mm_Horizontal)
      (libsource (lib device) (part D))
      (sheetpath (names /Fuente_gral/) (tstamps /5B4E24F2/))
      (tstamp 5B532552))
    (comp (ref D8)
      (value D)
      (footprint Diodes_THT:D_A-405_P7.62mm_Horizontal)
      (libsource (lib device) (part D))
      (sheetpath (names /Fuente_gral/) (tstamps /5B4E24F2/))
      (tstamp 5B532594))
    (comp (ref D6)
      (value D)
      (footprint Diodes_THT:D_A-405_P7.62mm_Horizontal)
      (libsource (lib device) (part D))
      (sheetpath (names /Fuente_gral/) (tstamps /5B4E24F2/))
      (tstamp 5B532607)))
  (libparts
    (libpart (lib transistors) (part BC517)
      (description "30V Vce, 1A Ic, NPN Darlington Transistor, TO-92")
      (docs http://www.fairchildsemi.com/ds/BC/BC517.pdf)
      (footprints
        (fp TO?92*))
      (fields
        (field (name Reference) Q)
        (field (name Value) BC517)
        (field (name Footprint) TO_SOT_Packages_THT:TO-92_Molded_Narrow))
      (pins
        (pin (num 1) (name C) (type passive))
        (pin (num 2) (name B) (type input))
        (pin (num 3) (name E) (type passive))))
    (libpart (lib device) (part CP)
      (description "Polarised capacitor")
      (footprints
        (fp CP_*))
      (fields
        (field (name Reference) C)
        (field (name Value) CP))
      (pins
        (pin (num 1) (name ~) (type passive))
        (pin (num 2) (name ~) (type passive))))
    (libpart (lib device) (part C_Small)
      (description "Unpolarized capacitor")
      (footprints
        (fp C_*))
      (fields
        (field (name Reference) C)
        (field (name Value) C_Small))
      (pins
        (pin (num 1) (name ~) (type passive))
        (pin (num 2) (name ~) (type passive))))
    (libpart (lib device) (part D)
      (description Diode)
      (footprints
        (fp TO-???*)
        (fp *SingleDiode)
        (fp *_Diode_*)
        (fp *SingleDiode*)
        (fp D_*))
      (fields
        (field (name Reference) D)
        (field (name Value) D))
      (pins
        (pin (num 1) (name K) (type passive))
        (pin (num 2) (name A) (type passive))))
    (libpart (lib device) (part D_Zener_Small)
      (description "Zener Diode, small symbol")
      (docs https://en.wikipedia.org/wiki/Zener_diode)
      (footprints
        (fp TO-???*)
        (fp *SingleDiode)
        (fp *_Diode_*)
        (fp *SingleDiode*)
        (fp D_*))
      (fields
        (field (name Reference) D)
        (field (name Value) D_Zener_Small))
      (pins
        (pin (num 1) (name K) (type passive))
        (pin (num 2) (name A) (type passive))))
    (libpart (lib device) (part Fuse_Small)
      (description "Fuse, small symbol")
      (footprints
        (fp SM*))
      (fields
        (field (name Reference) F)
        (field (name Value) Fuse_Small))
      (pins
        (pin (num 1) (name ~) (type passive))
        (pin (num 2) (name ~) (type passive))))
    (libpart (lib regul) (part MC78L05_TO92)
      (aliases
        (alias LM78L05_TO92)
        (alias MC78L06_TO92)
        (alias MC78L08_TO92)
        (alias MC78L12_TO92)
        (alias LM78L12_TO92)
        (alias MC78L15_TO92)
        (alias MC78L18_TO92)
        (alias MC78L24_TO92)
        (alias LM2931AZ-5.0_TO92)
        (alias LM2936-3.0_TO92)
        (alias LM2936-3.3_TO92)
        (alias LM2936-5.0_TO92)
        (alias LP2950-3.0_TO92)
        (alias LP2950-3.3_TO92)
        (alias LP2950-5.0_TO92)
        (alias L78L33_TO92)
        (alias L78L05_TO92)
        (alias L78L06_TO92)
        (alias L78L08_TO92)
        (alias L78L09_TO92)
        (alias L78L10_TO92)
        (alias L78L12_TO92)
        (alias L78L15_TO92)
        (alias L78L18_TO92)
        (alias L78L24_TO92))
      (description "Positive 100mA 30V Linear Regulator, Fixed Output 5V, TO-92")
      (docs http://www.fairchildsemi.com/ds/LM/LM78L05A.pdf)
      (footprints
        (fp TO?92*))
      (fields
        (field (name Reference) U)
        (field (name Value) MC78L05_TO92)
        (field (name Footprint) TO_SOT_Packages_THT:TO-92_Inline_Narrow_Oval))
      (pins
        (pin (num 1) (name VO) (type power_out))
        (pin (num 2) (name GND) (type power_in))
        (pin (num 3) (name VI) (type power_in))))
    (libpart (lib device) (part Polyfuse)
      (description "resettable fuse, polymeric positive temperature coefficient (PPTC)")
      (footprints
        (fp *polyfuse*)
        (fp *PTC*))
      (fields
        (field (name Reference) F)
        (field (name Value) Polyfuse))
      (pins
        (pin (num 1) (name ~) (type passive))
        (pin (num 2) (name ~) (type passive))))
    (libpart (lib device) (part R)
      (description Resistor)
      (footprints
        (fp R_*)
        (fp R_*))
      (fields
        (field (name Reference) R)
        (field (name Value) R))
      (pins
        (pin (num 1) (name ~) (type passive))
        (pin (num 2) (name ~) (type passive))))
    (libpart (lib conn) (part Screw_Terminal_01x03)
      (description "Generic screw terminal, single row, 01x03")
      (docs ~)
      (footprints
        (fp Connector*Terminal*Block*:*)
        (fp TerminalBlock*))
      (fields
        (field (name Reference) J)
        (field (name Value) Screw_Terminal_01x03))
      (pins
        (pin (num 1) (name Pin_1) (type passive))
        (pin (num 2) (name Pin_2) (type passive))
        (pin (num 3) (name Pin_3) (type passive))))
    (libpart (lib conn) (part Screw_Terminal_01x05)
      (description "Generic screw terminal, single row, 01x05")
      (docs ~)
      (footprints
        (fp Connector*Terminal*Block*:*)
        (fp TerminalBlock*))
      (fields
        (field (name Reference) J)
        (field (name Value) Screw_Terminal_01x05))
      (pins
        (pin (num 1) (name Pin_1) (type passive))
        (pin (num 2) (name Pin_2) (type passive))
        (pin (num 3) (name Pin_3) (type passive))
        (pin (num 4) (name Pin_4) (type passive))
        (pin (num 5) (name Pin_5) (type passive))))
    (libpart (lib device) (part Transformer_1P_2S)
      (description "Transformer, single primary, dual secondary")
      (fields
        (field (name Reference) T)
        (field (name Value) Transformer_1P_2S))
      (pins
        (pin (num 1) (name AA) (type passive))
        (pin (num 2) (name AB) (type passive))
        (pin (num 3) (name SA) (type passive))
        (pin (num 4) (name SB) (type passive))
        (pin (num 5) (name SC) (type passive))
        (pin (num 6) (name SD) (type passive))))
    (libpart (lib device) (part Varistor)
      (description "Voltage dependent resistor")
      (footprints
        (fp RV_*)
        (fp Varistor*))
      (fields
        (field (name Reference) RV)
        (field (name Value) Varistor))
      (pins
        (pin (num 1) (name ~) (type passive))
        (pin (num 2) (name ~) (type passive)))))
  (libraries
    (library (logical device)
      (uri /usr/share/kicad/library/device.lib))
    (library (logical transistors)
      (uri /usr/share/kicad/library/transistors.lib))
    (library (logical conn)
      (uri /usr/share/kicad/library/conn.lib))
    (library (logical regul)
      (uri /usr/share/kicad/library/regul.lib)))
  (nets
    (net (code 1) (name /Fuente_gral/VCCD)
      (node (ref J2) (pin 5))
      (node (ref C12) (pin 1))
      (node (ref C13) (pin 1))
      (node (ref U2) (pin 1))
      (node (ref C14) (pin 1)))
    (net (code 2) (name GNDD)
      (node (ref C11) (pin 2))
      (node (ref C12) (pin 2))
      (node (ref D10) (pin 2))
      (node (ref C13) (pin 2))
      (node (ref D9) (pin 2))
      (node (ref D7) (pin 2))
      (node (ref C9) (pin 2))
      (node (ref C14) (pin 2))
      (node (ref C8) (pin 2))
      (node (ref J2) (pin 4))
      (node (ref C10) (pin 2))
      (node (ref U2) (pin 2)))
    (net (code 3) (name /Fuente_swicht_485_1/VCC1)
      (node (ref F2) (pin 1))
      (node (ref RV1) (pin 1))
      (node (ref J2) (pin 1)))
    (net (code 4) (name /Fuente_swicht_485_1/GND1)
      (node (ref RV2) (pin 1))
      (node (ref F3) (pin 1))
      (node (ref J2) (pin 2)))
    (net (code 5) (name Earth_Protective)
      (node (ref T2) (pin 4))
      (node (ref J1) (pin 3))
      (node (ref J2) (pin 3))
      (node (ref T1) (pin 4))
      (node (ref RV2) (pin 2))
      (node (ref RV1) (pin 2)))
    (net (code 6) (name Earth)
      (node (ref T1) (pin 2))
      (node (ref T2) (pin 2))
      (node (ref J1) (pin 2)))
    (net (code 7) (name AC)
      (node (ref F4) (pin 1))
      (node (ref F1) (pin 1))
      (node (ref J1) (pin 1)))
    (net (code 8) (name +5VA)
      (node (ref Q1) (pin 1))
      (node (ref D2) (pin 1))
      (node (ref R1) (pin 1))
      (node (ref C1) (pin 1))
      (node (ref C2) (pin 1))
      (node (ref C3) (pin 1))
      (node (ref D1) (pin 1)))
    (net (code 9) (name GND)
      (node (ref C4) (pin 2))
      (node (ref F3) (pin 2))
      (node (ref D5) (pin 2))
      (node (ref C1) (pin 2))
      (node (ref C7) (pin 2))
      (node (ref C5) (pin 2))
      (node (ref C6) (pin 2))
      (node (ref C2) (pin 2))
      (node (ref U1) (pin 2))
      (node (ref D4) (pin 2))
      (node (ref D3) (pin 2))
      (node (ref C3) (pin 2)))
    (net (code 10) (name "Net-(D5-Pad1)")
      (node (ref Q1) (pin 2))
      (node (ref D5) (pin 1))
      (node (ref R1) (pin 2)))
    (net (code 11) (name "Net-(C5-Pad1)")
      (node (ref C6) (pin 1))
      (node (ref U1) (pin 1))
      (node (ref C5) (pin 1))
      (node (ref F2) (pin 2))
      (node (ref C7) (pin 1)))
    (net (code 12) (name "Net-(D1-Pad2)")
      (node (ref D4) (pin 1))
      (node (ref T1) (pin 5))
      (node (ref D1) (pin 2)))
    (net (code 13) (name "Net-(D2-Pad2)")
      (node (ref D3) (pin 1))
      (node (ref T1) (pin 6))
      (node (ref D2) (pin 2)))
    (net (code 14) (name +6V)
      (node (ref Q1) (pin 3))
      (node (ref C4) (pin 1))
      (node (ref U1) (pin 3)))
    (net (code 15) (name "Net-(F1-Pad2)")
      (node (ref T1) (pin 1))
      (node (ref F1) (pin 2)))
    (net (code 16) (name "Net-(T1-Pad3)")
      (node (ref T1) (pin 3)))
    (net (code 17) (name "Net-(D10-Pad1)")
      (node (ref R2) (pin 2))
      (node (ref D10) (pin 1))
      (node (ref Q2) (pin 2)))
    (net (code 18) (name "Net-(T2-Pad3)")
      (node (ref T2) (pin 3)))
    (net (code 19) (name "Net-(D6-Pad2)")
      (node (ref D7) (pin 1))
      (node (ref D6) (pin 2))
      (node (ref T2) (pin 5)))
    (net (code 20) (name "Net-(D8-Pad2)")
      (node (ref T2) (pin 6))
      (node (ref D9) (pin 1))
      (node (ref D8) (pin 2)))
    (net (code 21) (name VD)
      (node (ref U2) (pin 3))
      (node (ref C11) (pin 1))
      (node (ref Q2) (pin 3)))
    (net (code 22) (name "Net-(F4-Pad2)")
      (node (ref T2) (pin 1))
      (node (ref F4) (pin 2)))
    (net (code 23) (name +5VD)
      (node (ref D6) (pin 1))
      (node (ref C10) (pin 1))
      (node (ref D8) (pin 1))
      (node (ref C9) (pin 1))
      (node (ref R2) (pin 1))
      (node (ref Q2) (pin 1))
      (node (ref C8) (pin 1)))))