EESchema Schematic File Version 2
LIBS:power
LIBS:device
LIBS:switches
LIBS:relays
LIBS:motors
LIBS:transistors
LIBS:conn
LIBS:linear
LIBS:regul
LIBS:74xx
LIBS:cmos4000
LIBS:adc-dac
LIBS:memory
LIBS:xilinx
LIBS:microcontrollers
LIBS:dsp
LIBS:microchip
LIBS:analog_switches
LIBS:motorola
LIBS:texas
LIBS:intel
LIBS:audio
LIBS:interface
LIBS:digital-audio
LIBS:philips
LIBS:display
LIBS:cypress
LIBS:siliconi
LIBS:opto
LIBS:atmel
LIBS:contrib
LIBS:valves
LIBS:schema-gral-cache
EELAYER 25 0
EELAYER END
$Descr A4 11693 8268
encoding utf-8
Sheet 2 3
Title ""
Date ""
Rev ""
Comp ""
Comment1 ""
Comment2 ""
Comment3 ""
Comment4 ""
$EndDescr
$Comp
L CP C3
U 1 1 5B519C16
P 5050 3700
F 0 "C3" H 5075 3800 50  0000 L CNN
F 1 "CP" H 5075 3600 50  0000 L CNN
F 2 "Capacitors_THT:CP_Radial_Tantal_D4.5mm_P2.50mm" H 5088 3550 50  0001 C CNN
F 3 "" H 5050 3700 50  0001 C CNN
	1    5050 3700
	1    0    0    -1  
$EndComp
$Comp
L LM78L05_TO92 U1
U 1 1 5B519C17
P 7250 3450
F 0 "U1" H 7100 3575 50  0000 C CNN
F 1 "LM78L05_TO92" H 7250 3575 50  0000 L CNN
F 2 "TO_SOT_Packages_THT:TO-92_Inline_Wide" H 7250 3675 50  0001 C CIN
F 3 "" H 7250 3400 50  0001 C CNN
	1    7250 3450
	1    0    0    -1  
$EndComp
$Comp
L CP C2
U 1 1 5B519C19
P 4800 3700
F 0 "C2" H 4825 3800 50  0000 L CNN
F 1 "CP" H 4825 3600 50  0000 L CNN
F 2 "Capacitors_THT:CP_Radial_Tantal_D9.0mm_P5.00mm" H 4838 3550 50  0001 C CNN
F 3 "" H 4800 3700 50  0001 C CNN
	1    4800 3700
	1    0    0    -1  
$EndComp
$Comp
L CP C5
U 1 1 5B519C1A
P 7700 3700
F 0 "C5" H 7725 3800 50  0000 L CNN
F 1 "CP" H 7725 3600 50  0000 L CNN
F 2 "Capacitors_THT:CP_Radial_D8.0mm_P5.00mm" H 7738 3550 50  0001 C CNN
F 3 "" H 7700 3700 50  0001 C CNN
	1    7700 3700
	1    0    0    -1  
$EndComp
$Comp
L CP C6
U 1 1 5B519C1B
P 7950 3700
F 0 "C6" H 7975 3800 50  0000 L CNN
F 1 "CP" H 7975 3600 50  0000 L CNN
F 2 "Capacitors_THT:CP_Radial_D10.0mm_P2.50mm" H 7988 3550 50  0001 C CNN
F 3 "" H 7950 3700 50  0001 C CNN
	1    7950 3700
	1    0    0    -1  
$EndComp
Text HLabel 9650 3450 2    60   Input ~ 0
VCC1
Text HLabel 9650 3850 2    60   Input ~ 0
GND1
$Comp
L +5VA #PWR07
U 1 1 5B519C1D
P 4800 3350
F 0 "#PWR07" H 4800 3200 50  0001 C CNN
F 1 "+5VA" H 4800 3490 50  0000 C CNN
F 2 "" H 4800 3350 50  0001 C CNN
F 3 "" H 4800 3350 50  0001 C CNN
	1    4800 3350
	1    0    0    -1  
$EndComp
$Comp
L GND #PWR08
U 1 1 5B519C1E
P 4800 4050
F 0 "#PWR08" H 4800 3800 50  0001 C CNN
F 1 "GND" H 4800 3900 50  0000 C CNN
F 2 "" H 4800 4050 50  0001 C CNN
F 3 "" H 4800 4050 50  0001 C CNN
	1    4800 4050
	1    0    0    -1  
$EndComp
$Comp
L +5VA #PWR09
U 1 1 5B519C1F
P 2600 6500
F 0 "#PWR09" H 2600 6350 50  0001 C CNN
F 1 "+5VA" H 2600 6640 50  0000 C CNN
F 2 "" H 2600 6500 50  0001 C CNN
F 3 "" H 2600 6500 50  0001 C CNN
	1    2600 6500
	1    0    0    -1  
$EndComp
$Comp
L GND #PWR010
U 1 1 5B519C20
P 3050 6450
F 0 "#PWR010" H 3050 6200 50  0001 C CNN
F 1 "GND" H 3050 6300 50  0000 C CNN
F 2 "" H 3050 6450 50  0001 C CNN
F 3 "" H 3050 6450 50  0001 C CNN
	1    3050 6450
	1    0    0    -1  
$EndComp
$Comp
L PWR_FLAG #FLG011
U 1 1 5B519C21
P 2300 6500
F 0 "#FLG011" H 2300 6575 50  0001 C CNN
F 1 "PWR_FLAG" H 2300 6650 50  0000 C CNN
F 2 "" H 2300 6500 50  0001 C CNN
F 3 "" H 2300 6500 50  0001 C CNN
	1    2300 6500
	1    0    0    -1  
$EndComp
$Comp
L PWR_FLAG #FLG012
U 1 1 5B519C22
P 3050 6400
F 0 "#FLG012" H 3050 6475 50  0001 C CNN
F 1 "PWR_FLAG" H 3050 6550 50  0000 C CNN
F 2 "" H 3050 6400 50  0001 C CNN
F 3 "" H 3050 6400 50  0001 C CNN
	1    3050 6400
	1    0    0    -1  
$EndComp
$Comp
L C_Small C7
U 1 1 5B519C23
P 8250 3650
F 0 "C7" H 8260 3720 50  0000 L CNN
F 1 "C_Small" H 8260 3570 50  0000 L CNN
F 2 "Capacitors_THT:C_Rect_L7.0mm_W4.5mm_P5.00mm" H 8250 3650 50  0001 C CNN
F 3 "" H 8250 3650 50  0001 C CNN
	1    8250 3650
	1    0    0    -1  
$EndComp
$Comp
L C_Small C1
U 1 1 5B519C24
P 4550 3650
F 0 "C1" H 4560 3720 50  0000 L CNN
F 1 "C_Small" H 4560 3570 50  0000 L CNN
F 2 "Capacitors_THT:C_Disc_D4.3mm_W1.9mm_P5.00mm" H 4550 3650 50  0001 C CNN
F 3 "" H 4550 3650 50  0001 C CNN
	1    4550 3650
	1    0    0    -1  
$EndComp
$Comp
L Polyfuse F2
U 1 1 5B519C25
P 8750 3450
F 0 "F2" V 8650 3450 50  0000 C CNN
F 1 "Polyfuse" V 8850 3450 50  0000 C CNN
F 2 "Varistors:RV_Disc_D7_W3.4_P5" H 8800 3250 50  0001 L CNN
F 3 "" H 8750 3450 50  0001 C CNN
	1    8750 3450
	0    1    1    0   
$EndComp
$Comp
L Varistor RV1
U 1 1 5B519C26
P 9200 3650
F 0 "RV1" V 9325 3650 50  0000 C CNN
F 1 "Varistor" V 9075 3650 50  0000 C CNN
F 2 "Varistors:RV_Disc_D9_W4.2_P5" V 9130 3650 50  0001 C CNN
F 3 "" H 9200 3650 50  0001 C CNN
	1    9200 3650
	1    0    0    -1  
$EndComp
$Comp
L Polyfuse F3
U 1 1 5B519C27
P 8750 3850
F 0 "F3" V 8650 3850 50  0000 C CNN
F 1 "Polyfuse" V 8850 3850 50  0000 C CNN
F 2 "Varistors:RV_Disc_D7_W3.4_P5" H 8800 3650 50  0001 L CNN
F 3 "" H 8750 3850 50  0001 C CNN
	1    8750 3850
	0    1    1    0   
$EndComp
$Comp
L Earth_Protective #PWR013
U 1 1 5B519C28
P 9200 4250
F 0 "#PWR013" H 9450 4000 50  0001 C CNN
F 1 "Earth_Protective" H 9650 4100 50  0001 C CNN
F 2 "" H 9200 4150 50  0001 C CNN
F 3 "" H 9200 4150 50  0001 C CNN
	1    9200 4250
	1    0    0    -1  
$EndComp
$Comp
L Varistor RV2
U 1 1 5B519C29
P 9450 4050
F 0 "RV2" V 9575 4050 50  0000 C CNN
F 1 "Varistor" V 9325 4050 50  0000 C CNN
F 2 "Varistors:RV_Disc_D9_W4.2_P5" V 9380 4050 50  0001 C CNN
F 3 "" H 9450 4050 50  0001 C CNN
	1    9450 4050
	1    0    0    -1  
$EndComp
$Comp
L BC517 Q1
U 1 1 5B519C2A
P 6200 3550
F 0 "Q1" H 6400 3625 50  0000 L CNN
F 1 "BC517" H 6400 3550 50  0000 L CNN
F 2 "TO_SOT_Packages_THT:TO-92_Inline_Wide" H 6400 3475 50  0001 L CIN
F 3 "" H 6200 3550 50  0001 L CNN
	1    6200 3550
	0    -1   -1   0   
$EndComp
$Comp
L D_Zener_Small D5
U 1 1 5B519C2B
P 6200 3900
F 0 "D5" H 6200 3990 50  0000 C CNN
F 1 "D_Zener_Small" H 6200 3810 50  0000 C CNN
F 2 "Diodes_THT:D_A-405_P7.62mm_Horizontal" V 6200 3900 50  0001 C CNN
F 3 "" V 6200 3900 50  0001 C CNN
	1    6200 3900
	0    1    1    0   
$EndComp
$Comp
L R R1
U 1 1 5B519C2C
P 5750 3600
F 0 "R1" V 5830 3600 50  0000 C CNN
F 1 "R" V 5750 3600 50  0000 C CNN
F 2 "Resistors_THT:R_Axial_DIN0207_L6.3mm_D2.5mm_P10.16mm_Horizontal" V 5680 3600 50  0001 C CNN
F 3 "" H 5750 3600 50  0001 C CNN
	1    5750 3600
	1    0    0    -1  
$EndComp
$Comp
L CP C4
U 1 1 5B519C2D
P 6700 3700
F 0 "C4" H 6725 3800 50  0000 L CNN
F 1 "CP" H 6725 3600 50  0000 L CNN
F 2 "Capacitors_THT:CP_Radial_D12.5mm_P5.00mm" H 6738 3550 50  0001 C CNN
F 3 "" H 6700 3700 50  0001 C CNN
	1    6700 3700
	1    0    0    -1  
$EndComp
Text HLabel 1700 3700 0    60   Input ~ 0
L
Text HLabel 1700 4100 0    60   Input ~ 0
N
$Comp
L Fuse_Small F1
U 1 1 5B51CC15
P 1900 3700
F 0 "F1" H 1900 3640 50  0000 C CNN
F 1 "Fuse_Small" H 1900 3760 50  0000 C CNN
F 2 "Fuse_Holders_and_Fuses:BladeFuse-Mini_Keystone_3568" H 1900 3700 50  0001 C CNN
F 3 "" H 1900 3700 50  0001 C CNN
	1    1900 3700
	1    0    0    -1  
$EndComp
Text HLabel 1700 3200 0    60   Input ~ 0
TIERRA
NoConn ~ 3050 3500
$Comp
L Transformer_1P_2S T1
U 1 1 5B51CC22
P 2650 3900
F 0 "T1" H 2650 4400 50  0000 C CNN
F 1 "Transformer_1P_2S" H 2650 3400 50  0000 C CNN
F 2 "Transformers_THT:Transformer_Breve_TEZ-22x24" H 2650 3900 50  0001 C CNN
F 3 "" H 2650 3900 50  0001 C CNN
	1    2650 3900
	1    0    0    -1  
$EndComp
$Comp
L PWR_FLAG #FLG014
U 1 1 5B525359
P 3700 6400
F 0 "#FLG014" H 3700 6475 50  0001 C CNN
F 1 "PWR_FLAG" H 3700 6550 50  0000 C CNN
F 2 "" H 3700 6400 50  0001 C CNN
F 3 "" H 3700 6400 50  0001 C CNN
	1    3700 6400
	1    0    0    -1  
$EndComp
$Comp
L +6V #PWR015
U 1 1 5B5253C0
P 6700 3350
F 0 "#PWR015" H 6700 3200 50  0001 C CNN
F 1 "+6V" H 6700 3490 50  0000 C CNN
F 2 "" H 6700 3350 50  0001 C CNN
F 3 "" H 6700 3350 50  0001 C CNN
	1    6700 3350
	1    0    0    -1  
$EndComp
$Comp
L +6V #PWR016
U 1 1 5B525480
P 3950 6400
F 0 "#PWR016" H 3950 6250 50  0001 C CNN
F 1 "+6V" H 3950 6540 50  0000 C CNN
F 2 "" H 3950 6400 50  0001 C CNN
F 3 "" H 3950 6400 50  0001 C CNN
	1    3950 6400
	1    0    0    -1  
$EndComp
$Comp
L D D4
U 1 1 5B5305CA
P 4100 3900
F 0 "D4" H 4100 4000 50  0000 C CNN
F 1 "D" H 4100 3800 50  0000 C CNN
F 2 "Diodes_THT:D_A-405_P7.62mm_Horizontal" H 4100 3900 50  0001 C CNN
F 3 "" H 4100 3900 50  0001 C CNN
	1    4100 3900
	1    0    0    1   
$EndComp
$Comp
L D D3
U 1 1 5B53070A
P 4100 3750
F 0 "D3" H 4100 3850 50  0000 C CNN
F 1 "D" H 4100 3650 50  0000 C CNN
F 2 "Diodes_THT:D_A-405_P7.62mm_Horizontal" H 4100 3750 50  0001 C CNN
F 3 "" H 4100 3750 50  0001 C CNN
	1    4100 3750
	1    0    0    1   
$EndComp
$Comp
L D D2
U 1 1 5B530758
P 4100 3600
F 0 "D2" H 4100 3700 50  0000 C CNN
F 1 "D" H 4100 3500 50  0000 C CNN
F 2 "Diodes_THT:D_A-405_P7.62mm_Horizontal" H 4100 3600 50  0001 C CNN
F 3 "" H 4100 3600 50  0001 C CNN
	1    4100 3600
	-1   0    0    -1  
$EndComp
$Comp
L D D1
U 1 1 5B5307AF
P 4100 3450
F 0 "D1" H 4100 3550 50  0000 C CNN
F 1 "D" H 4100 3350 50  0000 C CNN
F 2 "Diodes_THT:D_A-405_P7.62mm_Horizontal" H 4100 3450 50  0001 C CNN
F 3 "" H 4100 3450 50  0001 C CNN
	1    4100 3450
	-1   0    0    -1  
$EndComp
Wire Wire Line
	5050 3450 5050 3550
Connection ~ 5050 3450
Wire Wire Line
	7250 4000 7250 3750
Wire Wire Line
	4250 3450 6000 3450
Wire Wire Line
	4250 3850 5750 3850
Connection ~ 5050 3850
Wire Wire Line
	4800 3350 4800 3550
Connection ~ 4800 3450
Wire Wire Line
	7550 3450 8600 3450
Wire Wire Line
	7700 3450 7700 3550
Wire Wire Line
	7950 3450 7950 3550
Connection ~ 7700 3450
Connection ~ 7250 3850
Connection ~ 7700 3850
Connection ~ 7950 3450
Connection ~ 7950 3850
Wire Wire Line
	4800 3850 4800 4050
Connection ~ 4800 3850
Wire Wire Line
	2600 6500 2300 6500
Wire Wire Line
	3050 6400 3050 6450
Wire Wire Line
	8250 3450 8250 3550
Connection ~ 8250 3450
Wire Wire Line
	8250 3850 8250 3750
Connection ~ 8250 3850
Wire Wire Line
	4550 3450 4550 3550
Connection ~ 4550 3450
Wire Wire Line
	4550 3850 4550 3750
Connection ~ 4550 3850
Wire Wire Line
	8900 3450 9650 3450
Wire Wire Line
	8900 3850 9650 3850
Wire Wire Line
	9200 3800 9200 4250
Wire Wire Line
	9200 3500 9200 3450
Connection ~ 9200 3450
Wire Wire Line
	9200 4250 9450 4250
Wire Wire Line
	5750 3750 6200 3750
Wire Wire Line
	6200 3750 6200 3800
Connection ~ 5750 3450
Wire Wire Line
	6400 3450 6950 3450
Wire Wire Line
	5750 3850 5750 4000
Wire Wire Line
	5750 4000 7250 4000
Connection ~ 6200 4000
Wire Wire Line
	7250 3850 8600 3850
Wire Wire Line
	6700 3850 6700 4000
Connection ~ 6700 4000
Wire Wire Line
	6700 3350 6700 3550
Connection ~ 6700 3450
Wire Wire Line
	1700 4100 2250 4100
Wire Wire Line
	2000 3700 2250 3700
Wire Wire Line
	1700 3700 1800 3700
Wire Wire Line
	1700 3200 3150 3200
Wire Wire Line
	9450 3900 9450 3850
Connection ~ 9450 3850
Wire Wire Line
	9450 4250 9450 4200
Wire Wire Line
	3950 6400 3700 6400
Wire Wire Line
	3950 3600 3950 3750
Wire Wire Line
	4250 3600 4250 3450
Wire Wire Line
	4250 3750 4250 3900
Wire Wire Line
	3750 3900 3950 3900
Wire Wire Line
	3350 3450 3950 3450
Wire Wire Line
	3750 3450 3750 3900
Connection ~ 4250 3850
Connection ~ 3950 3750
Connection ~ 3750 3450
Wire Wire Line
	3050 4000 3350 4000
Wire Wire Line
	3350 4000 3350 3450
Wire Wire Line
	3050 4300 3600 4300
Wire Wire Line
	3600 4300 3600 3750
Wire Wire Line
	3600 3750 3950 3750
Wire Wire Line
	3150 3200 3150 3800
Wire Wire Line
	3150 3800 3050 3800
$EndSCHEMATC
