(kicad_pcb (version 20171130) (host pcbnew 5.1.4-e60b266~84~ubuntu19.04.1)

  (general
    (thickness 1.6)
    (drawings 15)
    (tracks 114)
    (zones 0)
    (modules 22)
    (nets 21)
  )

  (page A4)
  (layers
    (0 F.Cu signal)
    (31 B.Cu signal)
    (32 B.Adhes user)
    (33 F.Adhes user)
    (34 B.Paste user)
    (35 F.Paste user)
    (36 B.SilkS user)
    (37 F.SilkS user)
    (38 B.Mask user)
    (39 F.Mask user)
    (40 Dwgs.User user)
    (41 Cmts.User user)
    (42 Eco1.User user)
    (43 Eco2.User user)
    (44 Edge.Cuts user)
    (45 Margin user)
    (46 B.CrtYd user)
    (47 F.CrtYd user)
    (48 B.Fab user)
    (49 F.Fab user)
  )

  (setup
    (last_trace_width 0.25)
    (user_trace_width 0.4)
    (user_trace_width 0.5)
    (user_trace_width 0.75)
    (user_trace_width 1)
    (user_trace_width 1.25)
    (user_trace_width 1.5)
    (user_trace_width 2)
    (user_trace_width 3)
    (trace_clearance 0.2)
    (zone_clearance 0.508)
    (zone_45_only no)
    (trace_min 0.2)
    (via_size 0.6)
    (via_drill 0.4)
    (via_min_size 0.4)
    (via_min_drill 0.3)
    (user_via 1.5 0.75)
    (user_via 1.75 1)
    (user_via 2 0.75)
    (user_via 2 1)
    (uvia_size 0.3)
    (uvia_drill 0.1)
    (uvias_allowed no)
    (uvia_min_size 0.2)
    (uvia_min_drill 0.1)
    (edge_width 0.15)
    (segment_width 0.2)
    (pcb_text_width 0.3)
    (pcb_text_size 1.5 1.5)
    (mod_edge_width 0.15)
    (mod_text_size 1 1)
    (mod_text_width 0.15)
    (pad_size 1.524 1.524)
    (pad_drill 0.762)
    (pad_to_mask_clearance 0.2)
    (aux_axis_origin 0 0)
    (grid_origin 112.26292 96.61652)
    (visible_elements FFFFFF7F)
    (pcbplotparams
      (layerselection 0x00030_80000001)
      (usegerberextensions false)
      (usegerberattributes false)
      (usegerberadvancedattributes false)
      (creategerberjobfile false)
      (excludeedgelayer true)
      (linewidth 0.100000)
      (plotframeref false)
      (viasonmask false)
      (mode 1)
      (useauxorigin false)
      (hpglpennumber 1)
      (hpglpenspeed 20)
      (hpglpendiameter 15.000000)
      (psnegative false)
      (psa4output false)
      (plotreference true)
      (plotvalue true)
      (plotinvisibletext false)
      (padsonsilk false)
      (subtractmaskfromsilk false)
      (outputformat 1)
      (mirror false)
      (drillshape 1)
      (scaleselection 1)
      (outputdirectory ""))
  )

  (net 0 "")
  (net 1 GND)
  (net 2 +3.3VP)
  (net 3 /Puertos_IO/INT)
  (net 4 /Puertos_IO/SDI)
  (net 5 "Net-(L1-Pad2)")
  (net 6 "/CPU PIC18lF26f20/Vbat")
  (net 7 "/CPU PIC18lF26f20/PulMed")
  (net 8 "/CPU PIC18lF26f20/En_Hall")
  (net 9 "/CPU PIC18lF26f20/VPP")
  (net 10 "/CPU PIC18lF26f20/PGD")
  (net 11 "/CPU PIC18lF26f20/PGC")
  (net 12 "/CPU PIC18lF26f20/CS")
  (net 13 "/CPU PIC18lF26f20/!Reset")
  (net 14 "/CPU PIC18lF26f20/Wake")
  (net 15 "/CPU PIC18lF26f20/SCK")
  (net 16 "/CPU PIC18lF26f20/SDI")
  (net 17 "Net-(R8-Pad2)")
  (net 18 "/CPU PIC18lF26f20/AN1")
  (net 19 /Fuente/2.5V)
  (net 20 "Net-(BT1-Pad1)")

  (net_class Default "Esta es la clase de red por defecto."
    (clearance 0.2)
    (trace_width 0.25)
    (via_dia 0.6)
    (via_drill 0.4)
    (uvia_dia 0.3)
    (uvia_drill 0.1)
    (add_net +3.3VP)
    (add_net "/CPU PIC18lF26f20/!Reset")
    (add_net "/CPU PIC18lF26f20/AN1")
    (add_net "/CPU PIC18lF26f20/CS")
    (add_net "/CPU PIC18lF26f20/En_Hall")
    (add_net "/CPU PIC18lF26f20/PGC")
    (add_net "/CPU PIC18lF26f20/PGD")
    (add_net "/CPU PIC18lF26f20/PulMed")
    (add_net "/CPU PIC18lF26f20/SCK")
    (add_net "/CPU PIC18lF26f20/SDI")
    (add_net "/CPU PIC18lF26f20/VPP")
    (add_net "/CPU PIC18lF26f20/Vbat")
    (add_net "/CPU PIC18lF26f20/Wake")
    (add_net /Fuente/2.5V)
    (add_net /Puertos_IO/INT)
    (add_net /Puertos_IO/SDI)
    (add_net GND)
    (add_net "Net-(BT1-Pad1)")
    (add_net "Net-(L1-Pad2)")
    (add_net "Net-(R8-Pad2)")
  )

  (module Package_SO:SSOP-28_5.3x10.2mm_P0.65mm (layer B.Cu) (tedit 5A02F25C) (tstamp 5D27653A)
    (at 115.31092 119.47652 270)
    (descr "28-Lead Plastic Shrink Small Outline (SS)-5.30 mm Body [SSOP] (see Microchip Packaging Specification 00000049BS.pdf)")
    (tags "SSOP 0.65")
    (path /5B5B4E88/5D2839D0)
    (attr smd)
    (fp_text reference U2 (at 0 6.25 90) (layer B.SilkS)
      (effects (font (size 1 1) (thickness 0.15)) (justify mirror))
    )
    (fp_text value PIC18LF26J50_SO (at 0 -6.25 90) (layer B.Fab)
      (effects (font (size 1 1) (thickness 0.15)) (justify mirror))
    )
    (fp_line (start -1.65 5.1) (end 2.65 5.1) (layer B.Fab) (width 0.15))
    (fp_line (start 2.65 5.1) (end 2.65 -5.1) (layer B.Fab) (width 0.15))
    (fp_line (start 2.65 -5.1) (end -2.65 -5.1) (layer B.Fab) (width 0.15))
    (fp_line (start -2.65 -5.1) (end -2.65 4.1) (layer B.Fab) (width 0.15))
    (fp_line (start -2.65 4.1) (end -1.65 5.1) (layer B.Fab) (width 0.15))
    (fp_line (start -4.75 5.5) (end -4.75 -5.5) (layer B.CrtYd) (width 0.05))
    (fp_line (start 4.75 5.5) (end 4.75 -5.5) (layer B.CrtYd) (width 0.05))
    (fp_line (start -4.75 5.5) (end 4.75 5.5) (layer B.CrtYd) (width 0.05))
    (fp_line (start -4.75 -5.5) (end 4.75 -5.5) (layer B.CrtYd) (width 0.05))
    (fp_line (start -2.875 5.325) (end -2.875 4.75) (layer B.SilkS) (width 0.15))
    (fp_line (start 2.875 5.325) (end 2.875 4.675) (layer B.SilkS) (width 0.15))
    (fp_line (start 2.875 -5.325) (end 2.875 -4.675) (layer B.SilkS) (width 0.15))
    (fp_line (start -2.875 -5.325) (end -2.875 -4.675) (layer B.SilkS) (width 0.15))
    (fp_line (start -2.875 5.325) (end 2.875 5.325) (layer B.SilkS) (width 0.15))
    (fp_line (start -2.875 -5.325) (end 2.875 -5.325) (layer B.SilkS) (width 0.15))
    (fp_line (start -2.875 4.75) (end -4.475 4.75) (layer B.SilkS) (width 0.15))
    (fp_text user %R (at 0 0 90) (layer B.Fab)
      (effects (font (size 0.8 0.8) (thickness 0.15)) (justify mirror))
    )
    (pad 1 smd rect (at -3.6 4.225 270) (size 1.75 0.45) (layers B.Cu B.Paste B.Mask)
      (net 9 "/CPU PIC18lF26f20/VPP"))
    (pad 2 smd rect (at -3.6 3.575 270) (size 1.75 0.45) (layers B.Cu B.Paste B.Mask)
      (net 6 "/CPU PIC18lF26f20/Vbat"))
    (pad 3 smd rect (at -3.6 2.925 270) (size 1.75 0.45) (layers B.Cu B.Paste B.Mask)
      (net 18 "/CPU PIC18lF26f20/AN1"))
    (pad 4 smd rect (at -3.6 2.275 270) (size 1.75 0.45) (layers B.Cu B.Paste B.Mask))
    (pad 5 smd rect (at -3.6 1.625 270) (size 1.75 0.45) (layers B.Cu B.Paste B.Mask))
    (pad 6 smd rect (at -3.6 0.975 270) (size 1.75 0.45) (layers B.Cu B.Paste B.Mask)
      (net 19 /Fuente/2.5V))
    (pad 7 smd rect (at -3.6 0.325 270) (size 1.75 0.45) (layers B.Cu B.Paste B.Mask))
    (pad 8 smd rect (at -3.6 -0.325 270) (size 1.75 0.45) (layers B.Cu B.Paste B.Mask)
      (net 1 GND))
    (pad 9 smd rect (at -3.6 -0.975 270) (size 1.75 0.45) (layers B.Cu B.Paste B.Mask))
    (pad 10 smd rect (at -3.6 -1.625 270) (size 1.75 0.45) (layers B.Cu B.Paste B.Mask))
    (pad 11 smd rect (at -3.6 -2.275 270) (size 1.75 0.45) (layers B.Cu B.Paste B.Mask)
      (net 7 "/CPU PIC18lF26f20/PulMed"))
    (pad 12 smd rect (at -3.6 -2.925 270) (size 1.75 0.45) (layers B.Cu B.Paste B.Mask)
      (net 8 "/CPU PIC18lF26f20/En_Hall"))
    (pad 13 smd rect (at -3.6 -3.575 270) (size 1.75 0.45) (layers B.Cu B.Paste B.Mask))
    (pad 14 smd rect (at -3.6 -4.225 270) (size 1.75 0.45) (layers B.Cu B.Paste B.Mask))
    (pad 15 smd rect (at 3.6 -4.225 270) (size 1.75 0.45) (layers B.Cu B.Paste B.Mask)
      (net 12 "/CPU PIC18lF26f20/CS"))
    (pad 16 smd rect (at 3.6 -3.575 270) (size 1.75 0.45) (layers B.Cu B.Paste B.Mask)
      (net 13 "/CPU PIC18lF26f20/!Reset"))
    (pad 17 smd rect (at 3.6 -2.925 270) (size 1.75 0.45) (layers B.Cu B.Paste B.Mask)
      (net 14 "/CPU PIC18lF26f20/Wake"))
    (pad 18 smd rect (at 3.6 -2.275 270) (size 1.75 0.45) (layers B.Cu B.Paste B.Mask)
      (net 4 /Puertos_IO/SDI))
    (pad 19 smd rect (at 3.6 -1.625 270) (size 1.75 0.45) (layers B.Cu B.Paste B.Mask)
      (net 1 GND))
    (pad 20 smd rect (at 3.6 -0.975 270) (size 1.75 0.45) (layers B.Cu B.Paste B.Mask)
      (net 2 +3.3VP))
    (pad 21 smd rect (at 3.6 -0.325 270) (size 1.75 0.45) (layers B.Cu B.Paste B.Mask)
      (net 3 /Puertos_IO/INT))
    (pad 22 smd rect (at 3.6 0.325 270) (size 1.75 0.45) (layers B.Cu B.Paste B.Mask))
    (pad 23 smd rect (at 3.6 0.975 270) (size 1.75 0.45) (layers B.Cu B.Paste B.Mask))
    (pad 24 smd rect (at 3.6 1.625 270) (size 1.75 0.45) (layers B.Cu B.Paste B.Mask))
    (pad 25 smd rect (at 3.6 2.275 270) (size 1.75 0.45) (layers B.Cu B.Paste B.Mask)
      (net 15 "/CPU PIC18lF26f20/SCK"))
    (pad 26 smd rect (at 3.6 2.925 270) (size 1.75 0.45) (layers B.Cu B.Paste B.Mask)
      (net 16 "/CPU PIC18lF26f20/SDI"))
    (pad 27 smd rect (at 3.6 3.575 270) (size 1.75 0.45) (layers B.Cu B.Paste B.Mask)
      (net 11 "/CPU PIC18lF26f20/PGC"))
    (pad 28 smd rect (at 3.6 4.225 270) (size 1.75 0.45) (layers B.Cu B.Paste B.Mask)
      (net 10 "/CPU PIC18lF26f20/PGD"))
    (model ${KISYS3DMOD}/Package_SO.3dshapes/SSOP-28_5.3x10.2mm_P0.65mm.wrl
      (at (xyz 0 0 0))
      (scale (xyz 1 1 1))
      (rotate (xyz 0 0 0))
    )
  )

  (module Capacitor_SMD:C_1206_3216Metric_Pad1.42x1.75mm_HandSolder (layer B.Cu) (tedit 5B301BBE) (tstamp 5D270D72)
    (at 120.93542 112.36452)
    (descr "Capacitor SMD 1206 (3216 Metric), square (rectangular) end terminal, IPC_7351 nominal with elongated pad for handsoldering. (Body size source: http://www.tortai-tech.com/upload/download/2011102023233369053.pdf), generated with kicad-footprint-generator")
    (tags "capacitor handsolder")
    (path /5B5B4E91/5D268944)
    (attr smd)
    (fp_text reference C5 (at 0 1.82) (layer B.SilkS)
      (effects (font (size 1 1) (thickness 0.15)) (justify mirror))
    )
    (fp_text value C (at 0 -1.82) (layer B.Fab)
      (effects (font (size 1 1) (thickness 0.15)) (justify mirror))
    )
    (fp_line (start -1.6 -0.8) (end -1.6 0.8) (layer B.Fab) (width 0.1))
    (fp_line (start -1.6 0.8) (end 1.6 0.8) (layer B.Fab) (width 0.1))
    (fp_line (start 1.6 0.8) (end 1.6 -0.8) (layer B.Fab) (width 0.1))
    (fp_line (start 1.6 -0.8) (end -1.6 -0.8) (layer B.Fab) (width 0.1))
    (fp_line (start -0.602064 0.91) (end 0.602064 0.91) (layer B.SilkS) (width 0.12))
    (fp_line (start -0.602064 -0.91) (end 0.602064 -0.91) (layer B.SilkS) (width 0.12))
    (fp_line (start -2.45 -1.12) (end -2.45 1.12) (layer B.CrtYd) (width 0.05))
    (fp_line (start -2.45 1.12) (end 2.45 1.12) (layer B.CrtYd) (width 0.05))
    (fp_line (start 2.45 1.12) (end 2.45 -1.12) (layer B.CrtYd) (width 0.05))
    (fp_line (start 2.45 -1.12) (end -2.45 -1.12) (layer B.CrtYd) (width 0.05))
    (fp_text user %R (at 0 0 180) (layer B.Fab)
      (effects (font (size 0.8 0.8) (thickness 0.12)) (justify mirror))
    )
    (pad 1 smd roundrect (at -1.4875 0) (size 1.425 1.75) (layers B.Cu B.Paste B.Mask) (roundrect_rratio 0.175439)
      (net 19 /Fuente/2.5V))
    (pad 2 smd roundrect (at 1.4875 0) (size 1.425 1.75) (layers B.Cu B.Paste B.Mask) (roundrect_rratio 0.175439)
      (net 1 GND))
    (model ${KISYS3DMOD}/Capacitor_SMD.3dshapes/C_1206_3216Metric.wrl
      (at (xyz 0 0 0))
      (scale (xyz 1 1 1))
      (rotate (xyz 0 0 0))
    )
  )

  (module Button_Switch_SMD:SW_SPST_B3U-1000P locked (layer B.Cu) (tedit 5A02FC95) (tstamp 5D270A8F)
    (at 99.13292 112.49152 270)
    (descr "Ultra-small-sized Tactile Switch with High Contact Reliability, Top-actuated Model, without Ground Terminal, without Boss")
    (tags "Tactile Switch")
    (path /5D2AF2A1)
    (attr smd)
    (fp_text reference SW1 (at 0 2.5 90) (layer B.SilkS)
      (effects (font (size 1 1) (thickness 0.15)) (justify mirror))
    )
    (fp_text value SW_Push (at 0 -2.5 90) (layer B.Fab)
      (effects (font (size 1 1) (thickness 0.15)) (justify mirror))
    )
    (fp_text user %R (at 0 2.5 90) (layer B.Fab)
      (effects (font (size 1 1) (thickness 0.15)) (justify mirror))
    )
    (fp_line (start -2.4 -1.65) (end 2.4 -1.65) (layer B.CrtYd) (width 0.05))
    (fp_line (start 2.4 -1.65) (end 2.4 1.65) (layer B.CrtYd) (width 0.05))
    (fp_line (start 2.4 1.65) (end -2.4 1.65) (layer B.CrtYd) (width 0.05))
    (fp_line (start -2.4 1.65) (end -2.4 -1.65) (layer B.CrtYd) (width 0.05))
    (fp_line (start -1.65 -1.1) (end -1.65 -1.4) (layer B.SilkS) (width 0.12))
    (fp_line (start -1.65 -1.4) (end 1.65 -1.4) (layer B.SilkS) (width 0.12))
    (fp_line (start 1.65 -1.4) (end 1.65 -1.1) (layer B.SilkS) (width 0.12))
    (fp_line (start -1.65 1.1) (end -1.65 1.4) (layer B.SilkS) (width 0.12))
    (fp_line (start -1.65 1.4) (end 1.65 1.4) (layer B.SilkS) (width 0.12))
    (fp_line (start 1.65 1.4) (end 1.65 1.1) (layer B.SilkS) (width 0.12))
    (fp_line (start -1.5 1.25) (end 1.5 1.25) (layer B.Fab) (width 0.1))
    (fp_line (start 1.5 1.25) (end 1.5 -1.25) (layer B.Fab) (width 0.1))
    (fp_line (start 1.5 -1.25) (end -1.5 -1.25) (layer B.Fab) (width 0.1))
    (fp_line (start -1.5 -1.25) (end -1.5 1.25) (layer B.Fab) (width 0.1))
    (fp_circle (center 0 0) (end 0.75 0) (layer B.Fab) (width 0.1))
    (pad 1 smd rect (at -1.7 0 270) (size 0.9 1.7) (layers B.Cu B.Paste B.Mask)
      (net 20 "Net-(BT1-Pad1)"))
    (pad 2 smd rect (at 1.7 0 270) (size 0.9 1.7) (layers B.Cu B.Paste B.Mask)
      (net 6 "/CPU PIC18lF26f20/Vbat"))
    (model ${KISYS3DMOD}/Button_Switch_SMD.3dshapes/SW_SPST_B3U-1000P.wrl
      (at (xyz 0 0 0))
      (scale (xyz 1 1 1))
      (rotate (xyz 0 0 0))
    )
  )

  (module Inductor_SMD:L_1210_3225Metric_Pad1.42x2.65mm_HandSolder (layer B.Cu) (tedit 5B301BBE) (tstamp 5D26864D)
    (at 95.49892 120.96402 90)
    (descr "Capacitor SMD 1210 (3225 Metric), square (rectangular) end terminal, IPC_7351 nominal with elongated pad for handsoldering. (Body size source: http://www.tortai-tech.com/upload/download/2011102023233369053.pdf), generated with kicad-footprint-generator")
    (tags "inductor handsolder")
    (path /5B5B4E91/5B656F85)
    (attr smd)
    (fp_text reference L1 (at 0 2.28 90) (layer B.SilkS)
      (effects (font (size 1 1) (thickness 0.15)) (justify mirror))
    )
    (fp_text value L (at 0 -2.28 90) (layer B.Fab)
      (effects (font (size 1 1) (thickness 0.15)) (justify mirror))
    )
    (fp_line (start -1.6 -1.25) (end -1.6 1.25) (layer B.Fab) (width 0.1))
    (fp_line (start -1.6 1.25) (end 1.6 1.25) (layer B.Fab) (width 0.1))
    (fp_line (start 1.6 1.25) (end 1.6 -1.25) (layer B.Fab) (width 0.1))
    (fp_line (start 1.6 -1.25) (end -1.6 -1.25) (layer B.Fab) (width 0.1))
    (fp_line (start -0.602064 1.36) (end 0.602064 1.36) (layer B.SilkS) (width 0.12))
    (fp_line (start -0.602064 -1.36) (end 0.602064 -1.36) (layer B.SilkS) (width 0.12))
    (fp_line (start -2.45 -1.58) (end -2.45 1.58) (layer B.CrtYd) (width 0.05))
    (fp_line (start -2.45 1.58) (end 2.45 1.58) (layer B.CrtYd) (width 0.05))
    (fp_line (start 2.45 1.58) (end 2.45 -1.58) (layer B.CrtYd) (width 0.05))
    (fp_line (start 2.45 -1.58) (end -2.45 -1.58) (layer B.CrtYd) (width 0.05))
    (fp_text user %R (at 0 0 90) (layer B.Fab)
      (effects (font (size 0.8 0.8) (thickness 0.12)) (justify mirror))
    )
    (pad 1 smd roundrect (at -1.4875 0 90) (size 1.425 2.65) (layers B.Cu B.Paste B.Mask) (roundrect_rratio 0.175439)
      (net 6 "/CPU PIC18lF26f20/Vbat"))
    (pad 2 smd roundrect (at 1.4875 0 90) (size 1.425 2.65) (layers B.Cu B.Paste B.Mask) (roundrect_rratio 0.175439)
      (net 5 "Net-(L1-Pad2)"))
    (model ${KISYS3DMOD}/Inductor_SMD.3dshapes/L_1210_3225Metric.wrl
      (at (xyz 0 0 0))
      (scale (xyz 1 1 1))
      (rotate (xyz 0 0 0))
    )
  )

  (module Resistor_SMD:R_0805_2012Metric_Pad1.15x1.40mm_HandSolder (layer B.Cu) (tedit 5B36C52B) (tstamp 5D273F0E)
    (at 104.13492 103.22052)
    (descr "Resistor SMD 0805 (2012 Metric), square (rectangular) end terminal, IPC_7351 nominal with elongated pad for handsoldering. (Body size source: https://docs.google.com/spreadsheets/d/1BsfQQcO9C6DZCsRaXUlFlo91Tg2WpOkGARC1WS5S8t0/edit?usp=sharing), generated with kicad-footprint-generator")
    (tags "resistor handsolder")
    (path /5B5B4E88/5B5B5832)
    (attr smd)
    (fp_text reference R2 (at 0 1.65) (layer B.SilkS)
      (effects (font (size 1 1) (thickness 0.15)) (justify mirror))
    )
    (fp_text value R (at 0 -1.65) (layer B.Fab)
      (effects (font (size 1 1) (thickness 0.15)) (justify mirror))
    )
    (fp_line (start -1 -0.6) (end -1 0.6) (layer B.Fab) (width 0.1))
    (fp_line (start -1 0.6) (end 1 0.6) (layer B.Fab) (width 0.1))
    (fp_line (start 1 0.6) (end 1 -0.6) (layer B.Fab) (width 0.1))
    (fp_line (start 1 -0.6) (end -1 -0.6) (layer B.Fab) (width 0.1))
    (fp_line (start -0.261252 0.71) (end 0.261252 0.71) (layer B.SilkS) (width 0.12))
    (fp_line (start -0.261252 -0.71) (end 0.261252 -0.71) (layer B.SilkS) (width 0.12))
    (fp_line (start -1.85 -0.95) (end -1.85 0.95) (layer B.CrtYd) (width 0.05))
    (fp_line (start -1.85 0.95) (end 1.85 0.95) (layer B.CrtYd) (width 0.05))
    (fp_line (start 1.85 0.95) (end 1.85 -0.95) (layer B.CrtYd) (width 0.05))
    (fp_line (start 1.85 -0.95) (end -1.85 -0.95) (layer B.CrtYd) (width 0.05))
    (fp_text user %R (at 0 0) (layer B.Fab)
      (effects (font (size 0.5 0.5) (thickness 0.08)) (justify mirror))
    )
    (pad 1 smd roundrect (at -1.025 0) (size 1.15 1.4) (layers B.Cu B.Paste B.Mask) (roundrect_rratio 0.217391)
      (net 2 +3.3VP))
    (pad 2 smd roundrect (at 1.025 0) (size 1.15 1.4) (layers B.Cu B.Paste B.Mask) (roundrect_rratio 0.217391)
      (net 9 "/CPU PIC18lF26f20/VPP"))
    (model ${KISYS3DMOD}/Resistor_SMD.3dshapes/R_0805_2012Metric.wrl
      (at (xyz 0 0 0))
      (scale (xyz 1 1 1))
      (rotate (xyz 0 0 0))
    )
  )

  (module Resistor_SMD:R_0805_2012Metric_Pad1.15x1.40mm_HandSolder (layer B.Cu) (tedit 5B36C52B) (tstamp 5D271D17)
    (at 110.22192 126.58852)
    (descr "Resistor SMD 0805 (2012 Metric), square (rectangular) end terminal, IPC_7351 nominal with elongated pad for handsoldering. (Body size source: https://docs.google.com/spreadsheets/d/1BsfQQcO9C6DZCsRaXUlFlo91Tg2WpOkGARC1WS5S8t0/edit?usp=sharing), generated with kicad-footprint-generator")
    (tags "resistor handsolder")
    (path /5B5B4E88/5B5B583A)
    (attr smd)
    (fp_text reference R3 (at 0 1.65) (layer B.SilkS)
      (effects (font (size 1 1) (thickness 0.15)) (justify mirror))
    )
    (fp_text value R (at 0 -1.65) (layer B.Fab)
      (effects (font (size 1 1) (thickness 0.15)) (justify mirror))
    )
    (fp_line (start -1 -0.6) (end -1 0.6) (layer B.Fab) (width 0.1))
    (fp_line (start -1 0.6) (end 1 0.6) (layer B.Fab) (width 0.1))
    (fp_line (start 1 0.6) (end 1 -0.6) (layer B.Fab) (width 0.1))
    (fp_line (start 1 -0.6) (end -1 -0.6) (layer B.Fab) (width 0.1))
    (fp_line (start -0.261252 0.71) (end 0.261252 0.71) (layer B.SilkS) (width 0.12))
    (fp_line (start -0.261252 -0.71) (end 0.261252 -0.71) (layer B.SilkS) (width 0.12))
    (fp_line (start -1.85 -0.95) (end -1.85 0.95) (layer B.CrtYd) (width 0.05))
    (fp_line (start -1.85 0.95) (end 1.85 0.95) (layer B.CrtYd) (width 0.05))
    (fp_line (start 1.85 0.95) (end 1.85 -0.95) (layer B.CrtYd) (width 0.05))
    (fp_line (start 1.85 -0.95) (end -1.85 -0.95) (layer B.CrtYd) (width 0.05))
    (fp_text user %R (at 0 0) (layer B.Fab)
      (effects (font (size 0.5 0.5) (thickness 0.08)) (justify mirror))
    )
    (pad 1 smd roundrect (at -1.025 0) (size 1.15 1.4) (layers B.Cu B.Paste B.Mask) (roundrect_rratio 0.217391)
      (net 2 +3.3VP))
    (pad 2 smd roundrect (at 1.025 0) (size 1.15 1.4) (layers B.Cu B.Paste B.Mask) (roundrect_rratio 0.217391)
      (net 16 "/CPU PIC18lF26f20/SDI"))
    (model ${KISYS3DMOD}/Resistor_SMD.3dshapes/R_0805_2012Metric.wrl
      (at (xyz 0 0 0))
      (scale (xyz 1 1 1))
      (rotate (xyz 0 0 0))
    )
  )

  (module Resistor_SMD:R_0805_2012Metric_Pad1.15x1.40mm_HandSolder (layer B.Cu) (tedit 5B36C52B) (tstamp 5D26A3B5)
    (at 114.80292 101.18852 180)
    (descr "Resistor SMD 0805 (2012 Metric), square (rectangular) end terminal, IPC_7351 nominal with elongated pad for handsoldering. (Body size source: https://docs.google.com/spreadsheets/d/1BsfQQcO9C6DZCsRaXUlFlo91Tg2WpOkGARC1WS5S8t0/edit?usp=sharing), generated with kicad-footprint-generator")
    (tags "resistor handsolder")
    (path /5B5B4E88/5B6CBF5C)
    (attr smd)
    (fp_text reference R4 (at 0 1.65 90) (layer B.SilkS)
      (effects (font (size 1 1) (thickness 0.15)) (justify mirror))
    )
    (fp_text value R (at 0 -1.65) (layer B.Fab)
      (effects (font (size 1 1) (thickness 0.15)) (justify mirror))
    )
    (fp_text user %R (at 0 0 270) (layer B.Fab)
      (effects (font (size 0.5 0.5) (thickness 0.08)) (justify mirror))
    )
    (fp_line (start 1.85 -0.95) (end -1.85 -0.95) (layer B.CrtYd) (width 0.05))
    (fp_line (start 1.85 0.95) (end 1.85 -0.95) (layer B.CrtYd) (width 0.05))
    (fp_line (start -1.85 0.95) (end 1.85 0.95) (layer B.CrtYd) (width 0.05))
    (fp_line (start -1.85 -0.95) (end -1.85 0.95) (layer B.CrtYd) (width 0.05))
    (fp_line (start -0.261252 -0.71) (end 0.261252 -0.71) (layer B.SilkS) (width 0.12))
    (fp_line (start -0.261252 0.71) (end 0.261252 0.71) (layer B.SilkS) (width 0.12))
    (fp_line (start 1 -0.6) (end -1 -0.6) (layer B.Fab) (width 0.1))
    (fp_line (start 1 0.6) (end 1 -0.6) (layer B.Fab) (width 0.1))
    (fp_line (start -1 0.6) (end 1 0.6) (layer B.Fab) (width 0.1))
    (fp_line (start -1 -0.6) (end -1 0.6) (layer B.Fab) (width 0.1))
    (pad 2 smd roundrect (at 1.025 0 180) (size 1.15 1.4) (layers B.Cu B.Paste B.Mask) (roundrect_rratio 0.217391)
      (net 8 "/CPU PIC18lF26f20/En_Hall"))
    (pad 1 smd roundrect (at -1.025 0 180) (size 1.15 1.4) (layers B.Cu B.Paste B.Mask) (roundrect_rratio 0.217391)
      (net 7 "/CPU PIC18lF26f20/PulMed"))
    (model ${KISYS3DMOD}/Resistor_SMD.3dshapes/R_0805_2012Metric.wrl
      (at (xyz 0 0 0))
      (scale (xyz 1 1 1))
      (rotate (xyz 0 0 0))
    )
  )

  (module Resistor_SMD:R_0805_2012Metric_Pad1.15x1.40mm_HandSolder (layer B.Cu) (tedit 5B36C52B) (tstamp 5D26C9EE)
    (at 115.30192 126.58852)
    (descr "Resistor SMD 0805 (2012 Metric), square (rectangular) end terminal, IPC_7351 nominal with elongated pad for handsoldering. (Body size source: https://docs.google.com/spreadsheets/d/1BsfQQcO9C6DZCsRaXUlFlo91Tg2WpOkGARC1WS5S8t0/edit?usp=sharing), generated with kicad-footprint-generator")
    (tags "resistor handsolder")
    (path /5B5B4E88/5B5B5838)
    (attr smd)
    (fp_text reference R5 (at 0 1.65) (layer B.SilkS)
      (effects (font (size 1 1) (thickness 0.15)) (justify mirror))
    )
    (fp_text value R (at 0 -1.65) (layer B.Fab)
      (effects (font (size 1 1) (thickness 0.15)) (justify mirror))
    )
    (fp_text user %R (at 0 0) (layer B.Fab)
      (effects (font (size 0.5 0.5) (thickness 0.08)) (justify mirror))
    )
    (fp_line (start 1.85 -0.95) (end -1.85 -0.95) (layer B.CrtYd) (width 0.05))
    (fp_line (start 1.85 0.95) (end 1.85 -0.95) (layer B.CrtYd) (width 0.05))
    (fp_line (start -1.85 0.95) (end 1.85 0.95) (layer B.CrtYd) (width 0.05))
    (fp_line (start -1.85 -0.95) (end -1.85 0.95) (layer B.CrtYd) (width 0.05))
    (fp_line (start -0.261252 -0.71) (end 0.261252 -0.71) (layer B.SilkS) (width 0.12))
    (fp_line (start -0.261252 0.71) (end 0.261252 0.71) (layer B.SilkS) (width 0.12))
    (fp_line (start 1 -0.6) (end -1 -0.6) (layer B.Fab) (width 0.1))
    (fp_line (start 1 0.6) (end 1 -0.6) (layer B.Fab) (width 0.1))
    (fp_line (start -1 0.6) (end 1 0.6) (layer B.Fab) (width 0.1))
    (fp_line (start -1 -0.6) (end -1 0.6) (layer B.Fab) (width 0.1))
    (pad 2 smd roundrect (at 1.025 0) (size 1.15 1.4) (layers B.Cu B.Paste B.Mask) (roundrect_rratio 0.217391)
      (net 2 +3.3VP))
    (pad 1 smd roundrect (at -1.025 0) (size 1.15 1.4) (layers B.Cu B.Paste B.Mask) (roundrect_rratio 0.217391)
      (net 15 "/CPU PIC18lF26f20/SCK"))
    (model ${KISYS3DMOD}/Resistor_SMD.3dshapes/R_0805_2012Metric.wrl
      (at (xyz 0 0 0))
      (scale (xyz 1 1 1))
      (rotate (xyz 0 0 0))
    )
  )

  (module Resistor_SMD:R_0805_2012Metric_Pad1.15x1.40mm_HandSolder (layer B.Cu) (tedit 5B36C52B) (tstamp 5D26CA60)
    (at 120.39992 126.58852)
    (descr "Resistor SMD 0805 (2012 Metric), square (rectangular) end terminal, IPC_7351 nominal with elongated pad for handsoldering. (Body size source: https://docs.google.com/spreadsheets/d/1BsfQQcO9C6DZCsRaXUlFlo91Tg2WpOkGARC1WS5S8t0/edit?usp=sharing), generated with kicad-footprint-generator")
    (tags "resistor handsolder")
    (path /5B5B4E88/5B5B5839)
    (attr smd)
    (fp_text reference R6 (at 0 1.65) (layer B.SilkS)
      (effects (font (size 1 1) (thickness 0.15)) (justify mirror))
    )
    (fp_text value R (at 0 -1.65) (layer B.Fab)
      (effects (font (size 1 1) (thickness 0.15)) (justify mirror))
    )
    (fp_line (start -1 -0.6) (end -1 0.6) (layer B.Fab) (width 0.1))
    (fp_line (start -1 0.6) (end 1 0.6) (layer B.Fab) (width 0.1))
    (fp_line (start 1 0.6) (end 1 -0.6) (layer B.Fab) (width 0.1))
    (fp_line (start 1 -0.6) (end -1 -0.6) (layer B.Fab) (width 0.1))
    (fp_line (start -0.261252 0.71) (end 0.261252 0.71) (layer B.SilkS) (width 0.12))
    (fp_line (start -0.261252 -0.71) (end 0.261252 -0.71) (layer B.SilkS) (width 0.12))
    (fp_line (start -1.85 -0.95) (end -1.85 0.95) (layer B.CrtYd) (width 0.05))
    (fp_line (start -1.85 0.95) (end 1.85 0.95) (layer B.CrtYd) (width 0.05))
    (fp_line (start 1.85 0.95) (end 1.85 -0.95) (layer B.CrtYd) (width 0.05))
    (fp_line (start 1.85 -0.95) (end -1.85 -0.95) (layer B.CrtYd) (width 0.05))
    (fp_text user %R (at 0 0) (layer B.Fab)
      (effects (font (size 0.5 0.5) (thickness 0.08)) (justify mirror))
    )
    (pad 1 smd roundrect (at -1.025 0) (size 1.15 1.4) (layers B.Cu B.Paste B.Mask) (roundrect_rratio 0.217391)
      (net 2 +3.3VP))
    (pad 2 smd roundrect (at 1.025 0) (size 1.15 1.4) (layers B.Cu B.Paste B.Mask) (roundrect_rratio 0.217391)
      (net 4 /Puertos_IO/SDI))
    (model ${KISYS3DMOD}/Resistor_SMD.3dshapes/R_0805_2012Metric.wrl
      (at (xyz 0 0 0))
      (scale (xyz 1 1 1))
      (rotate (xyz 0 0 0))
    )
  )

  (module Resistor_SMD:R_0805_2012Metric_Pad1.15x1.40mm_HandSolder (layer B.Cu) (tedit 5B36C52B) (tstamp 5D271B40)
    (at 104.64292 122.53352 90)
    (descr "Resistor SMD 0805 (2012 Metric), square (rectangular) end terminal, IPC_7351 nominal with elongated pad for handsoldering. (Body size source: https://docs.google.com/spreadsheets/d/1BsfQQcO9C6DZCsRaXUlFlo91Tg2WpOkGARC1WS5S8t0/edit?usp=sharing), generated with kicad-footprint-generator")
    (tags "resistor handsolder")
    (path /5B5B4E91/5B6559C4)
    (attr smd)
    (fp_text reference R8 (at 0 1.65 90) (layer B.SilkS)
      (effects (font (size 1 1) (thickness 0.15)) (justify mirror))
    )
    (fp_text value R (at 0 -1.65 90) (layer B.Fab)
      (effects (font (size 1 1) (thickness 0.15)) (justify mirror))
    )
    (fp_line (start -1 -0.6) (end -1 0.6) (layer B.Fab) (width 0.1))
    (fp_line (start -1 0.6) (end 1 0.6) (layer B.Fab) (width 0.1))
    (fp_line (start 1 0.6) (end 1 -0.6) (layer B.Fab) (width 0.1))
    (fp_line (start 1 -0.6) (end -1 -0.6) (layer B.Fab) (width 0.1))
    (fp_line (start -0.261252 0.71) (end 0.261252 0.71) (layer B.SilkS) (width 0.12))
    (fp_line (start -0.261252 -0.71) (end 0.261252 -0.71) (layer B.SilkS) (width 0.12))
    (fp_line (start -1.85 -0.95) (end -1.85 0.95) (layer B.CrtYd) (width 0.05))
    (fp_line (start -1.85 0.95) (end 1.85 0.95) (layer B.CrtYd) (width 0.05))
    (fp_line (start 1.85 0.95) (end 1.85 -0.95) (layer B.CrtYd) (width 0.05))
    (fp_line (start 1.85 -0.95) (end -1.85 -0.95) (layer B.CrtYd) (width 0.05))
    (fp_text user %R (at 0 0 90) (layer B.Fab)
      (effects (font (size 0.5 0.5) (thickness 0.08)) (justify mirror))
    )
    (pad 1 smd roundrect (at -1.025 0 90) (size 1.15 1.4) (layers B.Cu B.Paste B.Mask) (roundrect_rratio 0.217391)
      (net 2 +3.3VP))
    (pad 2 smd roundrect (at 1.025 0 90) (size 1.15 1.4) (layers B.Cu B.Paste B.Mask) (roundrect_rratio 0.217391)
      (net 17 "Net-(R8-Pad2)"))
    (model ${KISYS3DMOD}/Resistor_SMD.3dshapes/R_0805_2012Metric.wrl
      (at (xyz 0 0 0))
      (scale (xyz 1 1 1))
      (rotate (xyz 0 0 0))
    )
  )

  (module Resistor_SMD:R_0805_2012Metric_Pad1.15x1.40mm_HandSolder (layer B.Cu) (tedit 5B36C52B) (tstamp 5D26989E)
    (at 104.64292 117.96152 90)
    (descr "Resistor SMD 0805 (2012 Metric), square (rectangular) end terminal, IPC_7351 nominal with elongated pad for handsoldering. (Body size source: https://docs.google.com/spreadsheets/d/1BsfQQcO9C6DZCsRaXUlFlo91Tg2WpOkGARC1WS5S8t0/edit?usp=sharing), generated with kicad-footprint-generator")
    (tags "resistor handsolder")
    (path /5B5B4E91/5B655A58)
    (attr smd)
    (fp_text reference R9 (at 0 1.65 90) (layer B.SilkS)
      (effects (font (size 1 1) (thickness 0.15)) (justify mirror))
    )
    (fp_text value R (at 0 -1.65 90) (layer B.Fab)
      (effects (font (size 1 1) (thickness 0.15)) (justify mirror))
    )
    (fp_text user %R (at 0 0 90) (layer B.Fab)
      (effects (font (size 0.5 0.5) (thickness 0.08)) (justify mirror))
    )
    (fp_line (start 1.85 -0.95) (end -1.85 -0.95) (layer B.CrtYd) (width 0.05))
    (fp_line (start 1.85 0.95) (end 1.85 -0.95) (layer B.CrtYd) (width 0.05))
    (fp_line (start -1.85 0.95) (end 1.85 0.95) (layer B.CrtYd) (width 0.05))
    (fp_line (start -1.85 -0.95) (end -1.85 0.95) (layer B.CrtYd) (width 0.05))
    (fp_line (start -0.261252 -0.71) (end 0.261252 -0.71) (layer B.SilkS) (width 0.12))
    (fp_line (start -0.261252 0.71) (end 0.261252 0.71) (layer B.SilkS) (width 0.12))
    (fp_line (start 1 -0.6) (end -1 -0.6) (layer B.Fab) (width 0.1))
    (fp_line (start 1 0.6) (end 1 -0.6) (layer B.Fab) (width 0.1))
    (fp_line (start -1 0.6) (end 1 0.6) (layer B.Fab) (width 0.1))
    (fp_line (start -1 -0.6) (end -1 0.6) (layer B.Fab) (width 0.1))
    (pad 2 smd roundrect (at 1.025 0 90) (size 1.15 1.4) (layers B.Cu B.Paste B.Mask) (roundrect_rratio 0.217391)
      (net 1 GND))
    (pad 1 smd roundrect (at -1.025 0 90) (size 1.15 1.4) (layers B.Cu B.Paste B.Mask) (roundrect_rratio 0.217391)
      (net 17 "Net-(R8-Pad2)"))
    (model ${KISYS3DMOD}/Resistor_SMD.3dshapes/R_0805_2012Metric.wrl
      (at (xyz 0 0 0))
      (scale (xyz 1 1 1))
      (rotate (xyz 0 0 0))
    )
  )

  (module Connector_PinHeader_1.27mm:PinHeader_1x09_P1.27mm_Vertical (layer F.Cu) (tedit 59FED6E3) (tstamp 5D26BF5C)
    (at 124.96292 118.46052)
    (descr "Through hole straight pin header, 1x09, 1.27mm pitch, single row")
    (tags "Through hole pin header THT 1x09 1.27mm single row")
    (path /5B5B4E89/5B5B5662)
    (fp_text reference J2 (at 0 -1.695) (layer F.SilkS)
      (effects (font (size 1 1) (thickness 0.15)))
    )
    (fp_text value Conn_01x09_Female (at 0 11.855) (layer F.Fab)
      (effects (font (size 1 1) (thickness 0.15)))
    )
    (fp_line (start -0.525 -0.635) (end 1.05 -0.635) (layer F.Fab) (width 0.1))
    (fp_line (start 1.05 -0.635) (end 1.05 10.795) (layer F.Fab) (width 0.1))
    (fp_line (start 1.05 10.795) (end -1.05 10.795) (layer F.Fab) (width 0.1))
    (fp_line (start -1.05 10.795) (end -1.05 -0.11) (layer F.Fab) (width 0.1))
    (fp_line (start -1.05 -0.11) (end -0.525 -0.635) (layer F.Fab) (width 0.1))
    (fp_line (start -1.11 10.855) (end -0.30753 10.855) (layer F.SilkS) (width 0.12))
    (fp_line (start 0.30753 10.855) (end 1.11 10.855) (layer F.SilkS) (width 0.12))
    (fp_line (start -1.11 0.76) (end -1.11 10.855) (layer F.SilkS) (width 0.12))
    (fp_line (start 1.11 0.76) (end 1.11 10.855) (layer F.SilkS) (width 0.12))
    (fp_line (start -1.11 0.76) (end -0.563471 0.76) (layer F.SilkS) (width 0.12))
    (fp_line (start 0.563471 0.76) (end 1.11 0.76) (layer F.SilkS) (width 0.12))
    (fp_line (start -1.11 0) (end -1.11 -0.76) (layer F.SilkS) (width 0.12))
    (fp_line (start -1.11 -0.76) (end 0 -0.76) (layer F.SilkS) (width 0.12))
    (fp_line (start -1.55 -1.15) (end -1.55 11.3) (layer F.CrtYd) (width 0.05))
    (fp_line (start -1.55 11.3) (end 1.55 11.3) (layer F.CrtYd) (width 0.05))
    (fp_line (start 1.55 11.3) (end 1.55 -1.15) (layer F.CrtYd) (width 0.05))
    (fp_line (start 1.55 -1.15) (end -1.55 -1.15) (layer F.CrtYd) (width 0.05))
    (fp_text user %R (at 0 5.08 -270) (layer F.Fab)
      (effects (font (size 1 1) (thickness 0.15)))
    )
    (pad 1 thru_hole rect (at 0 0) (size 1 1) (drill 0.65) (layers *.Cu *.Mask)
      (net 12 "/CPU PIC18lF26f20/CS"))
    (pad 2 thru_hole oval (at 0 1.27) (size 1 1) (drill 0.65) (layers *.Cu *.Mask)
      (net 13 "/CPU PIC18lF26f20/!Reset"))
    (pad 3 thru_hole oval (at 0 2.54) (size 1 1) (drill 0.65) (layers *.Cu *.Mask)
      (net 14 "/CPU PIC18lF26f20/Wake"))
    (pad 4 thru_hole oval (at 0 3.81) (size 1 1) (drill 0.65) (layers *.Cu *.Mask)
      (net 4 /Puertos_IO/SDI))
    (pad 5 thru_hole oval (at 0 5.08) (size 1 1) (drill 0.65) (layers *.Cu *.Mask)
      (net 1 GND))
    (pad 6 thru_hole oval (at 0 6.35) (size 1 1) (drill 0.65) (layers *.Cu *.Mask)
      (net 2 +3.3VP))
    (pad 7 thru_hole oval (at 0 7.62) (size 1 1) (drill 0.65) (layers *.Cu *.Mask)
      (net 3 /Puertos_IO/INT))
    (pad 8 thru_hole oval (at 0 8.89) (size 1 1) (drill 0.65) (layers *.Cu *.Mask)
      (net 15 "/CPU PIC18lF26f20/SCK"))
    (pad 9 thru_hole oval (at 0 10.16) (size 1 1) (drill 0.65) (layers *.Cu *.Mask)
      (net 16 "/CPU PIC18lF26f20/SDI"))
    (model ${KISYS3DMOD}/Connector_PinHeader_1.27mm.3dshapes/PinHeader_1x09_P1.27mm_Vertical.wrl
      (at (xyz 0 0 0))
      (scale (xyz 1 1 1))
      (rotate (xyz 0 0 0))
    )
  )

  (module Sensor_Current:Allegro_SIP-3 (layer B.Cu) (tedit 5A04BB4E) (tstamp 5D26A370)
    (at 113.53292 104.74452)
    (descr "Allegro Microsystems SIP-3, 1.27mm Pitch (http://www.allegromicro.com/~/media/Files/Datasheets/A1369-Datasheet.ashx)")
    (tags "Allegro SIP-3")
    (path /5D2664C3)
    (fp_text reference U1 (at 1.27 1.8) (layer B.SilkS)
      (effects (font (size 1 1) (thickness 0.15)) (justify mirror))
    )
    (fp_text value A1301KUA-T (at 1.27 -1.8) (layer B.Fab)
      (effects (font (size 1 1) (thickness 0.15)) (justify mirror))
    )
    (fp_text user %R (at 1.27 0 180) (layer B.Fab)
      (effects (font (size 0.8 0.8) (thickness 0.1)) (justify mirror))
    )
    (fp_line (start 3.57 -1.05) (end 3.57 1.05) (layer B.CrtYd) (width 0.05))
    (fp_line (start -1.03 -1.05) (end 3.57 -1.05) (layer B.CrtYd) (width 0.05))
    (fp_line (start -1.03 1.05) (end -1.03 -1.05) (layer B.CrtYd) (width 0.05))
    (fp_line (start 3.57 1.05) (end -1.03 1.05) (layer B.CrtYd) (width 0.05))
    (fp_line (start -0.775 0) (end 0.015 -0.79) (layer B.Fab) (width 0.1))
    (fp_line (start 2.525 -0.79) (end 0.015 -0.79) (layer B.Fab) (width 0.1))
    (fp_line (start 3.315 0) (end 2.525 -0.79) (layer B.Fab) (width 0.1))
    (fp_line (start 3.315 0.73) (end 3.315 0) (layer B.Fab) (width 0.1))
    (fp_line (start -0.775 0.73) (end 3.315 0.73) (layer B.Fab) (width 0.1))
    (fp_line (start -0.775 0) (end -0.775 0.73) (layer B.Fab) (width 0.1))
    (fp_line (start 2.01 0.85) (end 1.8 0.85) (layer B.SilkS) (width 0.12))
    (fp_line (start 2.01 -0.91) (end 1.8 -0.91) (layer B.SilkS) (width 0.12))
    (fp_line (start 3.435 0.85) (end 3.435 0) (layer B.SilkS) (width 0.12))
    (fp_line (start -0.895 0) (end -0.895 0.85) (layer B.SilkS) (width 0.12))
    (fp_line (start 3.435 0.85) (end 3.07 0.85) (layer B.SilkS) (width 0.12))
    (pad 1 thru_hole rect (at 0 0) (size 1.1 1.6) (drill 0.8) (layers *.Cu *.Mask)
      (net 8 "/CPU PIC18lF26f20/En_Hall"))
    (pad 2 thru_hole oval (at 1.27 0) (size 1.1 1.6) (drill 0.8) (layers *.Cu *.Mask)
      (net 1 GND))
    (pad 3 thru_hole oval (at 2.54 0) (size 1.1 1.6) (drill 0.8) (layers *.Cu *.Mask)
      (net 7 "/CPU PIC18lF26f20/PulMed"))
    (model ${KISYS3DMOD}/Sensor_Current.3dshapes/Allegro_SIP-3.wrl
      (at (xyz 0 0 0))
      (scale (xyz 1 1 1))
      (rotate (xyz 0 0 0))
    )
  )

  (module Package_TO_SOT_SMD:SOT-23-6 (layer B.Cu) (tedit 5A02FF57) (tstamp 5D269F0A)
    (at 100.07092 121.08452 270)
    (descr "6-pin SOT-23 package")
    (tags SOT-23-6)
    (path /5B5B4E91/5B6B35D6)
    (attr smd)
    (fp_text reference U3 (at 0 2.9 90) (layer B.SilkS)
      (effects (font (size 1 1) (thickness 0.15)) (justify mirror))
    )
    (fp_text value MCP1640 (at 0 -2.9 90) (layer B.Fab)
      (effects (font (size 1 1) (thickness 0.15)) (justify mirror))
    )
    (fp_text user %R (at 0 0 180) (layer B.Fab)
      (effects (font (size 0.5 0.5) (thickness 0.075)) (justify mirror))
    )
    (fp_line (start -0.9 -1.61) (end 0.9 -1.61) (layer B.SilkS) (width 0.12))
    (fp_line (start 0.9 1.61) (end -1.55 1.61) (layer B.SilkS) (width 0.12))
    (fp_line (start 1.9 1.8) (end -1.9 1.8) (layer B.CrtYd) (width 0.05))
    (fp_line (start 1.9 -1.8) (end 1.9 1.8) (layer B.CrtYd) (width 0.05))
    (fp_line (start -1.9 -1.8) (end 1.9 -1.8) (layer B.CrtYd) (width 0.05))
    (fp_line (start -1.9 1.8) (end -1.9 -1.8) (layer B.CrtYd) (width 0.05))
    (fp_line (start -0.9 0.9) (end -0.25 1.55) (layer B.Fab) (width 0.1))
    (fp_line (start 0.9 1.55) (end -0.25 1.55) (layer B.Fab) (width 0.1))
    (fp_line (start -0.9 0.9) (end -0.9 -1.55) (layer B.Fab) (width 0.1))
    (fp_line (start 0.9 -1.55) (end -0.9 -1.55) (layer B.Fab) (width 0.1))
    (fp_line (start 0.9 1.55) (end 0.9 -1.55) (layer B.Fab) (width 0.1))
    (pad 1 smd rect (at -1.1 0.95 270) (size 1.06 0.65) (layers B.Cu B.Paste B.Mask)
      (net 5 "Net-(L1-Pad2)"))
    (pad 2 smd rect (at -1.1 0 270) (size 1.06 0.65) (layers B.Cu B.Paste B.Mask)
      (net 1 GND))
    (pad 3 smd rect (at -1.1 -0.95 270) (size 1.06 0.65) (layers B.Cu B.Paste B.Mask)
      (net 18 "/CPU PIC18lF26f20/AN1"))
    (pad 4 smd rect (at 1.1 -0.95 270) (size 1.06 0.65) (layers B.Cu B.Paste B.Mask)
      (net 17 "Net-(R8-Pad2)"))
    (pad 6 smd rect (at 1.1 0.95 270) (size 1.06 0.65) (layers B.Cu B.Paste B.Mask)
      (net 6 "/CPU PIC18lF26f20/Vbat"))
    (pad 5 smd rect (at 1.1 0 270) (size 1.06 0.65) (layers B.Cu B.Paste B.Mask)
      (net 2 +3.3VP))
    (model ${KISYS3DMOD}/Package_TO_SOT_SMD.3dshapes/SOT-23-6.wrl
      (at (xyz 0 0 0))
      (scale (xyz 1 1 1))
      (rotate (xyz 0 0 0))
    )
  )

  (module Package_TO_SOT_SMD:SOT-23 (layer B.Cu) (tedit 5A02FF57) (tstamp 5D26AEF9)
    (at 121.40692 108.80852 90)
    (descr "SOT-23, Standard")
    (tags SOT-23)
    (path /5B5B4E91/5D25E68C)
    (attr smd)
    (fp_text reference U4 (at 0 2.5 90) (layer B.SilkS)
      (effects (font (size 1 1) (thickness 0.15)) (justify mirror))
    )
    (fp_text value MCP1700-2502E_SOT23 (at 0 -2.5 90) (layer B.Fab)
      (effects (font (size 1 1) (thickness 0.15)) (justify mirror))
    )
    (fp_text user %R (at 0 0 180) (layer B.Fab)
      (effects (font (size 0.5 0.5) (thickness 0.075)) (justify mirror))
    )
    (fp_line (start -0.7 0.95) (end -0.7 -1.5) (layer B.Fab) (width 0.1))
    (fp_line (start -0.15 1.52) (end 0.7 1.52) (layer B.Fab) (width 0.1))
    (fp_line (start -0.7 0.95) (end -0.15 1.52) (layer B.Fab) (width 0.1))
    (fp_line (start 0.7 1.52) (end 0.7 -1.52) (layer B.Fab) (width 0.1))
    (fp_line (start -0.7 -1.52) (end 0.7 -1.52) (layer B.Fab) (width 0.1))
    (fp_line (start 0.76 -1.58) (end 0.76 -0.65) (layer B.SilkS) (width 0.12))
    (fp_line (start 0.76 1.58) (end 0.76 0.65) (layer B.SilkS) (width 0.12))
    (fp_line (start -1.7 1.75) (end 1.7 1.75) (layer B.CrtYd) (width 0.05))
    (fp_line (start 1.7 1.75) (end 1.7 -1.75) (layer B.CrtYd) (width 0.05))
    (fp_line (start 1.7 -1.75) (end -1.7 -1.75) (layer B.CrtYd) (width 0.05))
    (fp_line (start -1.7 -1.75) (end -1.7 1.75) (layer B.CrtYd) (width 0.05))
    (fp_line (start 0.76 1.58) (end -1.4 1.58) (layer B.SilkS) (width 0.12))
    (fp_line (start 0.76 -1.58) (end -0.7 -1.58) (layer B.SilkS) (width 0.12))
    (pad 1 smd rect (at -1 0.95 90) (size 0.9 0.8) (layers B.Cu B.Paste B.Mask)
      (net 1 GND))
    (pad 2 smd rect (at -1 -0.95 90) (size 0.9 0.8) (layers B.Cu B.Paste B.Mask)
      (net 19 /Fuente/2.5V))
    (pad 3 smd rect (at 1 0 90) (size 0.9 0.8) (layers B.Cu B.Paste B.Mask)
      (net 2 +3.3VP))
    (model ${KISYS3DMOD}/Package_TO_SOT_SMD.3dshapes/SOT-23.wrl
      (at (xyz 0 0 0))
      (scale (xyz 1 1 1))
      (rotate (xyz 0 0 0))
    )
  )

  (module Capacitor_SMD:C_1206_3216Metric_Pad1.42x1.75mm_HandSolder (layer B.Cu) (tedit 5B301BBE) (tstamp 5D272067)
    (at 104.17142 126.58852 180)
    (descr "Capacitor SMD 1206 (3216 Metric), square (rectangular) end terminal, IPC_7351 nominal with elongated pad for handsoldering. (Body size source: http://www.tortai-tech.com/upload/download/2011102023233369053.pdf), generated with kicad-footprint-generator")
    (tags "capacitor handsolder")
    (path /5B5B4E88/5B5B5835)
    (attr smd)
    (fp_text reference C1 (at 0 1.82) (layer B.SilkS)
      (effects (font (size 1 1) (thickness 0.15)) (justify mirror))
    )
    (fp_text value C_Small (at 0 -1.82) (layer B.Fab)
      (effects (font (size 1 1) (thickness 0.15)) (justify mirror))
    )
    (fp_line (start -1.6 -0.8) (end -1.6 0.8) (layer B.Fab) (width 0.1))
    (fp_line (start -1.6 0.8) (end 1.6 0.8) (layer B.Fab) (width 0.1))
    (fp_line (start 1.6 0.8) (end 1.6 -0.8) (layer B.Fab) (width 0.1))
    (fp_line (start 1.6 -0.8) (end -1.6 -0.8) (layer B.Fab) (width 0.1))
    (fp_line (start -0.602064 0.91) (end 0.602064 0.91) (layer B.SilkS) (width 0.12))
    (fp_line (start -0.602064 -0.91) (end 0.602064 -0.91) (layer B.SilkS) (width 0.12))
    (fp_line (start -2.45 -1.12) (end -2.45 1.12) (layer B.CrtYd) (width 0.05))
    (fp_line (start -2.45 1.12) (end 2.45 1.12) (layer B.CrtYd) (width 0.05))
    (fp_line (start 2.45 1.12) (end 2.45 -1.12) (layer B.CrtYd) (width 0.05))
    (fp_line (start 2.45 -1.12) (end -2.45 -1.12) (layer B.CrtYd) (width 0.05))
    (fp_text user %R (at 0 0) (layer B.Fab)
      (effects (font (size 0.8 0.8) (thickness 0.12)) (justify mirror))
    )
    (pad 1 smd roundrect (at -1.4875 0 180) (size 1.425 1.75) (layers B.Cu B.Paste B.Mask) (roundrect_rratio 0.175439)
      (net 2 +3.3VP))
    (pad 2 smd roundrect (at 1.4875 0 180) (size 1.425 1.75) (layers B.Cu B.Paste B.Mask) (roundrect_rratio 0.175439)
      (net 1 GND))
    (model ${KISYS3DMOD}/Capacitor_SMD.3dshapes/C_1206_3216Metric.wrl
      (at (xyz 0 0 0))
      (scale (xyz 1 1 1))
      (rotate (xyz 0 0 0))
    )
  )

  (module Capacitor_SMD:C_1206_3216Metric_Pad1.42x1.75mm_HandSolder (layer B.Cu) (tedit 5B301BBE) (tstamp 5D2725A5)
    (at 90.92692 120.96402 90)
    (descr "Capacitor SMD 1206 (3216 Metric), square (rectangular) end terminal, IPC_7351 nominal with elongated pad for handsoldering. (Body size source: http://www.tortai-tech.com/upload/download/2011102023233369053.pdf), generated with kicad-footprint-generator")
    (tags "capacitor handsolder")
    (path /5B5B4E91/5B65FC15)
    (attr smd)
    (fp_text reference C3 (at 0 1.82 90) (layer B.SilkS)
      (effects (font (size 1 1) (thickness 0.15)) (justify mirror))
    )
    (fp_text value C (at 0 -1.82 90) (layer B.Fab)
      (effects (font (size 1 1) (thickness 0.15)) (justify mirror))
    )
    (fp_line (start -1.6 -0.8) (end -1.6 0.8) (layer B.Fab) (width 0.1))
    (fp_line (start -1.6 0.8) (end 1.6 0.8) (layer B.Fab) (width 0.1))
    (fp_line (start 1.6 0.8) (end 1.6 -0.8) (layer B.Fab) (width 0.1))
    (fp_line (start 1.6 -0.8) (end -1.6 -0.8) (layer B.Fab) (width 0.1))
    (fp_line (start -0.602064 0.91) (end 0.602064 0.91) (layer B.SilkS) (width 0.12))
    (fp_line (start -0.602064 -0.91) (end 0.602064 -0.91) (layer B.SilkS) (width 0.12))
    (fp_line (start -2.45 -1.12) (end -2.45 1.12) (layer B.CrtYd) (width 0.05))
    (fp_line (start -2.45 1.12) (end 2.45 1.12) (layer B.CrtYd) (width 0.05))
    (fp_line (start 2.45 1.12) (end 2.45 -1.12) (layer B.CrtYd) (width 0.05))
    (fp_line (start 2.45 -1.12) (end -2.45 -1.12) (layer B.CrtYd) (width 0.05))
    (fp_text user %R (at 0 0) (layer B.Fab)
      (effects (font (size 0.8 0.8) (thickness 0.12)) (justify mirror))
    )
    (pad 1 smd roundrect (at -1.4875 0 90) (size 1.425 1.75) (layers B.Cu B.Paste B.Mask) (roundrect_rratio 0.175439)
      (net 6 "/CPU PIC18lF26f20/Vbat"))
    (pad 2 smd roundrect (at 1.4875 0 90) (size 1.425 1.75) (layers B.Cu B.Paste B.Mask) (roundrect_rratio 0.175439)
      (net 1 GND))
    (model ${KISYS3DMOD}/Capacitor_SMD.3dshapes/C_1206_3216Metric.wrl
      (at (xyz 0 0 0))
      (scale (xyz 1 1 1))
      (rotate (xyz 0 0 0))
    )
  )

  (module Capacitor_SMD:C_1206_3216Metric_Pad1.42x1.75mm_HandSolder (layer B.Cu) (tedit 5B301BBE) (tstamp 5D271869)
    (at 104.13492 129.63652 180)
    (descr "Capacitor SMD 1206 (3216 Metric), square (rectangular) end terminal, IPC_7351 nominal with elongated pad for handsoldering. (Body size source: http://www.tortai-tech.com/upload/download/2011102023233369053.pdf), generated with kicad-footprint-generator")
    (tags "capacitor handsolder")
    (path /5B5B4E91/5B655FA3)
    (attr smd)
    (fp_text reference C4 (at 0 1.82) (layer B.SilkS)
      (effects (font (size 1 1) (thickness 0.15)) (justify mirror))
    )
    (fp_text value CP (at 0 -1.82) (layer B.Fab)
      (effects (font (size 1 1) (thickness 0.15)) (justify mirror))
    )
    (fp_text user %R (at 0 0) (layer B.Fab)
      (effects (font (size 0.8 0.8) (thickness 0.12)) (justify mirror))
    )
    (fp_line (start 2.45 -1.12) (end -2.45 -1.12) (layer B.CrtYd) (width 0.05))
    (fp_line (start 2.45 1.12) (end 2.45 -1.12) (layer B.CrtYd) (width 0.05))
    (fp_line (start -2.45 1.12) (end 2.45 1.12) (layer B.CrtYd) (width 0.05))
    (fp_line (start -2.45 -1.12) (end -2.45 1.12) (layer B.CrtYd) (width 0.05))
    (fp_line (start -0.602064 -0.91) (end 0.602064 -0.91) (layer B.SilkS) (width 0.12))
    (fp_line (start -0.602064 0.91) (end 0.602064 0.91) (layer B.SilkS) (width 0.12))
    (fp_line (start 1.6 -0.8) (end -1.6 -0.8) (layer B.Fab) (width 0.1))
    (fp_line (start 1.6 0.8) (end 1.6 -0.8) (layer B.Fab) (width 0.1))
    (fp_line (start -1.6 0.8) (end 1.6 0.8) (layer B.Fab) (width 0.1))
    (fp_line (start -1.6 -0.8) (end -1.6 0.8) (layer B.Fab) (width 0.1))
    (pad 2 smd roundrect (at 1.4875 0 180) (size 1.425 1.75) (layers B.Cu B.Paste B.Mask) (roundrect_rratio 0.175439)
      (net 1 GND))
    (pad 1 smd roundrect (at -1.4875 0 180) (size 1.425 1.75) (layers B.Cu B.Paste B.Mask) (roundrect_rratio 0.175439)
      (net 2 +3.3VP))
    (model ${KISYS3DMOD}/Capacitor_SMD.3dshapes/C_1206_3216Metric.wrl
      (at (xyz 0 0 0))
      (scale (xyz 1 1 1))
      (rotate (xyz 0 0 0))
    )
  )

  (module Resistor_SMD:R_0805_2012Metric_Pad1.15x1.40mm_HandSolder (layer F.Cu) (tedit 5B36C52B) (tstamp 5D26FFD0)
    (at 148.83892 85.94852)
    (descr "Resistor SMD 0805 (2012 Metric), square (rectangular) end terminal, IPC_7351 nominal with elongated pad for handsoldering. (Body size source: https://docs.google.com/spreadsheets/d/1BsfQQcO9C6DZCsRaXUlFlo91Tg2WpOkGARC1WS5S8t0/edit?usp=sharing), generated with kicad-footprint-generator")
    (tags "resistor handsolder")
    (path /5B5B4E91/5B6C7F68)
    (attr smd)
    (fp_text reference R7 (at 0 -1.65) (layer F.SilkS)
      (effects (font (size 1 1) (thickness 0.15)))
    )
    (fp_text value R (at 0 1.65) (layer F.Fab)
      (effects (font (size 1 1) (thickness 0.15)))
    )
    (fp_line (start -1 0.6) (end -1 -0.6) (layer F.Fab) (width 0.1))
    (fp_line (start -1 -0.6) (end 1 -0.6) (layer F.Fab) (width 0.1))
    (fp_line (start 1 -0.6) (end 1 0.6) (layer F.Fab) (width 0.1))
    (fp_line (start 1 0.6) (end -1 0.6) (layer F.Fab) (width 0.1))
    (fp_line (start -0.261252 -0.71) (end 0.261252 -0.71) (layer F.SilkS) (width 0.12))
    (fp_line (start -0.261252 0.71) (end 0.261252 0.71) (layer F.SilkS) (width 0.12))
    (fp_line (start -1.85 0.95) (end -1.85 -0.95) (layer F.CrtYd) (width 0.05))
    (fp_line (start -1.85 -0.95) (end 1.85 -0.95) (layer F.CrtYd) (width 0.05))
    (fp_line (start 1.85 -0.95) (end 1.85 0.95) (layer F.CrtYd) (width 0.05))
    (fp_line (start 1.85 0.95) (end -1.85 0.95) (layer F.CrtYd) (width 0.05))
    (fp_text user %R (at 0 0) (layer F.Fab)
      (effects (font (size 0.5 0.5) (thickness 0.08)))
    )
    (pad 1 smd roundrect (at -1.025 0) (size 1.15 1.4) (layers F.Cu F.Paste F.Mask) (roundrect_rratio 0.217391)
      (net 1 GND))
    (pad 2 smd roundrect (at 1.025 0) (size 1.15 1.4) (layers F.Cu F.Paste F.Mask) (roundrect_rratio 0.217391)
      (net 1 GND))
    (model ${KISYS3DMOD}/Resistor_SMD.3dshapes/R_0805_2012Metric.wrl
      (at (xyz 0 0 0))
      (scale (xyz 1 1 1))
      (rotate (xyz 0 0 0))
    )
  )

  (module Resistor_SMD:R_0805_2012Metric_Pad1.15x1.40mm_HandSolder (layer F.Cu) (tedit 5B36C52B) (tstamp 5D26FFE1)
    (at 150.36292 96.10852)
    (descr "Resistor SMD 0805 (2012 Metric), square (rectangular) end terminal, IPC_7351 nominal with elongated pad for handsoldering. (Body size source: https://docs.google.com/spreadsheets/d/1BsfQQcO9C6DZCsRaXUlFlo91Tg2WpOkGARC1WS5S8t0/edit?usp=sharing), generated with kicad-footprint-generator")
    (tags "resistor handsolder")
    (path /5B5B4E91/5B6CEE58)
    (attr smd)
    (fp_text reference R10 (at 0 -1.65) (layer F.SilkS)
      (effects (font (size 1 1) (thickness 0.15)))
    )
    (fp_text value R (at 0 1.65) (layer F.Fab)
      (effects (font (size 1 1) (thickness 0.15)))
    )
    (fp_text user %R (at 0 0) (layer F.Fab)
      (effects (font (size 0.5 0.5) (thickness 0.08)))
    )
    (fp_line (start 1.85 0.95) (end -1.85 0.95) (layer F.CrtYd) (width 0.05))
    (fp_line (start 1.85 -0.95) (end 1.85 0.95) (layer F.CrtYd) (width 0.05))
    (fp_line (start -1.85 -0.95) (end 1.85 -0.95) (layer F.CrtYd) (width 0.05))
    (fp_line (start -1.85 0.95) (end -1.85 -0.95) (layer F.CrtYd) (width 0.05))
    (fp_line (start -0.261252 0.71) (end 0.261252 0.71) (layer F.SilkS) (width 0.12))
    (fp_line (start -0.261252 -0.71) (end 0.261252 -0.71) (layer F.SilkS) (width 0.12))
    (fp_line (start 1 0.6) (end -1 0.6) (layer F.Fab) (width 0.1))
    (fp_line (start 1 -0.6) (end 1 0.6) (layer F.Fab) (width 0.1))
    (fp_line (start -1 -0.6) (end 1 -0.6) (layer F.Fab) (width 0.1))
    (fp_line (start -1 0.6) (end -1 -0.6) (layer F.Fab) (width 0.1))
    (pad 2 smd roundrect (at 1.025 0) (size 1.15 1.4) (layers F.Cu F.Paste F.Mask) (roundrect_rratio 0.217391)
      (net 1 GND))
    (pad 1 smd roundrect (at -1.025 0) (size 1.15 1.4) (layers F.Cu F.Paste F.Mask) (roundrect_rratio 0.217391)
      (net 1 GND))
    (model ${KISYS3DMOD}/Resistor_SMD.3dshapes/R_0805_2012Metric.wrl
      (at (xyz 0 0 0))
      (scale (xyz 1 1 1))
      (rotate (xyz 0 0 0))
    )
  )

  (module Connector_PinHeader_1.27mm:PinHeader_1x05_P1.27mm_Vertical (layer F.Cu) (tedit 59FED6E3) (tstamp 5D273FDC)
    (at 104.13492 100.17252 270)
    (descr "Through hole straight pin header, 1x05, 1.27mm pitch, single row")
    (tags "Through hole pin header THT 1x05 1.27mm single row")
    (path /5B5B4E89/5B5B5661)
    (fp_text reference J1 (at 0 -1.695 90) (layer F.SilkS)
      (effects (font (size 1 1) (thickness 0.15)))
    )
    (fp_text value Conn_01x05_Male (at 0 6.775 90) (layer F.Fab)
      (effects (font (size 1 1) (thickness 0.15)))
    )
    (fp_line (start -0.525 -0.635) (end 1.05 -0.635) (layer F.Fab) (width 0.1))
    (fp_line (start 1.05 -0.635) (end 1.05 5.715) (layer F.Fab) (width 0.1))
    (fp_line (start 1.05 5.715) (end -1.05 5.715) (layer F.Fab) (width 0.1))
    (fp_line (start -1.05 5.715) (end -1.05 -0.11) (layer F.Fab) (width 0.1))
    (fp_line (start -1.05 -0.11) (end -0.525 -0.635) (layer F.Fab) (width 0.1))
    (fp_line (start -1.11 5.775) (end -0.30753 5.775) (layer F.SilkS) (width 0.12))
    (fp_line (start 0.30753 5.775) (end 1.11 5.775) (layer F.SilkS) (width 0.12))
    (fp_line (start -1.11 0.76) (end -1.11 5.775) (layer F.SilkS) (width 0.12))
    (fp_line (start 1.11 0.76) (end 1.11 5.775) (layer F.SilkS) (width 0.12))
    (fp_line (start -1.11 0.76) (end -0.563471 0.76) (layer F.SilkS) (width 0.12))
    (fp_line (start 0.563471 0.76) (end 1.11 0.76) (layer F.SilkS) (width 0.12))
    (fp_line (start -1.11 0) (end -1.11 -0.76) (layer F.SilkS) (width 0.12))
    (fp_line (start -1.11 -0.76) (end 0 -0.76) (layer F.SilkS) (width 0.12))
    (fp_line (start -1.55 -1.15) (end -1.55 6.25) (layer F.CrtYd) (width 0.05))
    (fp_line (start -1.55 6.25) (end 1.55 6.25) (layer F.CrtYd) (width 0.05))
    (fp_line (start 1.55 6.25) (end 1.55 -1.15) (layer F.CrtYd) (width 0.05))
    (fp_line (start 1.55 -1.15) (end -1.55 -1.15) (layer F.CrtYd) (width 0.05))
    (fp_text user %R (at 0 2.54) (layer F.Fab)
      (effects (font (size 1 1) (thickness 0.15)))
    )
    (pad 1 thru_hole rect (at 0 0 270) (size 1 1) (drill 0.65) (layers *.Cu *.Mask)
      (net 9 "/CPU PIC18lF26f20/VPP"))
    (pad 2 thru_hole oval (at 0 1.27 270) (size 1 1) (drill 0.65) (layers *.Cu *.Mask)
      (net 2 +3.3VP))
    (pad 3 thru_hole oval (at 0 2.54 270) (size 1 1) (drill 0.65) (layers *.Cu *.Mask)
      (net 1 GND))
    (pad 4 thru_hole oval (at 0 3.81 270) (size 1 1) (drill 0.65) (layers *.Cu *.Mask)
      (net 10 "/CPU PIC18lF26f20/PGD"))
    (pad 5 thru_hole oval (at 0 5.08 270) (size 1 1) (drill 0.65) (layers *.Cu *.Mask)
      (net 11 "/CPU PIC18lF26f20/PGC"))
    (model ${KISYS3DMOD}/Connector_PinHeader_1.27mm.3dshapes/PinHeader_1x05_P1.27mm_Vertical.wrl
      (at (xyz 0 0 0))
      (scale (xyz 1 1 1))
      (rotate (xyz 0 0 0))
    )
  )

  (module Battery:BatteryHolder_Keystone_1058_1x2032 (layer F.Cu) (tedit 589EE147) (tstamp 5D271F6E)
    (at 101.42982 119.13362 45)
    (descr http://www.keyelco.com/product-pdf.cfm?p=14028)
    (tags "Keystone type 1058 coin cell retainer")
    (path /5B6B20A1)
    (attr smd)
    (fp_text reference BT1 (at 0 7.62 45) (layer F.SilkS)
      (effects (font (size 1 1) (thickness 0.15)))
    )
    (fp_text value Battery_Cell (at 0 -9.398 45) (layer F.Fab)
      (effects (font (size 1 1) (thickness 0.15)))
    )
    (fp_text user %R (at -1.6637 -3.5814 45) (layer F.Fab)
      (effects (font (size 1 1) (thickness 0.15)))
    )
    (fp_arc (start 0 0) (end 11.06 4.11) (angle 139.2) (layer F.CrtYd) (width 0.05))
    (fp_arc (start 0 0) (end -11.06 -4.11) (angle 139.2) (layer F.CrtYd) (width 0.05))
    (fp_line (start 11.06 4.11) (end 16.45 4.11) (layer F.CrtYd) (width 0.05))
    (fp_line (start 16.45 4.11) (end 16.45 -4.11) (layer F.CrtYd) (width 0.05))
    (fp_line (start 16.45 -4.11) (end 11.06 -4.11) (layer F.CrtYd) (width 0.05))
    (fp_line (start -16.45 -4.11) (end -11.06 -4.11) (layer F.CrtYd) (width 0.05))
    (fp_line (start -16.45 -4.11) (end -16.45 4.11) (layer F.CrtYd) (width 0.05))
    (fp_line (start -16.45 4.11) (end -11.06 4.11) (layer F.CrtYd) (width 0.05))
    (fp_arc (start 0 0) (end -10.692 3.61) (angle -27.3) (layer F.SilkS) (width 0.12))
    (fp_arc (start 0 0) (end 10.692 -3.61) (angle -27.3) (layer F.SilkS) (width 0.12))
    (fp_arc (start 0 0) (end 10.692 3.61) (angle 27.3) (layer F.SilkS) (width 0.12))
    (fp_arc (start 0 0) (end -10.692 -3.61) (angle 27.3) (layer F.SilkS) (width 0.12))
    (fp_line (start -14.31 1.9) (end -14.31 3.61) (layer F.SilkS) (width 0.12))
    (fp_line (start -10.692 3.61) (end -14.31 3.61) (layer F.SilkS) (width 0.12))
    (fp_line (start -3.86 8.11) (end -7.8473 8.11) (layer F.SilkS) (width 0.12))
    (fp_line (start -1.66 5.91) (end -3.86 8.11) (layer F.SilkS) (width 0.12))
    (fp_line (start 1.66 5.91) (end -1.66 5.91) (layer F.SilkS) (width 0.12))
    (fp_line (start 1.66 5.91) (end 3.86 8.11) (layer F.SilkS) (width 0.12))
    (fp_line (start 7.8473 8.11) (end 3.86 8.11) (layer F.SilkS) (width 0.12))
    (fp_line (start 14.31 1.9) (end 14.31 3.61) (layer F.SilkS) (width 0.12))
    (fp_line (start 14.31 3.61) (end 10.692 3.61) (layer F.SilkS) (width 0.12))
    (fp_line (start 10.692 -3.61) (end 14.31 -3.61) (layer F.SilkS) (width 0.12))
    (fp_line (start 14.31 -1.9) (end 14.31 -3.61) (layer F.SilkS) (width 0.12))
    (fp_line (start -7.8473 -8.11) (end 7.8473 -8.11) (layer F.SilkS) (width 0.12))
    (fp_line (start -14.31 -1.9) (end -14.31 -3.61) (layer F.SilkS) (width 0.12))
    (fp_line (start -14.31 -3.61) (end -10.692 -3.61) (layer F.SilkS) (width 0.12))
    (fp_arc (start 0 0) (end -10.61275 3.5) (angle -27.4635) (layer F.Fab) (width 0.1))
    (fp_arc (start 0 0) (end 10.61275 -3.5) (angle -27.4635) (layer F.Fab) (width 0.1))
    (fp_arc (start 0 0) (end 10.61275 3.5) (angle 27.4635) (layer F.Fab) (width 0.1))
    (fp_line (start 14.2 1.9) (end 14.2 3.5) (layer F.Fab) (width 0.1))
    (fp_line (start 14.2 3.5) (end 10.61275 3.5) (layer F.Fab) (width 0.1))
    (fp_line (start 10.61275 -3.5) (end 14.2 -3.5) (layer F.Fab) (width 0.1))
    (fp_line (start 14.2 -3.5) (end 14.2 -1.9) (layer F.Fab) (width 0.1))
    (fp_line (start -14.2 1.9) (end -14.2 3.5) (layer F.Fab) (width 0.1))
    (fp_line (start -14.2 3.5) (end -10.61275 3.5) (layer F.Fab) (width 0.1))
    (fp_line (start 3.9 8) (end 7.8026 8) (layer F.Fab) (width 0.1))
    (fp_line (start 1.7 5.8) (end 3.9 8) (layer F.Fab) (width 0.1))
    (fp_line (start -1.7 5.8) (end -3.9 8) (layer F.Fab) (width 0.1))
    (fp_line (start -1.7 5.8) (end 1.7 5.8) (layer F.Fab) (width 0.1))
    (fp_line (start -14.2 -3.5) (end -10.61275 -3.5) (layer F.Fab) (width 0.1))
    (fp_line (start -14.2 -3.5) (end -14.2 -1.9) (layer F.Fab) (width 0.1))
    (fp_line (start -3.9 8) (end -7.8026 8) (layer F.Fab) (width 0.1))
    (fp_line (start -7.8026 -8) (end 7.8026 -8) (layer F.Fab) (width 0.1))
    (fp_arc (start 0 0) (end -10.61275 -3.5) (angle 27.4635) (layer F.Fab) (width 0.1))
    (fp_circle (center 0 0) (end 10 0) (layer Dwgs.User) (width 0.15))
    (pad 1 smd rect (at -14.68 0 45) (size 2.54 3.51) (layers F.Cu F.Paste F.Mask)
      (net 20 "Net-(BT1-Pad1)"))
    (pad 2 smd rect (at 14.68 0 45) (size 2.54 3.51) (layers F.Cu F.Paste F.Mask)
      (net 1 GND))
    (model ${KISYS3DMOD}/Battery.3dshapes/BatteryHolder_Keystone_1058_1x2032.wrl
      (at (xyz 0 0 0))
      (scale (xyz 1 1 1))
      (rotate (xyz 0 0 0))
    )
  )

  (dimension 20.32 (width 0.15) (layer F.SilkS)
    (gr_text "20,320 mm" (at 115.31092 80.07652) (layer F.SilkS)
      (effects (font (size 1 1) (thickness 0.15)))
    )
    (feature1 (pts (xy 125.47092 140.81252) (xy 125.47092 80.790099)))
    (feature2 (pts (xy 105.15092 140.81252) (xy 105.15092 80.790099)))
    (crossbar (pts (xy 105.15092 81.37652) (xy 125.47092 81.37652)))
    (arrow1a (pts (xy 125.47092 81.37652) (xy 124.344416 81.962941)))
    (arrow1b (pts (xy 125.47092 81.37652) (xy 124.344416 80.790099)))
    (arrow2a (pts (xy 105.15092 81.37652) (xy 106.277424 81.962941)))
    (arrow2b (pts (xy 105.15092 81.37652) (xy 106.277424 80.790099)))
  )
  (dimension 20.32 (width 0.15) (layer F.SilkS) (tstamp 5D2765E3)
    (gr_text "20,320 mm" (at 137.94692 121.50852 270) (layer F.SilkS) (tstamp 5D2765E3)
      (effects (font (size 1 1) (thickness 0.15)))
    )
    (feature1 (pts (xy 93.97492 131.66852) (xy 137.233341 131.66852)))
    (feature2 (pts (xy 93.97492 111.34852) (xy 137.233341 111.34852)))
    (crossbar (pts (xy 136.64692 111.34852) (xy 136.64692 131.66852)))
    (arrow1a (pts (xy 136.64692 131.66852) (xy 136.060499 130.542016)))
    (arrow1b (pts (xy 136.64692 131.66852) (xy 137.233341 130.542016)))
    (arrow2a (pts (xy 136.64692 111.34852) (xy 136.060499 112.475024)))
    (arrow2b (pts (xy 136.64692 111.34852) (xy 137.233341 112.475024)))
  )
  (gr_circle (center 101.46792 120.11152) (end 112.89792 117.57152) (layer B.SilkS) (width 0.15) (tstamp 5D271CE4))
  (gr_circle (center 98.92792 129.00152) (end 100.83292 127.73152) (layer B.SilkS) (width 0.15))
  (gr_circle (center 98.92792 112.49152) (end 101.46792 109.31652) (layer B.SilkS) (width 0.15))
  (gr_circle (center 115.01572 106.01844) (end 123.05792 102.96652) (layer B.SilkS) (width 0.15))
  (gr_line (start 95.11792 114.39652) (end 95.11792 96.61652) (angle 90) (layer Edge.Cuts) (width 0.15) (tstamp 5D263B21))
  (dimension 2.54 (width 0.15) (layer F.SilkS)
    (gr_text "2,540 mm" (at 28.47292 48.35652 90) (layer F.SilkS)
      (effects (font (size 1 1) (thickness 0.15)))
    )
    (feature1 (pts (xy 23.36292 47.08652) (xy 27.759341 47.08652)))
    (feature2 (pts (xy 23.36292 49.62652) (xy 27.759341 49.62652)))
    (crossbar (pts (xy 27.17292 49.62652) (xy 27.17292 47.08652)))
    (arrow1a (pts (xy 27.17292 47.08652) (xy 27.759341 48.213024)))
    (arrow1b (pts (xy 27.17292 47.08652) (xy 26.586499 48.213024)))
    (arrow2a (pts (xy 27.17292 49.62652) (xy 27.759341 48.500016)))
    (arrow2b (pts (xy 27.17292 49.62652) (xy 26.586499 48.500016)))
  )
  (dimension 40.64 (width 0.15) (layer Eco2.User)
    (gr_text "40,640 mm" (at -63.02708 67.40652 90) (layer Eco2.User)
      (effects (font (size 1 1) (thickness 0.15)))
    )
    (feature1 (pts (xy -49.02708 47.08652) (xy -62.313501 47.08652)))
    (feature2 (pts (xy -49.02708 87.72652) (xy -62.313501 87.72652)))
    (crossbar (pts (xy -61.72708 87.72652) (xy -61.72708 47.08652)))
    (arrow1a (pts (xy -61.72708 47.08652) (xy -61.140659 48.213024)))
    (arrow1b (pts (xy -61.72708 47.08652) (xy -62.313501 48.213024)))
    (arrow2a (pts (xy -61.72708 87.72652) (xy -61.140659 86.600016)))
    (arrow2b (pts (xy -61.72708 87.72652) (xy -62.313501 86.600016)))
  )
  (dimension 69.85 (width 0.15) (layer Eco2.User) (tstamp 5D25AD28)
    (gr_text "69,850 mm" (at -15.37208 33.08652) (layer Eco2.User) (tstamp 5D25AD28)
      (effects (font (size 1 1) (thickness 0.15)))
    )
    (feature1 (pts (xy 19.55292 53.43652) (xy 19.55292 33.800099)))
    (feature2 (pts (xy -50.29708 53.43652) (xy -50.29708 33.800099)))
    (crossbar (pts (xy -50.29708 34.38652) (xy 19.55292 34.38652)))
    (arrow1a (pts (xy 19.55292 34.38652) (xy 18.426416 34.972941)))
    (arrow1b (pts (xy 19.55292 34.38652) (xy 18.426416 33.800099)))
    (arrow2a (pts (xy -50.29708 34.38652) (xy -49.170576 34.972941)))
    (arrow2b (pts (xy -50.29708 34.38652) (xy -49.170576 33.800099)))
  )
  (gr_line (start 95.11792 96.61652) (end 125.36292 96.61652) (angle 90) (layer Edge.Cuts) (width 0.15))
  (gr_line (start 125.36292 131.71652) (end 125.36292 96.61652) (angle 90) (layer Edge.Cuts) (width 0.15) (tstamp 5D264314))
  (gr_line (start 83.68792 131.71652) (end 83.68792 114.39652) (angle 90) (layer Edge.Cuts) (width 0.15))
  (gr_line (start 83.68792 114.39652) (end 95.11792 114.39652) (angle 90) (layer Edge.Cuts) (width 0.15) (tstamp 5D263698))
  (gr_line (start 83.68792 131.71652) (end 125.36292 131.71652) (angle 90) (layer Edge.Cuts) (width 0.15) (tstamp 5D264306))

  (via (at 98.03892 129.63652) (size 3) (drill 0.75) (layers F.Cu B.Cu) (net 1) (tstamp 5D2661F2))
  (segment (start 100.07092 119.98452) (end 100.07092 118.46052) (width 0.4) (layer B.Cu) (net 1))
  (segment (start 119.37492 126.58852) (end 117.34292 126.58852) (width 0.25) (layer B.Cu) (net 2) (status 30))
  (segment (start 119.87392 126.58852) (end 119.87392 124.56552) (width 0.25) (layer B.Cu) (net 2) (status 10))
  (segment (start 119.87392 124.56552) (end 120.34992 124.08952) (width 0.25) (layer B.Cu) (net 2))
  (segment (start 100.07092 122.18452) (end 100.07092 123.54052) (width 0.4) (layer B.Cu) (net 2))
  (segment (start 105.65892 126.58852) (end 105.65892 125.57252) (width 0.5) (layer B.Cu) (net 2))
  (segment (start 104.64292 124.55652) (end 104.64292 123.55852) (width 0.5) (layer B.Cu) (net 2))
  (segment (start 105.65892 126.58852) (end 109.19692 126.58852) (width 0.5) (layer B.Cu) (net 2))
  (segment (start 105.65892 129.60002) (end 105.62242 129.63652) (width 0.5) (layer B.Cu) (net 2))
  (segment (start 105.65892 126.58852) (end 105.65892 129.60002) (width 0.5) (layer B.Cu) (net 2))
  (segment (start 109.21492 129.63652) (end 107.18292 129.63652) (width 0.5) (layer B.Cu) (net 2))
  (segment (start 110.73892 131.16052) (end 109.21492 129.63652) (width 0.5) (layer B.Cu) (net 2))
  (segment (start 115.764026 131.16052) (end 110.73892 131.16052) (width 0.5) (layer B.Cu) (net 2))
  (segment (start 116.58092 129.63652) (end 116.58092 130.343626) (width 0.5) (layer B.Cu) (net 2))
  (segment (start 116.58092 130.343626) (end 115.764026 131.16052) (width 0.5) (layer B.Cu) (net 2))
  (segment (start 107.18292 129.63652) (end 105.62242 129.63652) (width 0.5) (layer B.Cu) (net 2))
  (segment (start 105.15092 125.06452) (end 104.64292 124.55652) (width 0.5) (layer B.Cu) (net 2))
  (segment (start 104.394176 125.06452) (end 105.15092 125.06452) (width 0.5) (layer B.Cu) (net 2))
  (segment (start 105.65892 125.57252) (end 105.15092 125.06452) (width 0.5) (layer B.Cu) (net 2))
  (segment (start 100.07092 123.54052) (end 100.07092 124.55652) (width 0.5) (layer B.Cu) (net 2))
  (segment (start 100.07092 124.55652) (end 100.57892 125.06452) (width 0.5) (layer B.Cu) (net 2))
  (segment (start 100.57892 125.06452) (end 104.394176 125.06452) (width 0.5) (layer B.Cu) (net 2))
  (segment (start 102.86492 102.97552) (end 103.10992 103.22052) (width 0.4) (layer B.Cu) (net 2))
  (segment (start 102.86492 100.17252) (end 102.86492 102.97552) (width 0.4) (layer B.Cu) (net 2))
  (segment (start 103.10992 104.22752) (end 103.65293 104.77053) (width 0.25) (layer B.Cu) (net 2))
  (segment (start 103.10992 103.22052) (end 103.10992 104.22752) (width 0.25) (layer B.Cu) (net 2))
  (segment (start 103.65293 104.77053) (end 105.958454 104.77053) (width 0.25) (layer B.Cu) (net 2))
  (segment (start 105.958454 104.77053) (end 113.78692 112.598996) (width 0.25) (layer B.Cu) (net 2))
  (segment (start 124.96292 107.79252) (end 123.43892 106.26852) (width 0.25) (layer B.Cu) (net 2))
  (segment (start 123.43892 106.26852) (end 121.91492 106.26852) (width 0.25) (layer B.Cu) (net 2))
  (segment (start 121.40692 106.77652) (end 121.40692 107.80852) (width 0.25) (layer B.Cu) (net 2))
  (segment (start 121.91492 106.26852) (end 121.40692 106.77652) (width 0.25) (layer B.Cu) (net 2))
  (segment (start 120.99992 123.69352) (end 120.99992 122.56852) (width 0.25) (layer B.Cu) (net 4) (status 20))
  (segment (start 117.85092 129.12852) (end 118.86692 128.11252) (width 0.25) (layer B.Cu) (net 4))
  (segment (start 119.75451 128.11252) (end 120.39092 127.47611) (width 0.25) (layer B.Cu) (net 4))
  (segment (start 120.39092 125.19293) (end 120.99992 124.58393) (width 0.25) (layer B.Cu) (net 4))
  (segment (start 118.86692 128.11252) (end 119.75451 128.11252) (width 0.25) (layer B.Cu) (net 4))
  (segment (start 120.99992 124.58393) (end 120.99992 123.69352) (width 0.25) (layer B.Cu) (net 4))
  (segment (start 120.39092 127.47611) (end 120.39092 125.19293) (width 0.25) (layer B.Cu) (net 4))
  (segment (start 121.40692 126.58852) (end 121.40692 127.359135) (width 0.25) (layer B.Cu) (net 4))
  (segment (start 121.40692 127.359135) (end 119.88292 129.12852) (width 0.25) (layer B.Cu) (net 4))
  (segment (start 121.64992 122.56852) (end 121.64992 126.31452) (width 0.25) (layer B.Cu) (net 4))
  (segment (start 121.64992 126.31452) (end 121.40692 126.58852) (width 0.25) (layer B.Cu) (net 4))
  (segment (start 99.12092 119.98452) (end 99.12092 118.52652) (width 0.4) (layer B.Cu) (net 5))
  (segment (start 94.99092 119.47652) (end 94.99092 118.46052) (width 0.5) (layer B.Cu) (net 5))
  (segment (start 94.99092 118.46052) (end 96.00692 117.44452) (width 0.5) (layer B.Cu) (net 5))
  (segment (start 96.00692 117.44452) (end 98.54692 117.44452) (width 0.5) (layer B.Cu) (net 5))
  (segment (start 99.12092 118.01852) (end 99.12092 118.52652) (width 0.5) (layer B.Cu) (net 5))
  (segment (start 98.54692 117.44452) (end 99.12092 118.01852) (width 0.5) (layer B.Cu) (net 5))
  (segment (start 99.12092 122.18452) (end 99.12092 123.47452) (width 0.4) (layer B.Cu) (net 6))
  (segment (start 94.99092 122.45152) (end 94.99092 123.54052) (width 0.5) (layer B.Cu) (net 6))
  (segment (start 94.99092 123.54052) (end 96.00692 124.55652) (width 0.5) (layer B.Cu) (net 6))
  (segment (start 96.00692 124.55652) (end 98.54692 124.55652) (width 0.5) (layer B.Cu) (net 6))
  (segment (start 99.12092 123.98252) (end 99.12092 123.47452) (width 0.5) (layer B.Cu) (net 6))
  (segment (start 98.54692 124.55652) (end 99.12092 123.98252) (width 0.5) (layer B.Cu) (net 6))
  (segment (start 90.92692 122.45152) (end 92.88592 122.45152) (width 0.5) (layer B.Cu) (net 6))
  (segment (start 92.88592 122.45152) (end 94.99092 122.45152) (width 0.5) (layer B.Cu) (net 6))
  (segment (start 92.88592 117.44452) (end 92.88592 122.37852) (width 0.5) (layer B.Cu) (net 6))
  (segment (start 93.97492 116.42852) (end 92.88592 117.51752) (width 0.5) (layer B.Cu) (net 6))
  (segment (start 99.13292 114.19152) (end 99.13292 116.15752) (width 0.5) (layer B.Cu) (net 6))
  (segment (start 98.86192 116.42852) (end 93.97492 116.42852) (width 0.5) (layer B.Cu) (net 6))
  (segment (start 99.13292 116.15752) (end 98.86192 116.42852) (width 0.5) (layer B.Cu) (net 6))
  (segment (start 105.03492 100.17252) (end 104.13492 100.17252) (width 0.4) (layer B.Cu) (net 9))
  (segment (start 105.15992 100.29752) (end 105.03492 100.17252) (width 0.4) (layer B.Cu) (net 9))
  (segment (start 105.15992 103.22052) (end 105.15992 100.29752) (width 0.4) (layer B.Cu) (net 9))
  (segment (start 105.15992 103.22052) (end 105.15992 104.24552) (width 0.4) (layer B.Cu) (net 9))
  (segment (start 115.14992 113.38052) (end 115.14992 113.21952) (width 0.4) (layer B.Cu) (net 9))
  (segment (start 106.17592 104.24552) (end 105.15992 104.24552) (width 0.4) (layer B.Cu) (net 9))
  (segment (start 115.14992 113.21952) (end 106.17592 104.24552) (width 0.4) (layer B.Cu) (net 9))
  (segment (start 100.32492 105.76052) (end 100.32492 100.17252) (width 0.4) (layer B.Cu) (net 10))
  (segment (start 101.59492 106.77652) (end 100.32492 105.76052) (width 0.25) (layer B.Cu) (net 10))
  (segment (start 108.70692 109.31652) (end 106.16692 106.77652) (width 0.25) (layer B.Cu) (net 10))
  (segment (start 106.16692 106.77652) (end 101.59492 106.77652) (width 0.25) (layer B.Cu) (net 10))
  (segment (start 99.05492 100.17252) (end 99.05492 106.26852) (width 0.4) (layer B.Cu) (net 11))
  (segment (start 105.65892 107.28452) (end 108.19892 109.82452) (width 0.25) (layer B.Cu) (net 11))
  (segment (start 99.05492 106.26852) (end 100.07092 107.28452) (width 0.25) (layer B.Cu) (net 11))
  (segment (start 100.07092 107.28452) (end 105.65892 107.28452) (width 0.25) (layer B.Cu) (net 11))
  (segment (start 123.59992 123.70152) (end 123.59992 122.56852) (width 0.25) (layer B.Cu) (net 12))
  (segment (start 123.94692 124.04852) (end 123.59992 123.70152) (width 0.25) (layer B.Cu) (net 12))
  (segment (start 123.94692 128.11252) (end 123.94692 124.04852) (width 0.25) (layer B.Cu) (net 12))
  (segment (start 122.93092 128.62052) (end 121.91492 128.62052) (width 0.25) (layer B.Cu) (net 12))
  (segment (start 123.43892 128.11252) (end 122.93092 128.62052) (width 0.25) (layer B.Cu) (net 12))
  (segment (start 123.43892 124.55652) (end 123.43892 128.11252) (width 0.25) (layer B.Cu) (net 12))
  (segment (start 122.94992 122.56852) (end 122.94992 124.06752) (width 0.25) (layer B.Cu) (net 12))
  (segment (start 122.94992 124.06752) (end 123.43892 124.55652) (width 0.25) (layer B.Cu) (net 12))
  (segment (start 122.29992 124.94152) (end 122.93092 125.57252) (width 0.25) (layer B.Cu) (net 13))
  (segment (start 121.657824 128.11252) (end 120.89892 129.12852) (width 0.25) (layer B.Cu) (net 13))
  (segment (start 122.93092 125.57252) (end 122.93092 127.60452) (width 0.25) (layer B.Cu) (net 13))
  (segment (start 122.93092 127.60452) (end 122.42292 128.11252) (width 0.25) (layer B.Cu) (net 13))
  (segment (start 122.42292 128.11252) (end 121.657824 128.11252) (width 0.25) (layer B.Cu) (net 13))
  (segment (start 122.29992 122.56852) (end 122.29992 124.94152) (width 0.25) (layer B.Cu) (net 13))
  (segment (start 101.02092 122.18452) (end 101.02092 123.47452) (width 0.4) (layer B.Cu) (net 17))
  (segment (start 103.11892 121.50852) (end 104.64292 121.50852) (width 0.5) (layer B.Cu) (net 17))
  (segment (start 102.10292 124.04852) (end 102.61092 123.54052) (width 0.5) (layer B.Cu) (net 17))
  (segment (start 102.61092 123.54052) (end 102.61092 122.01652) (width 0.5) (layer B.Cu) (net 17))
  (segment (start 101.59492 124.04852) (end 102.10292 124.04852) (width 0.5) (layer B.Cu) (net 17))
  (segment (start 101.02092 123.47452) (end 101.59492 124.04852) (width 0.5) (layer B.Cu) (net 17))
  (segment (start 102.61092 122.01652) (end 103.11892 121.50852) (width 0.5) (layer B.Cu) (net 17))
  (segment (start 104.64292 118.98652) (end 104.64292 121.50852) (width 0.5) (layer B.Cu) (net 17))
  (segment (start 101.02092 119.98452) (end 101.02092 118.52652) (width 0.4) (layer B.Cu) (net 18))
  (segment (start 101.02092 117.51052) (end 101.02092 118.52652) (width 0.5) (layer B.Cu) (net 18))
  (segment (start 107.18292 111.34852) (end 101.02092 117.51052) (width 0.5) (layer B.Cu) (net 18))
  (segment (start 105.65892 108.30052) (end 107.18292 109.986518) (width 0.5) (layer B.Cu) (net 18))
  (segment (start 107.18292 109.986518) (end 107.18292 111.34852) (width 0.5) (layer B.Cu) (net 18))
  (segment (start 99.56292 108.30052) (end 105.65892 108.30052) (width 0.5) (layer B.Cu) (net 18))
  (segment (start 107.18292 104.11352) (end 107.18292 99.66452) (width 0.5) (layer B.Cu) (net 18))
  (segment (start 107.18292 99.66452) (end 105.65892 98.14052) (width 0.5) (layer B.Cu) (net 18))
  (segment (start 116.44992 113.38052) (end 107.18292 104.11352) (width 0.5) (layer B.Cu) (net 18))
  (segment (start 105.65892 98.14052) (end 98.03892 98.14052) (width 0.5) (layer B.Cu) (net 18))
  (segment (start 97.53092 106.26852) (end 99.56292 108.30052) (width 0.5) (layer B.Cu) (net 18))
  (segment (start 97.53092 98.64852) (end 97.53092 106.26852) (width 0.5) (layer B.Cu) (net 18))
  (segment (start 98.03892 98.14052) (end 97.53092 98.64852) (width 0.5) (layer B.Cu) (net 18))
  (via (at 104.64292 110.33252) (size 3) (drill 0.75) (layers F.Cu B.Cu) (net 20) (tstamp 5D2662F3))

  (zone (net 1) (net_name GND) (layer B.Cu) (tstamp 5D26A81D) (hatch edge 0.508)
    (connect_pads (clearance 0.508))
    (min_thickness 0.254)
    (fill (arc_segments 16) (thermal_gap 0.508) (thermal_bridge_width 0.508))
    (polygon
      (pts
        (xy 125.59792 131.89077) (xy 83.68792 131.54152) (xy 83.68792 114.39652) (xy 95.11792 114.39652) (xy 95.11792 96.61652)
        (xy 125.59792 96.61652)
      )
    )
  )
)
