EESchema Schematic File Version 2
LIBS:74xgxx
LIBS:74xx
LIBS:ac-dc
LIBS:actel
LIBS:adc-dac
LIBS:allegro
LIBS:Altera
LIBS:analog_devices
LIBS:analog_switches
LIBS:atmel
LIBS:audio
LIBS:battery_management
LIBS:bbd
LIBS:bosch
LIBS:brooktre
LIBS:cmos4000
LIBS:cmos_ieee
LIBS:conn
LIBS:contrib
LIBS:cypress
LIBS:dc-dc
LIBS:device
LIBS:digital-audio
LIBS:diode
LIBS:display
LIBS:dsp
LIBS:elec-unifil
LIBS:ESD_Protection
LIBS:ftdi
LIBS:gennum
LIBS:graphic_symbols
LIBS:hc11
LIBS:infineon
LIBS:intel
LIBS:interface
LIBS:intersil
LIBS:ir
LIBS:Lattice
LIBS:leds
LIBS:LEM
LIBS:linear
LIBS:logic_programmable
LIBS:maxim
LIBS:mechanical
LIBS:memory
LIBS:microchip
LIBS:microchip_dspic33dsc
LIBS:microchip_pic10mcu
LIBS:microchip_pic12mcu
LIBS:microchip_pic16mcu
LIBS:microchip_pic18mcu
LIBS:microchip_pic24mcu
LIBS:microchip_pic32mcu
LIBS:microcontrollers
LIBS:modules
LIBS:motor_drivers
LIBS:motorola
LIBS:motors
LIBS:msp430
LIBS:nordicsemi
LIBS:nxp
LIBS:nxp_armmcu
LIBS:onsemi
LIBS:opto
LIBS:Oscillators
LIBS:philips
LIBS:power
LIBS:powerint
LIBS:Power_Management
LIBS:pspice
LIBS:references
LIBS:regul
LIBS:relays
LIBS:rfcom
LIBS:RFSolutions
LIBS:sensors
LIBS:silabs
LIBS:siliconi
LIBS:stm8
LIBS:stm32
LIBS:supertex
LIBS:switches
LIBS:texas
LIBS:transf
LIBS:transistors
LIBS:triac_thyristor
LIBS:ttl_ieee
LIBS:valves
LIBS:video
LIBS:wiznet
LIBS:Worldsemi
LIBS:Xicor
LIBS:xilinx
LIBS:zetex
LIBS:Zilog
LIBS:GateWay_Prot_0,1-cache
EELAYER 25 0
EELAYER END
$Descr A4 11693 8268
encoding utf-8
Sheet 1 4
Title ""
Date ""
Rev ""
Comp ""
Comment1 ""
Comment2 ""
Comment3 ""
Comment4 ""
$EndDescr
$Sheet
S 8300 2450 1300 2800
U 5B57B83E
F0 "CPU PIC18F26K20" 60
F1 "CPU_PIC18F26K20.sch" 60
F2 "VCCP" I L 8300 2600 60 
F3 "VCCD" I R 9600 2500 60 
F4 "VPP" I L 8300 2500 60 
F5 "PGC" I L 8300 2800 60 
F6 "PGD" I L 8300 2700 60 
F7 "GNDD" O R 9600 2600 60 
F8 "SCK" O L 8300 3600 60 
F9 "SDI" I L 8300 3700 60 
F10 "SDO" O L 8300 3800 60 
F11 "CS" O L 8300 3900 60 
F12 "SDA-i2c" I L 8300 4200 60 
F13 "SDO-i2c" I L 8300 4300 60 
F14 "AN0" I R 9600 3850 60 
F15 "AN1" I R 9600 3950 60 
F16 "AN2" I R 9600 4050 60 
F17 "AN3" I R 9600 4200 60 
F18 "AN4" I R 9600 4300 60 
F19 "AN5" I R 9600 4400 60 
F20 "INT0" I L 8300 4650 60 
F21 "INT3/2" I L 8300 4550 60 
F22 "INT1" I L 8300 4750 60 
F23 "AN9" I R 9600 4750 60 
F24 "AN6" I R 9600 4850 60 
F25 "AN7" I R 9600 4950 60 
F26 "RO1" I L 8300 3350 60 
F27 "DI1" O L 8300 3050 60 
F28 "!RE1" O L 8300 3150 60 
F29 "DE1" O L 8300 3250 60 
$EndSheet
$Sheet
S 6800 2450 850  2800
U 5B57B83F
F0 "Puertos_IO" 60
F1 "Puertos_IO.sch" 60
F2 "clkout" I R 7650 4150 60 
F3 "wol" I R 7650 4250 60 
F4 "SDI" I R 7650 3800 60 
F5 "CS" I R 7650 3900 60 
F6 "VCCD" I L 6800 2500 60 
F7 "INT" O R 7650 4350 60 
F8 "SDO" O R 7650 3700 60 
F9 "SCK" I R 7650 3600 60 
F10 "RESET" I R 7650 4450 60 
F11 "GNDD" I L 6800 2600 60 
F12 "VCC1" O L 6800 3200 60 
F13 "RS485-B1" B L 6800 3000 60 
F14 "RS485-A1" B L 6800 2900 60 
F15 "VPP" O R 7650 2500 60 
F16 "VCCP" O R 7650 2600 60 
F17 "PGD" B R 7650 2700 60 
F18 "PGC" O R 7650 2800 60 
F19 "!RE1" I R 7650 3150 60 
F20 "DE1" I R 7650 3250 60 
F21 "DI1" I R 7650 3050 60 
F22 "RO1" O R 7650 3350 60 
F23 "GND1" I L 6800 3100 60 
F24 "CS0" I L 6800 3850 60 
F25 "CE" I L 6800 3750 60 
F26 "CS1" I L 6800 4100 60 
F27 "CS3" I L 6800 4200 60 
F28 "GNDP" O L 6800 3300 60 
F29 "VCC3.3D" I R 7650 4900 60 
$EndSheet
$Comp
L RJ12 J2
U 1 1 5B57B840
P 5050 3000
F 0 "J2" H 5250 3500 50  0000 C CNN
F 1 "RJ12" H 4900 3500 50  0000 C CNN
F 2 "Connectors:RJ12_E" H 5050 3000 50  0001 C CNN
F 3 "" H 5050 3000 50  0001 C CNN
	1    5050 3000
	0    -1   -1   0   
$EndComp
Text Notes 8300 2300 0    60   ~ 0
ICSP\n
Text Notes 8350 4100 0    60   ~ 0
I2C
Text Notes 8350 3500 0    60   ~ 0
SPI\n
Text Notes 8700 3250 0    60   ~ 0
USART
$Comp
L Earth #PWR01
U 1 1 5B57B841
P 3650 4900
F 0 "#PWR01" H 3650 4650 50  0001 C CNN
F 1 "Earth" H 3650 4750 50  0001 C CNN
F 2 "" H 3650 4900 50  0001 C CNN
F 3 "" H 3650 4900 50  0001 C CNN
	1    3650 4900
	1    0    0    -1  
$EndComp
$Comp
L Earth_Protective #PWR02
U 1 1 5B57B842
P 2950 5600
F 0 "#PWR02" H 3200 5350 50  0001 C CNN
F 1 "Earth_Protective" H 3400 5450 50  0001 C CNN
F 2 "" H 2950 5500 50  0001 C CNN
F 3 "" H 2950 5500 50  0001 C CNN
	1    2950 5600
	1    0    0    -1  
$EndComp
NoConn ~ 4650 2500
NoConn ~ 4750 2500
$Comp
L PWR_FLAG #FLG03
U 1 1 5B57B843
P 3200 4850
F 0 "#FLG03" H 3200 4925 50  0001 C CNN
F 1 "PWR_FLAG" H 3200 5000 50  0000 C CNN
F 2 "" H 3200 4850 50  0001 C CNN
F 3 "" H 3200 4850 50  0001 C CNN
	1    3200 4850
	1    0    0    -1  
$EndComp
$Comp
L PWR_FLAG #FLG04
U 1 1 5B57B844
P 3650 4850
F 0 "#FLG04" H 3650 4925 50  0001 C CNN
F 1 "PWR_FLAG" H 3650 5000 50  0000 C CNN
F 2 "" H 3650 4850 50  0001 C CNN
F 3 "" H 3650 4850 50  0001 C CNN
	1    3650 4850
	1    0    0    -1  
$EndComp
$Comp
L PWR_FLAG #FLG05
U 1 1 5B57B845
P 2950 5450
F 0 "#FLG05" H 2950 5525 50  0001 C CNN
F 1 "PWR_FLAG" H 2950 5600 50  0000 C CNN
F 2 "" H 2950 5450 50  0001 C CNN
F 3 "" H 2950 5450 50  0001 C CNN
	1    2950 5450
	1    0    0    -1  
$EndComp
NoConn ~ 6800 3750
NoConn ~ 6800 3850
NoConn ~ 6800 4100
NoConn ~ 6800 4200
$Comp
L Conn_01x05_Male J1
U 1 1 5B57B846
P 4100 5300
F 0 "J1" H 4100 5600 50  0000 C CNN
F 1 "Conn_01x05_Male" H 4100 5000 50  0000 C CNN
F 2 "Connectors_Molex:Molex_KK-6410-05_05x2.54mm_Straight" H 4100 5300 50  0001 C CNN
F 3 "" H 4100 5300 50  0001 C CNN
	1    4100 5300
	1    0    0    -1  
$EndComp
$Comp
L +5C #PWR06
U 1 1 5B57B847
P 2650 4850
F 0 "#PWR06" H 2650 4700 50  0001 C CNN
F 1 "+5C" H 2650 4990 50  0000 C CNN
F 2 "" H 2650 4850 50  0001 C CNN
F 3 "" H 2650 4850 50  0001 C CNN
	1    2650 4850
	1    0    0    -1  
$EndComp
$Comp
L +5F #PWR07
U 1 1 5B57B848
P 2900 4850
F 0 "#PWR07" H 2900 4700 50  0001 C CNN
F 1 "+5F" H 2900 4990 50  0000 C CNN
F 2 "" H 2900 4850 50  0001 C CNN
F 3 "" H 2900 4850 50  0001 C CNN
	1    2900 4850
	1    0    0    -1  
$EndComp
$Comp
L GND #PWR08
U 1 1 5B57B849
P 3200 4900
F 0 "#PWR08" H 3200 4650 50  0001 C CNN
F 1 "GND" H 3200 4750 50  0000 C CNN
F 2 "" H 3200 4900 50  0001 C CNN
F 3 "" H 3200 4900 50  0001 C CNN
	1    3200 4900
	1    0    0    -1  
$EndComp
$Comp
L PWR_FLAG #FLG09
U 1 1 5B57B84A
P 2150 4850
F 0 "#FLG09" H 2150 4925 50  0001 C CNN
F 1 "PWR_FLAG" H 2150 5000 50  0000 C CNN
F 2 "" H 2150 4850 50  0001 C CNN
F 3 "" H 2150 4850 50  0001 C CNN
	1    2150 4850
	1    0    0    -1  
$EndComp
$Comp
L PWR_FLAG #FLG010
U 1 1 5B57B84B
P 2450 4850
F 0 "#FLG010" H 2450 4925 50  0001 C CNN
F 1 "PWR_FLAG" H 2450 5000 50  0000 C CNN
F 2 "" H 2450 4850 50  0001 C CNN
F 3 "" H 2450 4850 50  0001 C CNN
	1    2450 4850
	1    0    0    -1  
$EndComp
$Comp
L GND #PWR011
U 1 1 5B57B84C
P 3750 5150
F 0 "#PWR011" H 3750 4900 50  0001 C CNN
F 1 "GND" H 3750 5000 50  0000 C CNN
F 2 "" H 3750 5150 50  0001 C CNN
F 3 "" H 3750 5150 50  0001 C CNN
	1    3750 5150
	1    0    0    -1  
$EndComp
$Comp
L Earth #PWR012
U 1 1 5B57B84D
P 3750 5400
F 0 "#PWR012" H 3750 5150 50  0001 C CNN
F 1 "Earth" H 3750 5250 50  0001 C CNN
F 2 "" H 3750 5400 50  0001 C CNN
F 3 "" H 3750 5400 50  0001 C CNN
	1    3750 5400
	1    0    0    -1  
$EndComp
$Comp
L +5C #PWR013
U 1 1 5B57B84E
P 3900 5050
F 0 "#PWR013" H 3900 4900 50  0001 C CNN
F 1 "+5C" H 3900 5190 50  0000 C CNN
F 2 "" H 3900 5050 50  0001 C CNN
F 3 "" H 3900 5050 50  0001 C CNN
	1    3900 5050
	1    0    0    -1  
$EndComp
$Comp
L +5F #PWR014
U 1 1 5B57B84F
P 3900 5500
F 0 "#PWR014" H 3900 5350 50  0001 C CNN
F 1 "+5F" H 3900 5640 50  0000 C CNN
F 2 "" H 3900 5500 50  0001 C CNN
F 3 "" H 3900 5500 50  0001 C CNN
	1    3900 5500
	1    0    0    -1  
$EndComp
NoConn ~ 8300 4650
NoConn ~ 8300 4550
NoConn ~ 7650 4450
NoConn ~ 7650 4250
NoConn ~ 7650 4150
Wire Wire Line
	5500 3200 6800 3200
Wire Wire Line
	5500 3000 6800 3000
Wire Wire Line
	5500 2900 6800 2900
Wire Wire Line
	5500 2800 5850 2800
Wire Notes Line
	8200 3000 8650 3000
Wire Notes Line
	8650 2350 8650 3450
Wire Notes Line
	8650 2350 8200 2350
Wire Notes Line
	8200 2350 8200 3450
Wire Notes Line
	8200 4150 8200 4400
Wire Notes Line
	8200 4400 8700 4400
Wire Notes Line
	8700 4150 8200 4150
Wire Notes Line
	8200 3500 8200 4000
Wire Notes Line
	8200 4000 8700 4000
Wire Notes Line
	8700 4000 8700 3500
Wire Notes Line
	8700 3500 8200 3500
Wire Notes Line
	8200 3450 8650 3450
Wire Notes Line
	8700 4400 8700 4150
Wire Wire Line
	8300 3050 7650 3050
Wire Wire Line
	8300 3150 7650 3150
Wire Wire Line
	8300 3250 7650 3250
Wire Wire Line
	7650 3350 8300 3350
Wire Wire Line
	7650 2500 8300 2500
Wire Wire Line
	7650 2600 8300 2600
Wire Wire Line
	7650 2700 8300 2700
Wire Wire Line
	7650 2800 8300 2800
Wire Wire Line
	7650 3600 8300 3600
Wire Wire Line
	7650 3800 8300 3800
Wire Wire Line
	8300 3900 7650 3900
Wire Wire Line
	6450 2500 6800 2500
Wire Wire Line
	6600 2600 6800 2600
Wire Wire Line
	9600 2500 9750 2500
Wire Wire Line
	9750 2500 9750 2150
Wire Wire Line
	9750 2150 6450 2150
Connection ~ 6450 2500
Wire Wire Line
	9600 2600 9850 2600
Wire Wire Line
	9850 2600 9850 2050
Wire Wire Line
	9850 2050 6600 2050
Connection ~ 6600 2600
Wire Wire Line
	6000 5500 6000 3200
Connection ~ 6000 3200
Wire Wire Line
	5850 2800 5850 5400
Wire Wire Line
	2950 5450 2950 5600
Wire Wire Line
	3650 4850 3650 4900
Connection ~ 2950 5500
Wire Wire Line
	5500 3300 6800 3300
Wire Wire Line
	3300 5300 6250 5300
Wire Wire Line
	5850 5400 3750 5400
Wire Wire Line
	3900 5500 6000 5500
Wire Wire Line
	3300 5300 3300 5500
Wire Wire Line
	3300 5500 2950 5500
Connection ~ 4300 5300
Wire Wire Line
	2650 4850 2650 4950
Wire Wire Line
	2650 4950 2450 4950
Wire Wire Line
	2450 4950 2450 4850
Wire Wire Line
	2900 4850 2900 5000
Wire Wire Line
	2900 5000 2150 5000
Wire Wire Line
	2150 5000 2150 4850
Wire Wire Line
	3200 4850 3200 4900
Wire Wire Line
	3900 5100 3900 5050
Connection ~ 4300 5100
Wire Wire Line
	3750 5150 4300 5150
Wire Wire Line
	4300 5150 4300 5200
Connection ~ 4300 5400
Connection ~ 4300 5500
Connection ~ 6250 3300
Wire Wire Line
	6450 2150 6450 5800
Wire Wire Line
	6600 2050 6600 6050
Wire Wire Line
	6450 5100 4300 5100
Wire Wire Line
	4300 5200 6600 5200
Wire Wire Line
	6250 5300 6250 3300
Wire Wire Line
	5850 3100 6800 3100
Wire Wire Line
	5500 3100 5500 3300
Wire Wire Line
	5500 2700 5600 2700
Wire Wire Line
	5600 2700 5600 2800
Connection ~ 5850 3100
Connection ~ 5600 2800
Wire Wire Line
	8300 3700 7650 3700
$Sheet
S 6850 5600 850  800 
U 5B592FE8
F0 "fuente_3,3" 60
F1 "fuente_3,3.sch" 60
F2 "5v" I L 6850 5800 60 
F3 "3.3v" I R 7700 5800 60 
F4 "gnd" I L 6850 6050 60 
$EndSheet
Wire Wire Line
	6600 6050 6850 6050
Connection ~ 6600 5200
Wire Wire Line
	6450 5800 6850 5800
Connection ~ 6450 5100
Wire Wire Line
	7700 5800 7800 5800
Wire Wire Line
	7800 5800 7800 4900
Wire Wire Line
	7800 4900 7650 4900
$EndSCHEMATC
