# 1 "mcc_generated_files/TCPIPLibrary/arpv4.c"
# 1 "<built-in>" 1
# 1 "<built-in>" 3
# 288 "<built-in>" 3
# 1 "<command line>" 1
# 1 "<built-in>" 2
# 1 "/opt/microchip/xc8/v2.20/pic/include/language_support.h" 1 3
# 2 "<built-in>" 2
# 1 "mcc_generated_files/TCPIPLibrary/arpv4.c" 2
# 40 "mcc_generated_files/TCPIPLibrary/arpv4.c"
# 1 "/opt/microchip/xc8/v2.20/pic/include/c99/stdio.h" 1 3



# 1 "/opt/microchip/xc8/v2.20/pic/include/c99/musl_xc8.h" 1 3
# 5 "/opt/microchip/xc8/v2.20/pic/include/c99/stdio.h" 2 3





# 1 "/opt/microchip/xc8/v2.20/pic/include/c99/features.h" 1 3
# 11 "/opt/microchip/xc8/v2.20/pic/include/c99/stdio.h" 2 3
# 24 "/opt/microchip/xc8/v2.20/pic/include/c99/stdio.h" 3
# 1 "/opt/microchip/xc8/v2.20/pic/include/c99/bits/alltypes.h" 1 3





typedef void * va_list[1];




typedef void * __isoc_va_list[1];
# 122 "/opt/microchip/xc8/v2.20/pic/include/c99/bits/alltypes.h" 3
typedef unsigned size_t;
# 137 "/opt/microchip/xc8/v2.20/pic/include/c99/bits/alltypes.h" 3
typedef long ssize_t;
# 168 "/opt/microchip/xc8/v2.20/pic/include/c99/bits/alltypes.h" 3
typedef __int24 int24_t;
# 204 "/opt/microchip/xc8/v2.20/pic/include/c99/bits/alltypes.h" 3
typedef __uint24 uint24_t;
# 246 "/opt/microchip/xc8/v2.20/pic/include/c99/bits/alltypes.h" 3
typedef long long off_t;
# 399 "/opt/microchip/xc8/v2.20/pic/include/c99/bits/alltypes.h" 3
typedef struct _IO_FILE FILE;
# 25 "/opt/microchip/xc8/v2.20/pic/include/c99/stdio.h" 2 3
# 52 "/opt/microchip/xc8/v2.20/pic/include/c99/stdio.h" 3
typedef union _G_fpos64_t {
 char __opaque[16];
 double __align;
} fpos_t;

extern FILE *const stdin;
extern FILE *const stdout;
extern FILE *const stderr;





FILE *fopen(const char *restrict, const char *restrict);
FILE *freopen(const char *restrict, const char *restrict, FILE *restrict);
int fclose(FILE *);

int remove(const char *);
int rename(const char *, const char *);

int feof(FILE *);
int ferror(FILE *);
int fflush(FILE *);
void clearerr(FILE *);

int fseek(FILE *, long, int);
long ftell(FILE *);
void rewind(FILE *);

int fgetpos(FILE *restrict, fpos_t *restrict);
int fsetpos(FILE *, const fpos_t *);

size_t fread(void *restrict, size_t, size_t, FILE *restrict);
size_t fwrite(const void *restrict, size_t, size_t, FILE *restrict);

int fgetc(FILE *);
int getc(FILE *);
int getchar(void);
int ungetc(int, FILE *);

int fputc(int, FILE *);
int putc(int, FILE *);
int putchar(int);

char *fgets(char *restrict, int, FILE *restrict);

char *gets(char *);


int fputs(const char *restrict, FILE *restrict);
int puts(const char *);

#pragma printf_check(printf) const
#pragma printf_check(vprintf) const
#pragma printf_check(sprintf) const
#pragma printf_check(snprintf) const
#pragma printf_check(vsprintf) const
#pragma printf_check(vsnprintf) const

int printf(const char *restrict, ...);
int fprintf(FILE *restrict, const char *restrict, ...);
int sprintf(char *restrict, const char *restrict, ...);
int snprintf(char *restrict, size_t, const char *restrict, ...);

int vprintf(const char *restrict, __isoc_va_list);
int vfprintf(FILE *restrict, const char *restrict, __isoc_va_list);
int vsprintf(char *restrict, const char *restrict, __isoc_va_list);
int vsnprintf(char *restrict, size_t, const char *restrict, __isoc_va_list);

int scanf(const char *restrict, ...);
int fscanf(FILE *restrict, const char *restrict, ...);
int sscanf(const char *restrict, const char *restrict, ...);
int vscanf(const char *restrict, __isoc_va_list);
int vfscanf(FILE *restrict, const char *restrict, __isoc_va_list);
int vsscanf(const char *restrict, const char *restrict, __isoc_va_list);

void perror(const char *);

int setvbuf(FILE *restrict, char *restrict, int, size_t);
void setbuf(FILE *restrict, char *restrict);

char *tmpnam(char *);
FILE *tmpfile(void);




FILE *fmemopen(void *restrict, size_t, const char *restrict);
FILE *open_memstream(char **, size_t *);
FILE *fdopen(int, const char *);
FILE *popen(const char *, const char *);
int pclose(FILE *);
int fileno(FILE *);
int fseeko(FILE *, off_t, int);
off_t ftello(FILE *);
int dprintf(int, const char *restrict, ...);
int vdprintf(int, const char *restrict, __isoc_va_list);
void flockfile(FILE *);
int ftrylockfile(FILE *);
void funlockfile(FILE *);
int getc_unlocked(FILE *);
int getchar_unlocked(void);
int putc_unlocked(int, FILE *);
int putchar_unlocked(int);
ssize_t getdelim(char **restrict, size_t *restrict, int, FILE *restrict);
ssize_t getline(char **restrict, size_t *restrict, FILE *restrict);
int renameat(int, const char *, int, const char *);
char *ctermid(char *);







char *tempnam(const char *, const char *);
# 40 "mcc_generated_files/TCPIPLibrary/arpv4.c" 2

# 1 "/opt/microchip/xc8/v2.20/pic/include/c99/stdint.h" 1 3
# 22 "/opt/microchip/xc8/v2.20/pic/include/c99/stdint.h" 3
# 1 "/opt/microchip/xc8/v2.20/pic/include/c99/bits/alltypes.h" 1 3
# 127 "/opt/microchip/xc8/v2.20/pic/include/c99/bits/alltypes.h" 3
typedef unsigned long uintptr_t;
# 142 "/opt/microchip/xc8/v2.20/pic/include/c99/bits/alltypes.h" 3
typedef long intptr_t;
# 158 "/opt/microchip/xc8/v2.20/pic/include/c99/bits/alltypes.h" 3
typedef signed char int8_t;




typedef short int16_t;
# 173 "/opt/microchip/xc8/v2.20/pic/include/c99/bits/alltypes.h" 3
typedef long int32_t;





typedef long long int64_t;
# 188 "/opt/microchip/xc8/v2.20/pic/include/c99/bits/alltypes.h" 3
typedef long long intmax_t;





typedef unsigned char uint8_t;




typedef unsigned short uint16_t;
# 209 "/opt/microchip/xc8/v2.20/pic/include/c99/bits/alltypes.h" 3
typedef unsigned long uint32_t;





typedef unsigned long long uint64_t;
# 229 "/opt/microchip/xc8/v2.20/pic/include/c99/bits/alltypes.h" 3
typedef unsigned long long uintmax_t;
# 23 "/opt/microchip/xc8/v2.20/pic/include/c99/stdint.h" 2 3

typedef int8_t int_fast8_t;

typedef int64_t int_fast64_t;


typedef int8_t int_least8_t;
typedef int16_t int_least16_t;

typedef int24_t int_least24_t;

typedef int32_t int_least32_t;

typedef int64_t int_least64_t;


typedef uint8_t uint_fast8_t;

typedef uint64_t uint_fast64_t;


typedef uint8_t uint_least8_t;
typedef uint16_t uint_least16_t;

typedef uint24_t uint_least24_t;

typedef uint32_t uint_least32_t;

typedef uint64_t uint_least64_t;
# 139 "/opt/microchip/xc8/v2.20/pic/include/c99/stdint.h" 3
# 1 "/opt/microchip/xc8/v2.20/pic/include/c99/bits/stdint.h" 1 3
typedef int32_t int_fast16_t;
typedef int32_t int_fast32_t;
typedef uint32_t uint_fast16_t;
typedef uint32_t uint_fast32_t;
# 140 "/opt/microchip/xc8/v2.20/pic/include/c99/stdint.h" 2 3
# 41 "mcc_generated_files/TCPIPLibrary/arpv4.c" 2

# 1 "/opt/microchip/xc8/v2.20/pic/include/c99/stdbool.h" 1 3
# 42 "mcc_generated_files/TCPIPLibrary/arpv4.c" 2

# 1 "/opt/microchip/xc8/v2.20/pic/include/c99/string.h" 1 3
# 25 "/opt/microchip/xc8/v2.20/pic/include/c99/string.h" 3
# 1 "/opt/microchip/xc8/v2.20/pic/include/c99/bits/alltypes.h" 1 3
# 411 "/opt/microchip/xc8/v2.20/pic/include/c99/bits/alltypes.h" 3
typedef struct __locale_struct * locale_t;
# 26 "/opt/microchip/xc8/v2.20/pic/include/c99/string.h" 2 3

void *memcpy (void *restrict, const void *restrict, size_t);
void *memmove (void *, const void *, size_t);
void *memset (void *, int, size_t);
int memcmp (const void *, const void *, size_t);
void *memchr (const void *, int, size_t);

char *strcpy (char *restrict, const char *restrict);
char *strncpy (char *restrict, const char *restrict, size_t);

char *strcat (char *restrict, const char *restrict);
char *strncat (char *restrict, const char *restrict, size_t);

int strcmp (const char *, const char *);
int strncmp (const char *, const char *, size_t);

int strcoll (const char *, const char *);
size_t strxfrm (char *restrict, const char *restrict, size_t);

char *strchr (const char *, int);
char *strrchr (const char *, int);

size_t strcspn (const char *, const char *);
size_t strspn (const char *, const char *);
char *strpbrk (const char *, const char *);
char *strstr (const char *, const char *);
char *strtok (char *restrict, const char *restrict);

size_t strlen (const char *);

char *strerror (int);
# 65 "/opt/microchip/xc8/v2.20/pic/include/c99/string.h" 3
char *strtok_r (char *restrict, const char *restrict, char **restrict);
int strerror_r (int, char *, size_t);
char *stpcpy(char *restrict, const char *restrict);
char *stpncpy(char *restrict, const char *restrict, size_t);
size_t strnlen (const char *, size_t);
char *strdup (const char *);
char *strndup (const char *, size_t);
char *strsignal(int);
char *strerror_l (int, locale_t);
int strcoll_l (const char *, const char *, locale_t);
size_t strxfrm_l (char *restrict, const char *restrict, size_t, locale_t);




void *memccpy (void *restrict, const void *restrict, int, size_t);
# 43 "mcc_generated_files/TCPIPLibrary/arpv4.c" 2

# 1 "mcc_generated_files/TCPIPLibrary/tcpip_types.h" 1
# 49 "mcc_generated_files/TCPIPLibrary/tcpip_types.h"
typedef enum {TCB_ERROR = -1, TCB_NO_ERROR = 0} tcbError_t;
# 64 "mcc_generated_files/TCPIPLibrary/tcpip_types.h"
typedef struct
{
    uint8_t destinationMAC[6];
    uint8_t sourceMAC[6];
    union
    {
        uint16_t type;
        uint16_t length;
        uint16_t tpid;
    }id;




} ethernetFrame_t;

uint8_t Control_Byte = 0x00;
# 133 "mcc_generated_files/TCPIPLibrary/tcpip_types.h"
typedef struct
{
    unsigned ihl:4;
    unsigned version:4;
    unsigned ecn:2;
    unsigned dscp:6;
    uint16_t length;
    uint16_t identifcation;
    unsigned fragmentOffsetHigh:5;
    unsigned :1;
    unsigned dontFragment:1;
    unsigned moreFragments:1;
    uint8_t fragmentOffsetLow;
    uint8_t timeToLive;
    uint8_t protocol;
    uint16_t headerCksm;
    uint32_t srcIpAddress;
    uint32_t dstIpAddress;


} ipv4Header_t;


typedef struct
{
    uint32_t srcIpAddress;
    uint32_t dstIpAddress;
    uint8_t protocol;
    uint8_t z;
    uint16_t length;
} ipv4_pseudo_header_t;

typedef struct
{
    union
    {
        uint16_t typeCode;
        struct
        {
            uint8_t code;
            uint8_t type;
        };
    };
    uint16_t checksum;
} icmpHeader_t;


typedef struct
{
    union
    {
        uint16_t typeCode;
        struct
        {
            uint8_t code;
            uint8_t type;
        };
    };
    uint16_t checksum;
} icmpv6Header_t;


typedef enum
{
    ECHO_REPLY = 0x0000,

    DEST_NETWORK_UNREACHABLE = 0x0300,
    DEST_HOST_UNREACHABLE = 0x0301,
    DEST_PROTOCOL_UNREACHABLE = 0x0302,
    DEST_PORT_UNREACHABLE = 0x0303,
    FRAGMENTATION_REQUIRED = 0x0304,
    SOURCE_ROUTE_FAILED = 0x0305,
    DESTINATION_NETWORK_UNKNOWN = 0x0306,
    SOURCE_HOST_ISOLATED = 0x0307,
    NETWORK_ADMINISTRATIVELY_PROHIBITED = 0x0308,
    HOST_ADMINISTRATIVELY_PROHIBITED = 0x0309,
    NETWORK_UNREACHABLE_FOR_TOS = 0x030A,
    HOST_UNREACHABLE_FOR_TOS = 0x030B,
    COMMUNICATION_ADMINISTRATIVELY_PROHIBITED = 0x030C,
    HOST_PRECEDENCE_VIOLATION = 0x030D,
    PRECEDENCE_CUTOFF_IN_EFFECT = 0x030E,

    SOURCE_QUENCH = 0x0400,

    REDIRECT_DATAGRAM_FOR_THE_NETWORK = 0x0500,
    REDIRECT_DATAGRAM_FOR_THE_HOST = 0x0501,
    REDIRECT_DATAGRAM_FOR_THE_TOS_AND_NETWORK = 0x0502,
    REDIRECT_DATAGRAM_FOR_THE_TOS_AND_HOST = 0x0503,

    ALTERNATE_HOST_ADDRESS = 0x0600,

    ECHO_REQUEST = 0x0800,


    UNASSIGNED_ECHO_TYPE_CODE_REQUEST_1 = 0x082A,
    UNASSIGNED_ECHO_TYPE_CODE_REQUEST_2 = 0x08FC,

    ROUTER_ADVERTISEMENT = 0x0900,
    ROUTER_SOLICITATION = 0x0A00,
    TRACEROUTE = 0x3000
} icmpTypeCodes_t;

typedef struct
{
    uint16_t srcPort;
    uint16_t dstPort;
    uint16_t length;
    uint16_t checksum;
} udpHeader_t;

typedef struct
{
    uint16_t sourcePort;
    uint16_t destPort;
    uint32_t sequenceNumber;
    uint32_t ackNumber;
    union{
        uint8_t byte13;
        struct{
            uint8_t ns:1;
            uint8_t reserved:3;
            uint8_t dataOffset:4;
        };
    };

    union{
        uint8_t flags;
        struct{
            uint8_t fin:1;
            uint8_t syn:1;
            uint8_t rst:1;
            uint8_t psh:1;
            uint8_t ack:1;
            uint8_t urg:1;
            uint8_t ece:1;
            uint8_t cwr:1;
        };
    };

    uint16_t windowSize;
    uint16_t checksum;
    uint16_t urgentPtr;



} tcpHeader_t;
# 296 "mcc_generated_files/TCPIPLibrary/tcpip_types.h"
typedef enum
{
    HOPOPT_TCPIP = 0,
    ICMP_TCPIP = 1,
    IGMP_TCPIP = 2,
    GGP_TCPIP = 3,
    IPV4_TCPIP = 4,
    ST_TCPIP = 5,
    TCP_TCPIP = 6,
    CBT_TCPIP = 7,
    EGP_TCPIP = 8,
    IGP_TCPIP = 9,
    BBN_RCC_MON_TCPIP = 10,
    NVP_II_TCPIP = 11,
    PUP_TCPIP = 12,
    ARGUS_TCPIP = 13,
    EMCON_TCPIP = 14,
    XNET_TCPIP = 15,
    CHAOS_TCPIP = 16,
    UDP_TCPIP = 17,
    MUX_TCPIP = 18,
    DCN_MEAS_TCPIP = 19,
    HMP_TCPIP = 20,
    PRM_TCPIP = 21,
    XNS_IDP_TCPIP = 22,
    TRUNK_1_TCPIP = 23,
    TRUNK_2_TCPIP = 24,
    LEAF_1_TCPIP = 25,
    LEAF_2_TCPIP = 26,
    RDP_TCPIP = 27,
    IRTP_TCPIP = 28,
    ISO_TP4_TCPIP = 29,
    NETBLT_TCPIP = 30,
    MFE_NSP_TCPIP = 31,
    MERIT_INP_TCPIP = 32,
    DCCP_TCPIP = 33,
    THREEPC_TCPIP = 34,
    IDPR_TCPIP = 35,
    XTP_TCPIP = 36,
    DDP_TCPIP = 37,
    IDPR_CMTP_TCPIP = 38,
    TPpp_TCPIP = 39,
    IL_TCPIP = 40,
    IPV6_TUNNEL_TCPIP = 41,
    SDRP_TCPIP = 42,
    IPV6_Route_TCPIP = 43,
    IPV6_Frag_TCPIP = 44,
    IDRP_TCPIP = 45,
    RSVP_TCPIP = 46,
    GRE_TCPIP = 47,
    DSR_TCPIP = 48,
    BNA_TCPIP = 49,
    ESP_TCPIP = 50,
    AH_TCPIP = 51,
    I_NLSP_TCPIP = 52,
    SWIPE_TCPIP = 53,
    NARP_TCPIP = 54,
    MOBILE_TCPIP = 55,
    TLSP_TCPIP = 56,
    SKIP_TCPIP = 57,
    IPV6_ICMP_TCPIP = 58,
    IPV6_NoNxt_TCPIP = 59,
    IPV6_Opts_TCPIP = 60,
    CFTP_TCPIP = 62,
    SAT_EXPAK_TCPIP = 64,
    KRYPTOLAN_TCPIP = 65,
    RVD_TCPIP = 66,
    IPPC_TCPIP = 67,
    SAT_MON_TCPIP = 69,
    VISA_TCPIP = 70,
    IPCV_TCPIP = 71,
    CPNX_TCPIP = 72,
    CPHB_TCPIP = 73,
    WSN_TCPIP = 74,
    PVP_TCPIP = 75,
    BR_SAT_MON_TCPIP = 76,
    SUN_ND_TCPIP = 77,
    WB_MON_TCPIP = 78,
    WB_EXPAK_TCPIP = 79,
    ISO_IP_TCPIP = 80,
    VMTP_TCPIP = 81,
    SECURE_VMTP_TCPIP = 82,
    VINES_TCPIP = 83,
    TTP_TCPIP = 84,
    IPTM_TCPIP = 84,
    NSFNET_IGP_TCPIP = 85,
    DGP_TCPIP = 86,
    TCF_TCPIP = 87,
    EIGRP_TCPIP = 88,
    OSPFIGP_TCPIP = 89,
    Sprite_RPC_TCPIP = 90,
    LARP_TCPIP = 91,
    MTP_TCPIP = 92,
    AX25_TCPIP = 93,
    IPIP_TCPIP = 94,
    MICP_TCPIP = 95,
    SCC_SP_TCPIP = 96,
    ETHERIP_TCPIP = 97,
    ENCAP_TCPIP = 98,
    GMTP_TCPIP = 100,
    IFMP_TCPIP = 101,
    PNNI_TCPIP = 102,
    PIM_TCPIP = 103,
    ARIS_TCPIP = 104,
    SCPS_TCPIP = 105,
    QNX_TCPIP = 106,
    A_N_TCPIP = 107,
    IPComp_TCPIP = 108,
    SNP_TCPIP = 109,
    Compaq_Peer_TCPIP = 110,
    IPX_in_IP_TCPIP = 111,
    VRRP_TCPIP = 112,
    PGM_TCPIP = 113,
    L2TP_TCPIP = 115,
    DDX_TCPIP = 116,
    IATP_TCPIP = 117,
    STP_TCPIP = 118,
    SRP_TCPIP = 119,
    UTI_TCPIP = 120,
    SMP_TCPIP = 121,
    SM_TCPIP = 122,
    PTP_TCPIP = 123,
    ISIS_TCPIP = 124,
    FIRE_TCPIP = 125,
    CRTP_TCPIP = 126,
    CRUDP_TCPIP = 127,
    SSCOPMCE_TCPIP = 128,
    IPLT_TCPIP = 129,
    SPS_TCPIP = 130,
    PIPE_TCPIP = 131,
    SCTP_TCPIP = 132,
    FC_TCPIP = 133
} ipProtocolNumbers;

typedef struct
{
    union{
        uint32_t s_addr;
        uint8_t s_addr_byte[4];
    };
}inAddr_t;

typedef struct
{
   union {
        uint8_t s6_u8[16];
        uint16_t s6_u16[8];
        uint32_t s6_u32[4];
    } s6;



}in6Addr_t;

typedef struct
{
    uint16_t port;
    inAddr_t addr;
}sockaddr_in_t;

typedef struct {

    uint16_t in6_port;
    uint32_t in6_flowinfo;
    in6Addr_t in6_addr;
    uint32_t in6_scope_id;
}sockaddr_in6_t;

extern const char *network_errors[];

typedef enum
{
    ERROR =0,
    SUCCESS,
    LINK_NOT_FOUND,
    BUFFER_BUSY,
    TX_LOGIC_NOT_IDLE,
    MAC_NOT_FOUND,
    IP_WRONG_VERSION,
    IPV4_CHECKSUM_FAILS,
    DEST_IP_NOT_MATCHED,
    ICMP_CHECKSUM_FAILS,
    UDP_CHECKSUM_FAILS,
    TCP_CHECKSUM_FAILS,
    DMA_TIMEOUT,
    PORT_NOT_AVAILABLE,
    ARP_IP_NOT_MATCHED,
    EAPoL_PACKET_FAILURE,
    INCORRECT_IPV4_HLEN,
    IPV4_NO_OPTIONS,
    TX_QUEUED
}error_msg;

typedef struct
{
    inAddr_t dest_addr;
}destIP_t;


typedef int8_t socklistsize_t;

typedef void (*ip_receive_function_ptr)(int);
# 44 "mcc_generated_files/TCPIPLibrary/arpv4.c" 2

# 1 "mcc_generated_files/TCPIPLibrary/network.h" 1
# 72 "mcc_generated_files/TCPIPLibrary/network.h"
void Network_Init(void);
# 84 "mcc_generated_files/TCPIPLibrary/network.h"
void Network_Read(void);
# 96 "mcc_generated_files/TCPIPLibrary/network.h"
void Network_Manage(void);
# 108 "mcc_generated_files/TCPIPLibrary/network.h"
void Network_WaitForLink(void);
uint16_t Network_GetStartPosition(void);

void timersInit(void);
# 45 "mcc_generated_files/TCPIPLibrary/arpv4.c" 2

# 1 "mcc_generated_files/TCPIPLibrary/arpv4.h" 1
# 46 "mcc_generated_files/TCPIPLibrary/arpv4.h"
# 1 "mcc_generated_files/TCPIPLibrary/ethernet_driver.h" 1
# 47 "mcc_generated_files/TCPIPLibrary/ethernet_driver.h"
# 1 "mcc_generated_files/TCPIPLibrary/mac_address.h" 1
# 51 "mcc_generated_files/TCPIPLibrary/mac_address.h"
typedef union
{
    uint8_t mac_array[6];
    struct { uint8_t byte1,byte2,byte3,byte4,byte5,byte6; } s;
} mac48Address_t;

extern const mac48Address_t broadcastMAC;
extern mac48Address_t macAddress;
extern mac48Address_t hostMacAddress;

const mac48Address_t *MAC_getAddress(void);
# 47 "mcc_generated_files/TCPIPLibrary/ethernet_driver.h" 2
# 70 "mcc_generated_files/TCPIPLibrary/ethernet_driver.h"
typedef struct
{
 unsigned error:1;
 unsigned pktReady:1;
 unsigned up:1;
 unsigned idle:1;
 unsigned linkChange:1;
        unsigned bufferBusy:1;
        unsigned :3;
        uint16_t saveRDPT;
        uint16_t saveWRPT;
} ethernetDriver_t;

typedef struct
{
    uint16_t flags;
    uint16_t packetStart;
    uint16_t packetEnd;

    void *prevPacket;
    void *nextPacket;
} txPacket_t;

extern volatile ethernetDriver_t ethData;





void ETH_CloseSPI(void);
void ETH_OpenSPI(void);

void ETH_Init(void);
void ETH_EventHandler(void);
void ETH_NextPacketUpdate(void);
void ETH_ResetReceiver(void);
void ETH_SendSystemReset(void);


uint16_t ETH_ReadBlock(void*, uint16_t);
uint8_t ETH_Read8(void);
uint16_t ETH_Read16(void);
uint32_t ETH_Read24(void);
uint32_t ETH_Read32(void);
void ETH_Dump(uint16_t);
void ETH_Flush(void);

uint16_t ETH_GetFreeTxBufferSize(void);

error_msg ETH_WriteStart(const mac48Address_t *dest_mac, uint16_t type);
uint16_t ETH_WriteString(const char *string);
uint16_t ETH_WriteBlock(const void *, uint16_t);
void ETH_Write8(uint8_t);
void ETH_Write16(uint16_t);
void ETH_Write24(uint32_t data);
void ETH_Write32(uint32_t);
void ETH_Insert(uint8_t *,uint16_t, uint16_t);
error_msg ETH_Copy(uint16_t);
error_msg ETH_Send(void);

uint16_t ETH_TxComputeChecksum(uint16_t position, uint16_t len, uint16_t seed);
uint16_t ETH_RxComputeChecksum(uint16_t len, uint16_t seed);

void ETH_GetMAC(uint8_t *);
void ETH_SetMAC(uint8_t *);
uint16_t ETH_GetWritePtr();
void ETH_SaveRDPT(void);
void ETH_ResetReadPtr();
uint16_t ETH_GetReadPtr(void);
void ETH_SetReadPtr(uint16_t);
uint16_t ETH_GetStatusVectorByteCount(void);
void ETH_SetStatusVectorByteCount(uint16_t);

void ETH_ResetByteCount(void);
uint16_t ETH_GetByteCount(void);

uint16_t ETH_ReadSavedWRPT(void);
void ETH_SaveWRPT(void);
void ETH_SetRxByteCount(uint16_t count);
uint16_t ETH_GetRxByteCount();

_Bool ETH_CheckLinkUp(void);

void ETH_TxReset(void);
void ETH_MoveBackReadPtr(uint16_t offset);
# 46 "mcc_generated_files/TCPIPLibrary/arpv4.h" 2

# 1 "mcc_generated_files/TCPIPLibrary/tcpip_config.h" 1
# 47 "mcc_generated_files/TCPIPLibrary/arpv4.h" 2
# 57 "mcc_generated_files/TCPIPLibrary/arpv4.h"
void ARPV4_Init(void);
# 69 "mcc_generated_files/TCPIPLibrary/arpv4.h"
error_msg ARPV4_Packet(void);





void ARPV4_Update(void);
# 86 "mcc_generated_files/TCPIPLibrary/arpv4.h"
mac48Address_t* ARPV4_Lookup(uint32_t ipAddress);
# 99 "mcc_generated_files/TCPIPLibrary/arpv4.h"
error_msg ARPV4_Request(uint32_t destAddress);
# 46 "mcc_generated_files/TCPIPLibrary/arpv4.c" 2



# 1 "mcc_generated_files/TCPIPLibrary/ipv4.h" 1
# 66 "mcc_generated_files/TCPIPLibrary/ipv4.h"
void IPV4_Init(void);






error_msg IPV4_Packet(void);
# 90 "mcc_generated_files/TCPIPLibrary/ipv4.h"
error_msg IPv4_Start(uint32_t dstAddress, ipProtocolNumbers protocol);
# 101 "mcc_generated_files/TCPIPLibrary/ipv4.h"
uint16_t IPV4_PseudoHeaderChecksum(uint16_t payloadLen);
# 115 "mcc_generated_files/TCPIPLibrary/ipv4.h"
error_msg IPV4_Send(uint16_t payloadLength);






uint16_t IPV4_GetDatagramLength(void);
# 49 "mcc_generated_files/TCPIPLibrary/arpv4.c" 2


# 1 "mcc_generated_files/TCPIPLibrary/ip_database.h" 1
# 40 "mcc_generated_files/TCPIPLibrary/ip_database.h"
 typedef struct {
    uint32_t ipv4_myAddress;
    uint32_t ipv4_dns[2];
    uint32_t ipv4_subnetMask;
    uint32_t ipv4_router;
    uint32_t ipv4_gateway;
    uint32_t ipv4_ntpAddress[2];
    uint32_t ipv4_tftpAddress;
} ip_db_info_t;


extern ip_db_info_t ip_database_info;
# 72 "mcc_generated_files/TCPIPLibrary/ip_database.h"
void ipdb_init(void);
uint32_t makeStrToIpv4Address(char *str);
char *makeIpv4AddresstoStr(uint32_t addr);
# 51 "mcc_generated_files/TCPIPLibrary/arpv4.c" 2


typedef struct
{
    uint16_t htype;
    uint16_t ptype;
    uint8_t hlen;
    uint8_t plen;
    uint16_t oper;
    mac48Address_t sha;
    uint32_t spa;
    mac48Address_t tha;
    uint32_t tpa;
} arpHeader_t;






typedef struct
{
    mac48Address_t macAddress;
    uint32_t ipAddress;
    uint16_t protocolType;
    uint8_t age;
} arpMap_t;

mac48Address_t hostMacAddress;

arpMap_t arpMap[4];





void ARPV4_Init(void)
{
    for(uint8_t x= 0 ; x < 4; x++)
    {
        ((char *)arpMap)[x] = 0;
    }
    ETH_GetMAC((uint8_t*)&hostMacAddress);
}






error_msg ARPV4_Packet(void)
{
    arpHeader_t header;
    arpMap_t *entryPointer;
    _Bool mergeFlag;
    uint16_t length;
    error_msg ret;

    ret = ERROR;

    length = ETH_ReadBlock((char*)&header,sizeof(arpHeader_t));
    if(length == sizeof(arpHeader_t))
    {

        mergeFlag = 0;
        entryPointer = arpMap;

        for(uint8_t x=4; x > 0; x--)
        {
            if( (header.spa == entryPointer->ipAddress) && (header.ptype == entryPointer->protocolType) )
            {
                entryPointer->age = 0;
                entryPointer->macAddress.s = header.sha.s;
                mergeFlag = 1;
                break;
            }
            entryPointer++;
        }

        if((ip_database_info.ipv4_myAddress) && ((ip_database_info.ipv4_myAddress) == ((((uint32_t)header.tpa&(uint32_t)0xff000000) >> 24) | (((uint32_t)header.tpa&(uint32_t)0x00ff0000) >> 8) | (((uint32_t)header.tpa&(uint32_t)0x0000ff00) << 8) | (((uint32_t)header.tpa&(uint32_t)0x000000ff) << 24) )))
        {
            if(!mergeFlag)
            {

                entryPointer = arpMap;
                arpMap_t *arpPtr = arpMap;
                for(uint8_t x=4; x !=0; x--)
                {
                    if(entryPointer->age < arpPtr->age)
                    {
                        entryPointer = arpPtr;
                    }

                    arpPtr++;
                }


                entryPointer->age = 0;
                entryPointer->macAddress.s = header.sha.s;
                entryPointer->ipAddress = ((((uint32_t)header.spa&(uint32_t)0xff000000) >> 24) | (((uint32_t)header.spa&(uint32_t)0x00ff0000) >> 8) | (((uint32_t)header.spa&(uint32_t)0x0000ff00) << 8) | (((uint32_t)header.spa&(uint32_t)0x000000ff) << 24) );
                entryPointer->protocolType = header.ptype;
            }
            if(header.oper == ((((uint16_t)1 & (uint16_t)0xFF00) >> 8) | (((uint16_t)1 & (uint16_t)0x00FF) << 8)))
            {
                ret = ETH_WriteStart(&header.sha ,0x0806);
                if(ret == SUCCESS)
                {

                    header.tha.s = header.sha.s;
                    memcpy((void*)&header.sha.s, (void*)&hostMacAddress.s, sizeof(mac48Address_t));
                    header.tpa = header.spa;
                    header.spa = ((((uint32_t)(ip_database_info.ipv4_myAddress)&(uint32_t)0xff000000) >> 24) | (((uint32_t)(ip_database_info.ipv4_myAddress)&(uint32_t)0x00ff0000) >> 8) | (((uint32_t)(ip_database_info.ipv4_myAddress)&(uint32_t)0x0000ff00) << 8) | (((uint32_t)(ip_database_info.ipv4_myAddress)&(uint32_t)0x000000ff) << 24) );
                    header.oper = ((((uint16_t)2 & (uint16_t)0xFF00) >> 8) | (((uint16_t)2 & (uint16_t)0x00FF) << 8));
                    ETH_WriteBlock((char*)&header,sizeof(header));


                    ret = ETH_Send();
                }
            }
        }
        else
        {
            ret = ARP_IP_NOT_MATCHED;
        }
    }
    return ret;
}





void ARPV4_Update(void)
{
    arpMap_t *entryPointer = arpMap;
    for(uint8_t x=0; x < 4; x++)
    {
        entryPointer->age ++;
        entryPointer ++;
    }
}






error_msg ARPV4_Request(uint32_t destAddress)
{
    error_msg ret;

    ret = ERROR;

    arpHeader_t header;
    header.htype = ((((uint16_t)1 & (uint16_t)0xFF00) >> 8) | (((uint16_t)1 & (uint16_t)0x00FF) << 8));
    header.ptype = ((((uint16_t)0x0800 & (uint16_t)0xFF00) >> 8) | (((uint16_t)0x0800 & (uint16_t)0x00FF) << 8));
    header.hlen = 6;
    header.plen = 4;
    header.oper = ((((uint16_t)1 & (uint16_t)0xFF00) >> 8) | (((uint16_t)1 & (uint16_t)0x00FF) << 8));
    memcpy((void*)&header.sha, (void*)&hostMacAddress, sizeof(mac48Address_t));
    header.spa = ((((uint32_t)(ip_database_info.ipv4_myAddress)&(uint32_t)0xff000000) >> 24) | (((uint32_t)(ip_database_info.ipv4_myAddress)&(uint32_t)0x00ff0000) >> 8) | (((uint32_t)(ip_database_info.ipv4_myAddress)&(uint32_t)0x0000ff00) << 8) | (((uint32_t)(ip_database_info.ipv4_myAddress)&(uint32_t)0x000000ff) << 24) );
    header.tpa= ((((uint32_t)destAddress&(uint32_t)0xff000000) >> 24) | (((uint32_t)destAddress&(uint32_t)0x00ff0000) >> 8) | (((uint32_t)destAddress&(uint32_t)0x0000ff00) << 8) | (((uint32_t)destAddress&(uint32_t)0x000000ff) << 24) );
    header.tha.s.byte1 = 0;
    header.tha.s.byte2 = 0;
    header.tha.s.byte3 = 0;
    header.tha.s.byte4 = 0;
    header.tha.s.byte5 = 0;
    header.tha.s.byte6 = 0;

    ret = ETH_WriteStart(&broadcastMAC,0x0806);
    if(ret == SUCCESS)
    {
        ETH_WriteBlock((char*)&header,sizeof(arpHeader_t));
        ret = ETH_Send();
        if(ret == SUCCESS)
        {
            return MAC_NOT_FOUND;
        }
    }
    return ret;
}






mac48Address_t* ARPV4_Lookup(uint32_t ip_address)
{
    arpMap_t *entry_pointer = arpMap;
    uint8_t x;

    for(x = 0; x < 4; x++)
    {
        if(entry_pointer->ipAddress == ip_address)
            return &entry_pointer->macAddress;
        entry_pointer ++;
    }
    return 0;
}
