   26936,   26922,   26892,   26912,   26926,   26916,   26918,   26930,
   26938,   26864,   26861,   26868,   26863,   26870,   26874,   26896,
   26866,   26902,   26894,   26872,   26876,   26878,   26898,   26924,
   26928,   26884,   26934,   26932,   26900,   26890,   26886,   26904,
   26888,   26920,   26910,   26908,   26914,   26906,   26882,   26880