    501012,    178029,    178030
    501013,    178030,    178031
    501014,    178031,    178032
    501016,    178033,    178034
    501017,    178034,    178035
    501018,    178035,    178036
    501019,    178036,    178037
    501020,    178037,    178038
    501021,    178031,    178034