    139778,     25209,     25248,     25211,     25210
    139779,     25248,     25249,     25212,     25211
    139780,     25247,     25250,     25179,     25178
    139781,     25204,     25251,     25206,     25205
    139782,     25249,     25252,     25213,     25212
    139783,     25252,     25253,     25214,     25213
    139784,     25253,     25254,     25215,     25214
    139785,     25254,     25255,     25216,     25215
    139786,     25255,     25256,     25217,     25216
    139787,     25256,     25257,     25218,     25217
    139788,     25257,     25258,     25219,     25218
    139789,     25258,     25259,     25220,     25219
    139790,     25259,     25260,     25221,     25220
    139791,     25260,     25261,     25222,     25221
    139792,     25261,     25262,     25223,     25222
    139793,     25262,     25263,     25224,     25223
    139794,     25263,     25264,     25225,     25224
    139795,     25264,     25265,     25226,     25225
    139796,     25265,     25266,     25227,     25226
    139797,     25266,     25267,     25228,     25227
    139798,     25267,     25268,     25229,     25228
    139799,     25268,     25231,     25230,     25229
    139800,     25184,     25269,     25186,     25185
    139801,     25268,     25270,     25232,     25231
    139802,     25270,     25271,     25233,     25232
    139803,     25250,     25272,     25180,     25179
    139804,     25272,     25273,     25181,     25180
    139805,     25273,     25274,     25182,     25181
    139806,     25274,     25275,     25183,     25182
    139807,     25275,     25269,     25184,     25183
    139808,     25271,     25276,     25234,     25233
    139809,     25276,     25277,     25235,     25234
    139810,     25277,     25278,     25236,     25235
    139811,     25278,     25279,     25237,     25236
    139812,     25279,     25280,     25238,     25237
    139813,     25280,     25281,     25239,     25238
    139814,     25281,     25282,     25240,     25239
    139815,     25282,     25283,     25241,     25240
    139816,     25283,     25284,     25242,     25241
    139817,     25284,     25285,     25243,     25242
    139818,     25285,     25286,     25244,     25243
    139819,     25286,     25287,     25245,     25244
    139820,     25287,     25288,     25246,     25245
    139821,     25288,     25250,     25247,     25246
    139822,     25251,     25289,     25207,     25206
    139823,     25289,     25290,     25208,     25207
    139824,     25290,     25248,     25209,     25208
    139825,     25269,     25291,     25187,     25186
    139826,     25291,     25401,     25188,     25187
    139827,     25401,     25400,     25189,     25188
    139828,     25292,     25293,     25190,     25189
    139829,     25293,     25294,     25191,     25190
    139830,     25294,     25295,     25192,     25191
    139831,     25295,     25296,     25193,     25192
    139832,     25296,     25297,     25194,     25193
    139833,     25297,     25298,     25195,     25194
    139834,     25298,     25299,     25196,     25195
    139835,     25299,     25300,     25197,     25196
    139836,     25300,     25301,     25198,     25197
    139837,     25301,     25302,     25199,     25198
    139838,     25302,     25410,     25200,     25199
    139839,     25410,     25409,     25201,     25200
    139840,     25409,     25408,     25202,     25201
    139841,     25408,     25303,     25203,     25202
    139842,     25303,     25251,     25204,     25203
    139843,     25267,     25304,     25270,     25268
    139844,     25304,     25305,     25271,     25270
    139845,     25305,     25306,     25276,     25271
    139846,     25306,     25307,     25277,     25276
    139847,     25307,     25308,     25278,     25277
    139848,     25308,     25309,     25279,     25278
    139849,     25309,     25310,     25280,     25279
    139850,     25310,     25311,     25281,     25280
    139851,     25311,     25312,     25282,     25281
    139852,     25312,     25313,     25283,     25282
    139853,     25313,     25314,     25284,     25283
    139854,     25314,     25315,     25285,     25284
    139855,     25315,     25316,     25286,     25285
    139856,     25316,     25317,     25287,     25286
    139857,     25317,     25318,     25288,     25287
    139858,     25318,     25272,     25250,     25288
    139859,     25290,     25319,     25249,     25248
    139860,     25319,     25320,     25252,     25249
    139861,     25320,     25321,     25253,     25252
    139862,     25321,     25322,     25254,     25253
    139863,     25322,     25323,     25255,     25254
    139864,     25323,     25324,     25256,     25255
    139865,     25324,     25325,     25257,     25256
    139866,     25325,     25326,     25258,     25257
    139867,     25326,     25327,     25259,     25258
    139868,     25327,     25328,     25260,     25259
    139869,     25328,     25329,     25261,     25260
    139870,     25329,     25330,     25262,     25261
    139871,     25330,     25331,     25263,     25262
    139872,     25331,     25332,     25264,     25263
    139873,     25332,     25333,     25265,     25264
    139874,     25333,     25334,     25266,     25265
    139875,     25334,     25304,     25267,     25266
    139876,     25334,     25335,     25305,     25304
    139877,     25335,     25336,     25306,     25305
    139878,     25336,     25337,     25307,     25306
    139879,     25337,     25338,     25308,     25307
    139880,     25338,     25339,     25309,     25308
    139881,     25339,     25340,     25310,     25309
    139882,     25340,     25341,     25311,     25310
    139883,     25341,     25342,     25312,     25311
    139884,     25342,     25343,     25313,     25312
    139885,     25343,     25344,     25314,     25313
    139886,     25344,     25345,     25315,     25314
    139887,     25345,     25346,     25316,     25315
    139888,     25346,     25347,     25317,     25316
    139889,     25347,     25348,     25318,     25317
    139890,     25348,     25273,     25272,     25318
    139891,     25333,     25349,     25335,     25334
    139892,     25349,     25350,     25336,     25335
    139893,     25350,     25351,     25337,     25336
    139894,     25351,     25352,     25338,     25337
    139895,     25352,     25353,     25339,     25338
    139896,     25353,     25354,     25340,     25339
    139897,     25354,     25355,     25341,     25340
    139898,     25355,     25356,     25342,     25341
    139899,     25356,     25357,     25343,     25342
    139900,     25357,     25358,     25344,     25343
    139901,     25358,     25359,     25345,     25344
    139902,     25359,     25360,     25346,     25345
    139903,     25360,     25361,     25347,     25346
    139904,     25361,     25362,     25348,     25347
    139905,     25362,     25274,     25273,     25348
    139906,     25289,     25363,     25319,     25290
    139907,     25363,     25364,     25320,     25319
    139908,     25364,     25365,     25321,     25320
    139909,     25365,     25366,     25322,     25321
    139910,     25366,     25367,     25323,     25322
    139911,     25367,     25368,     25324,     25323
    139912,     25368,     25369,     25325,     25324
    139913,     25369,     25370,     25326,     25325
    139914,     25370,     25371,     25327,     25326
    139915,     25371,     25372,     25328,     25327
    139916,     25372,     25373,     25329,     25328
    139917,     25373,     25374,     25330,     25329
    139918,     25374,     25375,     25331,     25330
    139919,     25375,     25376,     25332,     25331
    139920,     25376,     25349,     25333,     25332
    139921,     25376,     25377,     25350,     25349
    139922,     25377,     25378,     25351,     25350
    139923,     25378,     25379,     25352,     25351
    139924,     25379,     25380,     25353,     25352
    139925,     25380,     25381,     25354,     25353
    139926,     25381,     25382,     25355,     25354
    139927,     25382,     25383,     25356,     25355
    139928,     25383,     25384,     25357,     25356
    139929,     25384,     25385,     25358,     25357
    139930,     25385,     25386,     25359,     25358
    139931,     25386,     25387,     25360,     25359
    139932,     25387,     25388,     25361,     25360
    139933,     25388,     25389,     25362,     25361
    139934,     25389,     25275,     25274,     25362
    139935,     25375,     25390,     25377,     25376
    139936,     25390,     25391,     25378,     25377
    139937,     25391,     25392,     25379,     25378
    139938,     25392,     25393,     25380,     25379
    139939,     25393,     25394,     25381,     25380
    139940,     25394,     25395,     25382,     25381
    139941,     25395,     25396,     25383,     25382
    139942,     25396,     25397,     25384,     25383
    139943,     25397,     25398,     25385,     25384
    139944,     25398,     25399,     25386,     25385
    139945,     25399,     25400,     25387,     25386
    139946,     25400,     25401,     25388,     25387
    139947,     25401,     25291,     25389,     25388
    139948,     25291,     25269,     25275,     25389
    139949,     25400,     25399,     25292,     25189
    139950,     25398,     25445,     25292,     25399
    139951,     25397,     25402,     25445,     25398
    139952,     25418,     25294,     25293,     25444
    139953,     25396,     25403,     25402,     25397
    139954,     25395,     25404,     25403,     25396
    139955,     25394,     25405,     25404,     25395
    139956,     25393,     25422,     25405,     25394
    139957,     25392,     25421,     25422,     25393
    139958,     25391,     25406,     25421,     25392
    139959,     25390,     25407,     25406,     25391
    139960,     25374,     25407,     25390,     25375
    139961,     25303,     25363,     25289,     25251
    139962,     25303,     25408,     25364,     25363
    139963,     25408,     25409,     25365,     25364
    139964,     25409,     25410,     25366,     25365
    139965,     25302,     25411,     25366,     25410
    139966,     25301,     25412,     25411,     25302
    139967,     25366,     25411,     25442,     25367
    139968,     25300,     25413,     25412,     25301
    139969,     25299,     25414,     25413,     25300
    139970,     25298,     25415,     25414,     25299
    139971,     25297,     25416,     25415,     25298
    139972,     25296,     25423,     25416,     25297
    139973,     25295,     25417,     25423,     25296
    139974,     25294,     25418,     25417,     25295
    139975,     25403,     25417,     25418,     25402
    139976,     25403,     25404,     25423,     25417
    139977,     25373,     25419,     25407,     25374
    139978,     25419,     25420,     25406,     25407
    139979,     25416,     25423,     25404,     25405
    139980,     25422,     25424,     25416,     25405
    139981,     25424,     25425,     25415,     25416
    139982,     25421,     25426,     25424,     25422
    139983,     25406,     25420,     25426,     25421
    139984,     25425,     25427,     25414,     25415
    139985,     25426,     25428,     25425,     25424
    139986,     25428,     25429,     25427,     25425
    139987,     25420,     25435,     25428,     25426
    139988,     25435,     25430,     25429,     25428
    139989,     25427,     25431,     25413,     25414
    139990,     25429,     25432,     25431,     25427
    139991,     25430,     25433,     25432,     25429
    139992,     25372,     25434,     25419,     25373
    139993,     25434,     25435,     25420,     25419
    139994,     25434,     25436,     25430,     25435
    139995,     25436,     25437,     25433,     25430
    139996,     25371,     25436,     25434,     25372
    139997,     25370,     25437,     25436,     25371
    139998,     25431,     25438,     25412,     25413
    139999,     25432,     25439,     25438,     25431
    140000,     25433,     25440,     25439,     25432
    140001,     25437,     25441,     25440,     25433
    140002,     25369,     25441,     25437,     25370
    140003,     25367,     25442,     25443,     25368
    140004,     25438,     25442,     25411,     25412
    140005,     25443,     25439,     25440,     25441
    140006,     25443,     25442,     25438,     25439
    140007,     25441,     25369,     25368,     25443
    140008,     25292,     25445,     25444,     25293
    140009,     25418,     25444,     25445,     25402
    140010,     25490,     25487,     25486,     25492
    140011,     25492,     25486,     25482,     25481
    140012,     25491,     25490,     25492,     25493
    140013,     25493,     25492,     25481,     25480
    140014,     25466,     25491,     25493,     25467
    140015,     25467,     25493,     25480,     25468
    140016,     25180,     25181,     25489,     25494
    140017,     25494,     25489,     25488,     25495
    140018,     25495,     25488,     25487,     25490
    140019,     25178,     25179,     25496,     25464
    140020,     25179,     25180,     25494,     25496
    140021,     25491,     25466,     25465,     25497
    140022,     25497,     25465,     25464,     25496
    140023,     25490,     25491,     25497,     25495
    140024,     25495,     25497,     25496,     25494
    140025,     25498,     25453,     25452,     25502
    140026,     25502,     25452,     25451,     25485
    140027,     25499,     25498,     25502,     25501
    140028,     25501,     25502,     25485,     25484
    140029,     25500,     25499,     25501,     25503
    140030,     25503,     25501,     25484,     25483
    140031,     25487,     25500,     25503,     25486
    140032,     25486,     25503,     25483,     25482
    140033,     25183,     25184,     25506,     25504
    140034,     25184,     25185,     25455,     25506
    140035,     25498,     25499,     25505,     25507
    140036,     25507,     25505,     25504,     25506
    140037,     25453,     25498,     25507,     25454
    140038,     25454,     25507,     25506,     25455
    140039,     25181,     25182,     25508,     25489
    140040,     25182,     25183,     25504,     25508
    140041,     25500,     25487,     25488,     25509
    140042,     25509,     25488,     25489,     25508
    140043,     25499,     25500,     25509,     25505
    140044,     25505,     25509,     25508,     25504
    140045,     25514,     25511,     25510,     25516
    140046,     25516,     25510,     25476,     25475
    140047,     25515,     25514,     25516,     25517
    140048,     25517,     25516,     25475,     25474
    140049,     25471,     25515,     25517,     25472
    140050,     25472,     25517,     25474,     25473
    140051,     25481,     25482,     25513,     25518
    140052,     25518,     25513,     25512,     25519
    140053,     25519,     25512,     25511,     25514
    140054,     25468,     25480,     25520,     25469
    140055,     25480,     25481,     25518,     25520
    140056,     25515,     25471,     25470,     25521
    140057,     25521,     25470,     25469,     25520
    140058,     25514,     25515,     25521,     25519
    140059,     25519,     25521,     25520,     25518
    140060,     25522,     25448,     25447,     25526
    140061,     25526,     25447,     25446,     25479
    140062,     25523,     25522,     25526,     25525
    140063,     25525,     25526,     25479,     25478
    140064,     25524,     25523,     25525,     25527
    140065,     25527,     25525,     25478,     25477
    140066,     25511,     25524,     25527,     25510
    140067,     25510,     25527,     25477,     25476
    140068,     25484,     25485,     25530,     25528
    140069,     25485,     25451,     25450,     25530
    140070,     25522,     25523,     25529,     25531
    140071,     25531,     25529,     25528,     25530
    140072,     25448,     25522,     25531,     25449
    140073,     25449,     25531,     25530,     25450
    140074,     25482,     25483,     25532,     25513
    140075,     25483,     25484,     25528,     25532
    140076,     25524,     25511,     25512,     25533
    140077,     25533,     25512,     25513,     25532
    140078,     25523,     25524,     25533,     25529
    140079,     25529,     25533,     25532,     25528
    140080,     25559,     25454,     25455,     25560
    140081,     25560,     25455,     25185,     25545
    140082,     25542,     25559,     25560,     25543
    140083,     25543,     25560,     25545,     25544
    140084,     25454,     25559,     25561,     25453
    140085,     25559,     25542,     25541,     25561
    140086,     25558,     25451,     25452,     25562
    140087,     25562,     25452,     25453,     25561
    140088,     25539,     25558,     25562,     25540
    140089,     25540,     25562,     25561,     25541
    140090,     25563,     25449,     25450,     25564
    140091,     25564,     25450,     25451,     25558
    140092,     25537,     25563,     25564,     25538
    140093,     25538,     25564,     25558,     25539
    140094,     25449,     25563,     25565,     25448
    140095,     25563,     25537,     25536,     25565
    140096,     25557,     25446,     25447,     25566
    140097,     25566,     25447,     25448,     25565
    140098,     25534,     25557,     25566,     25535
    140099,     25535,     25566,     25565,     25536
    140100,     25203,     25204,     25614,     25613
    140101,     25204,     25205,     25568,     25614
    140102,     25613,     25614,     25610,     25609
    140103,     25614,     25568,     25567,     25610
    140104,     25202,     25203,     25613,     25615
    140105,     25615,     25613,     25609,     25608
    140106,     25200,     25201,     25616,     25612
    140107,     25201,     25202,     25615,     25616
    140108,     25612,     25616,     25607,     25606
    140109,     25616,     25615,     25608,     25607
    140110,     25198,     25199,     25618,     25617
    140111,     25199,     25200,     25612,     25618
    140112,     25617,     25618,     25605,     25604
    140113,     25618,     25612,     25606,     25605
    140114,     25197,     25198,     25617,     25619
    140115,     25619,     25617,     25604,     25603
    140116,     25195,     25196,     25620,     25611
    140117,     25196,     25197,     25619,     25620
    140118,     25611,     25620,     25602,     25601
    140119,     25620,     25619,     25603,     25602
    140120,     25193,     25194,     25623,     25622
    140121,     25194,     25195,     25611,     25623
    140122,     25622,     25623,     25600,     25599
    140123,     25623,     25611,     25601,     25600
    140124,     25192,     25193,     25622,     25624
    140125,     25624,     25622,     25599,     25598
    140126,     25190,     25191,     25625,     25621
    140127,     25191,     25192,     25624,     25625
    140128,     25621,     25625,     25597,     25596
    140129,     25625,     25624,     25598,     25597
    140130,     25188,     25189,     25627,     25626
    140131,     25189,     25190,     25621,     25627
    140132,     25626,     25627,     25595,     25594
    140133,     25627,     25621,     25596,     25595
    140134,     25187,     25188,     25626,     25628
    140135,     25628,     25626,     25594,     25593
    140136,     25185,     25186,     25629,     25545
    140137,     25186,     25187,     25628,     25629
    140138,     25545,     25629,     25592,     25544
    140139,     25629,     25628,     25593,     25592
    140140,     25209,     25210,     25664,     25701
    140141,     25701,     25664,     25665,     25702
    140142,     25700,     25631,     25632,     25703
    140143,     25657,     25205,     25206,     25704
    140144,     25702,     25665,     25666,     25705
    140145,     25705,     25666,     25667,     25706
    140146,     25706,     25667,     25668,     25707
    140147,     25707,     25668,     25669,     25708
    140148,     25708,     25669,     25670,     25709
    140149,     25709,     25670,     25671,     25710
    140150,     25710,     25671,     25672,     25711
    140151,     25711,     25672,     25673,     25712
    140152,     25712,     25673,     25674,     25713
    140153,     25713,     25674,     25675,     25714
    140154,     25714,     25675,     25676,     25715
    140155,     25715,     25676,     25677,     25716
    140156,     25716,     25677,     25678,     25717
    140157,     25717,     25678,     25679,     25718
    140158,     25718,     25679,     25680,     25719
    140159,     25719,     25680,     25681,     25720
    140160,     25720,     25681,     25682,     25721
    140161,     25721,     25682,     25683,     25684
    140162,     25637,     25638,     25639,     25722
    140163,     25721,     25684,     25685,     25723
    140164,     25723,     25685,     25686,     25724
    140165,     25703,     25632,     25633,     25725
    140166,     25725,     25633,     25634,     25726
    140167,     25726,     25634,     25635,     25727
    140168,     25727,     25635,     25636,     25728
    140169,     25728,     25636,     25637,     25722
    140170,     25724,     25686,     25687,     25729
    140171,     25729,     25687,     25688,     25730
    140172,     25730,     25688,     25689,     25731
    140173,     25731,     25689,     25690,     25732
    140174,     25732,     25690,     25691,     25733
    140175,     25733,     25691,     25692,     25734
    140176,     25734,     25692,     25693,     25735
    140177,     25735,     25693,     25694,     25736
    140178,     25736,     25694,     25695,     25737
    140179,     25737,     25695,     25696,     25738
    140180,     25738,     25696,     25697,     25739
    140181,     25739,     25697,     25698,     25740
    140182,     25740,     25698,     25699,     25741
    140183,     25741,     25699,     25700,     25703
    140184,     25704,     25206,     25207,     25742
    140185,     25742,     25207,     25208,     25743
    140186,     25743,     25208,     25209,     25701
    140187,     25722,     25639,     25640,     25744
    140188,     25744,     25640,     25641,     25854
    140189,     25854,     25641,     25642,     25853
    140190,     25745,     25642,     25643,     25746
    140191,     25746,     25643,     25644,     25747
    140192,     25747,     25644,     25645,     25748
    140193,     25748,     25645,     25646,     25749
    140194,     25749,     25646,     25647,     25750
    140195,     25750,     25647,     25648,     25751
    140196,     25751,     25648,     25649,     25752
    140197,     25752,     25649,     25650,     25753
    140198,     25753,     25650,     25651,     25754
    140199,     25754,     25651,     25652,     25755
    140200,     25755,     25652,     25653,     25863
    140201,     25863,     25653,     25654,     25862
    140202,     25862,     25654,     25655,     25861
    140203,     25861,     25655,     25656,     25756
    140204,     25756,     25656,     25657,     25704
    140205,     25720,     25721,     25723,     25757
    140206,     25757,     25723,     25724,     25758
    140207,     25758,     25724,     25729,     25759
    140208,     25759,     25729,     25730,     25760
    140209,     25760,     25730,     25731,     25761
    140210,     25761,     25731,     25732,     25762
    140211,     25762,     25732,     25733,     25763
    140212,     25763,     25733,     25734,     25764
    140213,     25764,     25734,     25735,     25765
    140214,     25765,     25735,     25736,     25766
    140215,     25766,     25736,     25737,     25767
    140216,     25767,     25737,     25738,     25768
    140217,     25768,     25738,     25739,     25769
    140218,     25769,     25739,     25740,     25770
    140219,     25770,     25740,     25741,     25771
    140220,     25771,     25741,     25703,     25725
    140221,     25743,     25701,     25702,     25772
    140222,     25772,     25702,     25705,     25773
    140223,     25773,     25705,     25706,     25774
    140224,     25774,     25706,     25707,     25775
    140225,     25775,     25707,     25708,     25776
    140226,     25776,     25708,     25709,     25777
    140227,     25777,     25709,     25710,     25778
    140228,     25778,     25710,     25711,     25779
    140229,     25779,     25711,     25712,     25780
    140230,     25780,     25712,     25713,     25781
    140231,     25781,     25713,     25714,     25782
    140232,     25782,     25714,     25715,     25783
    140233,     25783,     25715,     25716,     25784
    140234,     25784,     25716,     25717,     25785
    140235,     25785,     25717,     25718,     25786
    140236,     25786,     25718,     25719,     25787
    140237,     25787,     25719,     25720,     25757
    140238,     25787,     25757,     25758,     25788
    140239,     25788,     25758,     25759,     25789
    140240,     25789,     25759,     25760,     25790
    140241,     25790,     25760,     25761,     25791
    140242,     25791,     25761,     25762,     25792
    140243,     25792,     25762,     25763,     25793
    140244,     25793,     25763,     25764,     25794
    140245,     25794,     25764,     25765,     25795
    140246,     25795,     25765,     25766,     25796
    140247,     25796,     25766,     25767,     25797
    140248,     25797,     25767,     25768,     25798
    140249,     25798,     25768,     25769,     25799
    140250,     25799,     25769,     25770,     25800
    140251,     25800,     25770,     25771,     25801
    140252,     25801,     25771,     25725,     25726
    140253,     25786,     25787,     25788,     25802
    140254,     25802,     25788,     25789,     25803
    140255,     25803,     25789,     25790,     25804
    140256,     25804,     25790,     25791,     25805
    140257,     25805,     25791,     25792,     25806
    140258,     25806,     25792,     25793,     25807
    140259,     25807,     25793,     25794,     25808
    140260,     25808,     25794,     25795,     25809
    140261,     25809,     25795,     25796,     25810
    140262,     25810,     25796,     25797,     25811
    140263,     25811,     25797,     25798,     25812
    140264,     25812,     25798,     25799,     25813
    140265,     25813,     25799,     25800,     25814
    140266,     25814,     25800,     25801,     25815
    140267,     25815,     25801,     25726,     25727
    140268,     25742,     25743,     25772,     25816
    140269,     25816,     25772,     25773,     25817
    140270,     25817,     25773,     25774,     25818
    140271,     25818,     25774,     25775,     25819
    140272,     25819,     25775,     25776,     25820
    140273,     25820,     25776,     25777,     25821
    140274,     25821,     25777,     25778,     25822
    140275,     25822,     25778,     25779,     25823
    140276,     25823,     25779,     25780,     25824
    140277,     25824,     25780,     25781,     25825
    140278,     25825,     25781,     25782,     25826
    140279,     25826,     25782,     25783,     25827
    140280,     25827,     25783,     25784,     25828
    140281,     25828,     25784,     25785,     25829
    140282,     25829,     25785,     25786,     25802
    140283,     25829,     25802,     25803,     25830
    140284,     25830,     25803,     25804,     25831
    140285,     25831,     25804,     25805,     25832
    140286,     25832,     25805,     25806,     25833
    140287,     25833,     25806,     25807,     25834
    140288,     25834,     25807,     25808,     25835
    140289,     25835,     25808,     25809,     25836
    140290,     25836,     25809,     25810,     25837
    140291,     25837,     25810,     25811,     25838
    140292,     25838,     25811,     25812,     25839
    140293,     25839,     25812,     25813,     25840
    140294,     25840,     25813,     25814,     25841
    140295,     25841,     25814,     25815,     25842
    140296,     25842,     25815,     25727,     25728
    140297,     25828,     25829,     25830,     25843
    140298,     25843,     25830,     25831,     25844
    140299,     25844,     25831,     25832,     25845
    140300,     25845,     25832,     25833,     25846
    140301,     25846,     25833,     25834,     25847
    140302,     25847,     25834,     25835,     25848
    140303,     25848,     25835,     25836,     25849
    140304,     25849,     25836,     25837,     25850
    140305,     25850,     25837,     25838,     25851
    140306,     25851,     25838,     25839,     25852
    140307,     25852,     25839,     25840,     25853
    140308,     25853,     25840,     25841,     25854
    140309,     25854,     25841,     25842,     25744
    140310,     25744,     25842,     25728,     25722
    140311,     25853,     25642,     25745,     25852
    140312,     25851,     25852,     25745,     25898
    140313,     25850,     25851,     25898,     25855
    140314,     25871,     25897,     25746,     25747
    140315,     25849,     25850,     25855,     25856
    140316,     25848,     25849,     25856,     25857
    140317,     25847,     25848,     25857,     25858
    140318,     25846,     25847,     25858,     25875
    140319,     25845,     25846,     25875,     25874
    140320,     25844,     25845,     25874,     25859
    140321,     25843,     25844,     25859,     25860
    140322,     25827,     25828,     25843,     25860
    140323,     25756,     25704,     25742,     25816
    140324,     25756,     25816,     25817,     25861
    140325,     25861,     25817,     25818,     25862
    140326,     25862,     25818,     25819,     25863
    140327,     25755,     25863,     25819,     25864
    140328,     25754,     25755,     25864,     25865
    140329,     25819,     25820,     25895,     25864
    140330,     25753,     25754,     25865,     25866
    140331,     25752,     25753,     25866,     25867
    140332,     25751,     25752,     25867,     25868
    140333,     25750,     25751,     25868,     25869
    140334,     25749,     25750,     25869,     25876
    140335,     25748,     25749,     25876,     25870
    140336,     25747,     25748,     25870,     25871
    140337,     25856,     25855,     25871,     25870
    140338,     25856,     25870,     25876,     25857
    140339,     25826,     25827,     25860,     25872
    140340,     25872,     25860,     25859,     25873
    140341,     25869,     25858,     25857,     25876
    140342,     25875,     25858,     25869,     25877
    140343,     25877,     25869,     25868,     25878
    140344,     25874,     25875,     25877,     25879
    140345,     25859,     25874,     25879,     25873
    140346,     25878,     25868,     25867,     25880
    140347,     25879,     25877,     25878,     25881
    140348,     25881,     25878,     25880,     25882
    140349,     25873,     25879,     25881,     25888
    140350,     25888,     25881,     25882,     25883
    140351,     25880,     25867,     25866,     25884
    140352,     25882,     25880,     25884,     25885
    140353,     25883,     25882,     25885,     25886
    140354,     25825,     25826,     25872,     25887
    140355,     25887,     25872,     25873,     25888
    140356,     25887,     25888,     25883,     25889
    140357,     25889,     25883,     25886,     25890
    140358,     25824,     25825,     25887,     25889
    140359,     25823,     25824,     25889,     25890
    140360,     25884,     25866,     25865,     25891
    140361,     25885,     25884,     25891,     25892
    140362,     25886,     25885,     25892,     25893
    140363,     25890,     25886,     25893,     25894
    140364,     25822,     25823,     25890,     25894
    140365,     25820,     25821,     25896,     25895
    140366,     25891,     25865,     25864,     25895
    140367,     25896,     25894,     25893,     25892
    140368,     25896,     25892,     25891,     25895
    140369,     25894,     25896,     25821,     25822
    140370,     25745,     25746,     25897,     25898
    140371,     25871,     25855,     25898,     25897
    140372,     25935,     25937,     25931,     25932
    140373,     25937,     25926,     25927,     25931
    140374,     25936,     25938,     25937,     25935
    140375,     25938,     25925,     25926,     25937
    140376,     25911,     25912,     25938,     25936
    140377,     25912,     25913,     25925,     25938
    140378,     25633,     25939,     25934,     25634
    140379,     25939,     25940,     25933,     25934
    140380,     25940,     25935,     25932,     25933
    140381,     25631,     25909,     25941,     25632
    140382,     25632,     25941,     25939,     25633
    140383,     25936,     25942,     25910,     25911
    140384,     25942,     25941,     25909,     25910
    140385,     25935,     25940,     25942,     25936
    140386,     25940,     25939,     25941,     25942
    140387,     25943,     25947,     25905,     25906
    140388,     25947,     25930,     25904,     25905
    140389,     25944,     25946,     25947,     25943
    140390,     25946,     25929,     25930,     25947
    140391,     25945,     25948,     25946,     25944
    140392,     25948,     25928,     25929,     25946
    140393,     25932,     25931,     25948,     25945
    140394,     25931,     25927,     25928,     25948
    140395,     25636,     25949,     25951,     25637
    140396,     25637,     25951,     25908,     25638
    140397,     25943,     25952,     25950,     25944
    140398,     25952,     25951,     25949,     25950
    140399,     25906,     25907,     25952,     25943
    140400,     25907,     25908,     25951,     25952
    140401,     25634,     25934,     25953,     25635
    140402,     25635,     25953,     25949,     25636
    140403,     25945,     25954,     25933,     25932
    140404,     25954,     25953,     25934,     25933
    140405,     25944,     25950,     25954,     25945
    140406,     25950,     25949,     25953,     25954
    140407,     25959,     25961,     25955,     25956
    140408,     25961,     25920,     25921,     25955
    140409,     25960,     25962,     25961,     25959
    140410,     25962,     25919,     25920,     25961
    140411,     25916,     25917,     25962,     25960
    140412,     25917,     25918,     25919,     25962
    140413,     25926,     25963,     25958,     25927
    140414,     25963,     25964,     25957,     25958
    140415,     25964,     25959,     25956,     25957
    140416,     25913,     25914,     25965,     25925
    140417,     25925,     25965,     25963,     25926
    140418,     25960,     25966,     25915,     25916
    140419,     25966,     25965,     25914,     25915
    140420,     25959,     25964,     25966,     25960
    140421,     25964,     25963,     25965,     25966
    140422,     25967,     25971,     25900,     25901
    140423,     25971,     25924,     25899,     25900
    140424,     25968,     25970,     25971,     25967
    140425,     25970,     25923,     25924,     25971
    140426,     25969,     25972,     25970,     25968
    140427,     25972,     25922,     25923,     25970
    140428,     25956,     25955,     25972,     25969
    140429,     25955,     25921,     25922,     25972
    140430,     25929,     25973,     25975,     25930
    140431,     25930,     25975,     25903,     25904
    140432,     25967,     25976,     25974,     25968
    140433,     25976,     25975,     25973,     25974
    140434,     25901,     25902,     25976,     25967
    140435,     25902,     25903,     25975,     25976
    140436,     25927,     25958,     25977,     25928
    140437,     25928,     25977,     25973,     25929
    140438,     25969,     25978,     25957,     25956
    140439,     25978,     25977,     25958,     25957
    140440,     25968,     25974,     25978,     25969
    140441,     25974,     25973,     25977,     25978
    140442,     25993,     25994,     25908,     25907
    140443,     25994,     25990,     25638,     25908
    140444,     25987,     25988,     25994,     25993
    140445,     25988,     25989,     25990,     25994
    140446,     25907,     25906,     25995,     25993
    140447,     25993,     25995,     25986,     25987
    140448,     25992,     25996,     25905,     25904
    140449,     25996,     25995,     25906,     25905
    140450,     25984,     25985,     25996,     25992
    140451,     25985,     25986,     25995,     25996
    140452,     25997,     25998,     25903,     25902
    140453,     25998,     25992,     25904,     25903
    140454,     25982,     25983,     25998,     25997
    140455,     25983,     25984,     25992,     25998
    140456,     25902,     25901,     25999,     25997
    140457,     25997,     25999,     25981,     25982
    140458,     25991,     26000,     25900,     25899
    140459,     26000,     25999,     25901,     25900
    140460,     25979,     25980,     26000,     25991
    140461,     25980,     25981,     25999,     26000
    140462,     25656,     26024,     26025,     25657
    140463,     25657,     26025,     25568,     25205
    140464,     26024,     26020,     26021,     26025
    140465,     26025,     26021,     25567,     25568
    140466,     25655,     26026,     26024,     25656
    140467,     26026,     26019,     26020,     26024
    140468,     25653,     26023,     26027,     25654
    140469,     25654,     26027,     26026,     25655
    140470,     26023,     26017,     26018,     26027
    140471,     26027,     26018,     26019,     26026
    140472,     25651,     26028,     26029,     25652
    140473,     25652,     26029,     26023,     25653
    140474,     26028,     26015,     26016,     26029
    140475,     26029,     26016,     26017,     26023
    140476,     25650,     26030,     26028,     25651
    140477,     26030,     26014,     26015,     26028
    140478,     25648,     26022,     26031,     25649
    140479,     25649,     26031,     26030,     25650
    140480,     26022,     26012,     26013,     26031
    140481,     26031,     26013,     26014,     26030
    140482,     25646,     26033,     26034,     25647
    140483,     25647,     26034,     26022,     25648
    140484,     26033,     26010,     26011,     26034
    140485,     26034,     26011,     26012,     26022
    140486,     25645,     26035,     26033,     25646
    140487,     26035,     26009,     26010,     26033
    140488,     25643,     26032,     26036,     25644
    140489,     25644,     26036,     26035,     25645
    140490,     26032,     26007,     26008,     26036
    140491,     26036,     26008,     26009,     26035
    140492,     25641,     26037,     26038,     25642
    140493,     25642,     26038,     26032,     25643
    140494,     26037,     26005,     26006,     26038
    140495,     26038,     26006,     26007,     26032
    140496,     25640,     26039,     26037,     25641
    140497,     26039,     26004,     26005,     26037
    140498,     25638,     25990,     26040,     25639
    140499,     25639,     26040,     26039,     25640
    140500,     25990,     25989,     26003,     26040
    140501,     26040,     26003,     26004,     26039
    140502,     26072,     26073,     26074,     26111
    140503,     26111,     26074,     26075,     26112
    140504,     26110,     26041,     26042,     26113
    140505,     26067,     26068,     26069,     26114
    140506,     26112,     26075,     26076,     26115
    140507,     26115,     26076,     26077,     26116
    140508,     26116,     26077,     26078,     26117
    140509,     26117,     26078,     26079,     26118
    140510,     26118,     26079,     26080,     26119
    140511,     26119,     26080,     26081,     26120
    140512,     26120,     26081,     26082,     26121
    140513,     26121,     26082,     26083,     26122
    140514,     26122,     26083,     26084,     26123
    140515,     26123,     26084,     26085,     26124
    140516,     26124,     26085,     26086,     26125
    140517,     26125,     26086,     26087,     26126
    140518,     26126,     26087,     26088,     26127
    140519,     26127,     26088,     26089,     26128
    140520,     26128,     26089,     26090,     26129
    140521,     26129,     26090,     26091,     26130
    140522,     26130,     26091,     26092,     26131
    140523,     26131,     26092,     26093,     26094
    140524,     26047,     26048,     26049,     26132
    140525,     26131,     26094,     26095,     26133
    140526,     26133,     26095,     26096,     26134
    140527,     26113,     26042,     26043,     26135
    140528,     26135,     26043,     26044,     26136
    140529,     26136,     26044,     26045,     26137
    140530,     26137,     26045,     26046,     26138
    140531,     26138,     26046,     26047,     26132
    140532,     26134,     26096,     26097,     26139
    140533,     26139,     26097,     26098,     26140
    140534,     26140,     26098,     26099,     26141
    140535,     26141,     26099,     26100,     26142
    140536,     26142,     26100,     26101,     26143
    140537,     26143,     26101,     26102,     26144
    140538,     26144,     26102,     26103,     26145
    140539,     26145,     26103,     26104,     26146
    140540,     26146,     26104,     26105,     26147
    140541,     26147,     26105,     26106,     26148
    140542,     26148,     26106,     26107,     26149
    140543,     26149,     26107,     26108,     26150
    140544,     26150,     26108,     26109,     26151
    140545,     26151,     26109,     26110,     26113
    140546,     26114,     26069,     26070,     26152
    140547,     26152,     26070,     26071,     26153
    140548,     26153,     26071,     26072,     26111
    140549,     26132,     26049,     26050,     26154
    140550,     26154,     26050,     26051,     26264
    140551,     26264,     26051,     26052,     26263
    140552,     26155,     26052,     26053,     26156
    140553,     26156,     26053,     26054,     26157
    140554,     26157,     26054,     26055,     26158
    140555,     26158,     26055,     26056,     26159
    140556,     26159,     26056,     26057,     26160
    140557,     26160,     26057,     26058,     26161
    140558,     26161,     26058,     26059,     26162
    140559,     26162,     26059,     26060,     26163
    140560,     26163,     26060,     26061,     26164
    140561,     26164,     26061,     26062,     26165
    140562,     26165,     26062,     26063,     26273
    140563,     26273,     26063,     26064,     26272
    140564,     26272,     26064,     26065,     26271
    140565,     26271,     26065,     26066,     26166
    140566,     26166,     26066,     26067,     26114
    140567,     26130,     26131,     26133,     26167
    140568,     26167,     26133,     26134,     26168
    140569,     26168,     26134,     26139,     26169
    140570,     26169,     26139,     26140,     26170
    140571,     26170,     26140,     26141,     26171
    140572,     26171,     26141,     26142,     26172
    140573,     26172,     26142,     26143,     26173
    140574,     26173,     26143,     26144,     26174
    140575,     26174,     26144,     26145,     26175
    140576,     26175,     26145,     26146,     26176
    140577,     26176,     26146,     26147,     26177
    140578,     26177,     26147,     26148,     26178
    140579,     26178,     26148,     26149,     26179
    140580,     26179,     26149,     26150,     26180
    140581,     26180,     26150,     26151,     26181
    140582,     26181,     26151,     26113,     26135
    140583,     26153,     26111,     26112,     26182
    140584,     26182,     26112,     26115,     26183
    140585,     26183,     26115,     26116,     26184
    140586,     26184,     26116,     26117,     26185
    140587,     26185,     26117,     26118,     26186
    140588,     26186,     26118,     26119,     26187
    140589,     26187,     26119,     26120,     26188
    140590,     26188,     26120,     26121,     26189
    140591,     26189,     26121,     26122,     26190
    140592,     26190,     26122,     26123,     26191
    140593,     26191,     26123,     26124,     26192
    140594,     26192,     26124,     26125,     26193
    140595,     26193,     26125,     26126,     26194
    140596,     26194,     26126,     26127,     26195
    140597,     26195,     26127,     26128,     26196
    140598,     26196,     26128,     26129,     26197
    140599,     26197,     26129,     26130,     26167
    140600,     26197,     26167,     26168,     26198
    140601,     26198,     26168,     26169,     26199
    140602,     26199,     26169,     26170,     26200
    140603,     26200,     26170,     26171,     26201
    140604,     26201,     26171,     26172,     26202
    140605,     26202,     26172,     26173,     26203
    140606,     26203,     26173,     26174,     26204
    140607,     26204,     26174,     26175,     26205
    140608,     26205,     26175,     26176,     26206
    140609,     26206,     26176,     26177,     26207
    140610,     26207,     26177,     26178,     26208
    140611,     26208,     26178,     26179,     26209
    140612,     26209,     26179,     26180,     26210
    140613,     26210,     26180,     26181,     26211
    140614,     26211,     26181,     26135,     26136
    140615,     26196,     26197,     26198,     26212
    140616,     26212,     26198,     26199,     26213
    140617,     26213,     26199,     26200,     26214
    140618,     26214,     26200,     26201,     26215
    140619,     26215,     26201,     26202,     26216
    140620,     26216,     26202,     26203,     26217
    140621,     26217,     26203,     26204,     26218
    140622,     26218,     26204,     26205,     26219
    140623,     26219,     26205,     26206,     26220
    140624,     26220,     26206,     26207,     26221
    140625,     26221,     26207,     26208,     26222
    140626,     26222,     26208,     26209,     26223
    140627,     26223,     26209,     26210,     26224
    140628,     26224,     26210,     26211,     26225
    140629,     26225,     26211,     26136,     26137
    140630,     26152,     26153,     26182,     26226
    140631,     26226,     26182,     26183,     26227
    140632,     26227,     26183,     26184,     26228
    140633,     26228,     26184,     26185,     26229
    140634,     26229,     26185,     26186,     26230
    140635,     26230,     26186,     26187,     26231
    140636,     26231,     26187,     26188,     26232
    140637,     26232,     26188,     26189,     26233
    140638,     26233,     26189,     26190,     26234
    140639,     26234,     26190,     26191,     26235
    140640,     26235,     26191,     26192,     26236
    140641,     26236,     26192,     26193,     26237
    140642,     26237,     26193,     26194,     26238
    140643,     26238,     26194,     26195,     26239
    140644,     26239,     26195,     26196,     26212
    140645,     26239,     26212,     26213,     26240
    140646,     26240,     26213,     26214,     26241
    140647,     26241,     26214,     26215,     26242
    140648,     26242,     26215,     26216,     26243
    140649,     26243,     26216,     26217,     26244
    140650,     26244,     26217,     26218,     26245
    140651,     26245,     26218,     26219,     26246
    140652,     26246,     26219,     26220,     26247
    140653,     26247,     26220,     26221,     26248
    140654,     26248,     26221,     26222,     26249
    140655,     26249,     26222,     26223,     26250
    140656,     26250,     26223,     26224,     26251
    140657,     26251,     26224,     26225,     26252
    140658,     26252,     26225,     26137,     26138
    140659,     26238,     26239,     26240,     26253
    140660,     26253,     26240,     26241,     26254
    140661,     26254,     26241,     26242,     26255
    140662,     26255,     26242,     26243,     26256
    140663,     26256,     26243,     26244,     26257
    140664,     26257,     26244,     26245,     26258
    140665,     26258,     26245,     26246,     26259
    140666,     26259,     26246,     26247,     26260
    140667,     26260,     26247,     26248,     26261
    140668,     26261,     26248,     26249,     26262
    140669,     26262,     26249,     26250,     26263
    140670,     26263,     26250,     26251,     26264
    140671,     26264,     26251,     26252,     26154
    140672,     26154,     26252,     26138,     26132
    140673,     26263,     26052,     26155,     26262
    140674,     26261,     26262,     26155,     26308
    140675,     26260,     26261,     26308,     26265
    140676,     26281,     26307,     26156,     26157
    140677,     26259,     26260,     26265,     26266
    140678,     26258,     26259,     26266,     26267
    140679,     26257,     26258,     26267,     26268
    140680,     26256,     26257,     26268,     26285
    140681,     26255,     26256,     26285,     26284
    140682,     26254,     26255,     26284,     26269
    140683,     26253,     26254,     26269,     26270
    140684,     26237,     26238,     26253,     26270
    140685,     26166,     26114,     26152,     26226
    140686,     26166,     26226,     26227,     26271
    140687,     26271,     26227,     26228,     26272
    140688,     26272,     26228,     26229,     26273
    140689,     26165,     26273,     26229,     26274
    140690,     26164,     26165,     26274,     26275
    140691,     26229,     26230,     26305,     26274
    140692,     26163,     26164,     26275,     26276
    140693,     26162,     26163,     26276,     26277
    140694,     26161,     26162,     26277,     26278
    140695,     26160,     26161,     26278,     26279
    140696,     26159,     26160,     26279,     26286
    140697,     26158,     26159,     26286,     26280
    140698,     26157,     26158,     26280,     26281
    140699,     26266,     26265,     26281,     26280
    140700,     26266,     26280,     26286,     26267
    140701,     26236,     26237,     26270,     26282
    140702,     26282,     26270,     26269,     26283
    140703,     26279,     26268,     26267,     26286
    140704,     26285,     26268,     26279,     26287
    140705,     26287,     26279,     26278,     26288
    140706,     26284,     26285,     26287,     26289
    140707,     26269,     26284,     26289,     26283
    140708,     26288,     26278,     26277,     26290
    140709,     26289,     26287,     26288,     26291
    140710,     26291,     26288,     26290,     26292
    140711,     26283,     26289,     26291,     26298
    140712,     26298,     26291,     26292,     26293
    140713,     26290,     26277,     26276,     26294
    140714,     26292,     26290,     26294,     26295
    140715,     26293,     26292,     26295,     26296
    140716,     26235,     26236,     26282,     26297
    140717,     26297,     26282,     26283,     26298
    140718,     26297,     26298,     26293,     26299
    140719,     26299,     26293,     26296,     26300
    140720,     26234,     26235,     26297,     26299
    140721,     26233,     26234,     26299,     26300
    140722,     26294,     26276,     26275,     26301
    140723,     26295,     26294,     26301,     26302
    140724,     26296,     26295,     26302,     26303
    140725,     26300,     26296,     26303,     26304
    140726,     26232,     26233,     26300,     26304
    140727,     26230,     26231,     26306,     26305
    140728,     26301,     26275,     26274,     26305
    140729,     26306,     26304,     26303,     26302
    140730,     26306,     26302,     26301,     26305
    140731,     26304,     26306,     26231,     26232
    140732,     26155,     26156,     26307,     26308
    140733,     26281,     26265,     26308,     26307
    140734,     26353,     26355,     26349,     26350
    140735,     26355,     26344,     26345,     26349
    140736,     26354,     26356,     26355,     26353
    140737,     26356,     26343,     26344,     26355
    140738,     26329,     26330,     26356,     26354
    140739,     26330,     26331,     26343,     26356
    140740,     26043,     26357,     26352,     26044
    140741,     26357,     26358,     26351,     26352
    140742,     26358,     26353,     26350,     26351
    140743,     26041,     26327,     26359,     26042
    140744,     26042,     26359,     26357,     26043
    140745,     26354,     26360,     26328,     26329
    140746,     26360,     26359,     26327,     26328
    140747,     26353,     26358,     26360,     26354
    140748,     26358,     26357,     26359,     26360
    140749,     26361,     26365,     26315,     26316
    140750,     26365,     26348,     26314,     26315
    140751,     26362,     26364,     26365,     26361
    140752,     26364,     26347,     26348,     26365
    140753,     26363,     26366,     26364,     26362
    140754,     26366,     26346,     26347,     26364
    140755,     26350,     26349,     26366,     26363
    140756,     26349,     26345,     26346,     26366
    140757,     26046,     26367,     26369,     26047
    140758,     26047,     26369,     26318,     26048
    140759,     26361,     26370,     26368,     26362
    140760,     26370,     26369,     26367,     26368
    140761,     26316,     26317,     26370,     26361
    140762,     26317,     26318,     26369,     26370
    140763,     26044,     26352,     26371,     26045
    140764,     26045,     26371,     26367,     26046
    140765,     26363,     26372,     26351,     26350
    140766,     26372,     26371,     26352,     26351
    140767,     26362,     26368,     26372,     26363
    140768,     26368,     26367,     26371,     26372
    140769,     26377,     26379,     26373,     26374
    140770,     26379,     25475,     25476,     26373
    140771,     26378,     26380,     26379,     26377
    140772,     26380,     25474,     25475,     26379
    140773,     26334,     26335,     26380,     26378
    140774,     26335,     25473,     25474,     26380
    140775,     26344,     26381,     26376,     26345
    140776,     26381,     26382,     26375,     26376
    140777,     26382,     26377,     26374,     26375
    140778,     26331,     26332,     26383,     26343
    140779,     26343,     26383,     26381,     26344
    140780,     26378,     26384,     26333,     26334
    140781,     26384,     26383,     26332,     26333
    140782,     26377,     26382,     26384,     26378
    140783,     26382,     26381,     26383,     26384
    140784,     26385,     26389,     26310,     26311
    140785,     26389,     25479,     25446,     26310
    140786,     26386,     26388,     26389,     26385
    140787,     26388,     25478,     25479,     26389
    140788,     26387,     26390,     26388,     26386
    140789,     26390,     25477,     25478,     26388
    140790,     26374,     26373,     26390,     26387
    140791,     26373,     25476,     25477,     26390
    140792,     26347,     26391,     26393,     26348
    140793,     26348,     26393,     26313,     26314
    140794,     26385,     26394,     26392,     26386
    140795,     26394,     26393,     26391,     26392
    140796,     26311,     26312,     26394,     26385
    140797,     26312,     26313,     26393,     26394
    140798,     26345,     26376,     26395,     26346
    140799,     26346,     26395,     26391,     26347
    140800,     26387,     26396,     26375,     26374
    140801,     26396,     26395,     26376,     26375
    140802,     26386,     26392,     26396,     26387
    140803,     26392,     26391,     26395,     26396
    140804,     26422,     26423,     26318,     26317
    140805,     26423,     26408,     26048,     26318
    140806,     26405,     26406,     26423,     26422
    140807,     26406,     26407,     26408,     26423
    140808,     26317,     26316,     26424,     26422
    140809,     26422,     26424,     26404,     26405
    140810,     26421,     26425,     26315,     26314
    140811,     26425,     26424,     26316,     26315
    140812,     26402,     26403,     26425,     26421
    140813,     26403,     26404,     26424,     26425
    140814,     26426,     26427,     26313,     26312
    140815,     26427,     26421,     26314,     26313
    140816,     26400,     26401,     26427,     26426
    140817,     26401,     26402,     26421,     26427
    140818,     26312,     26311,     26428,     26426
    140819,     26426,     26428,     26399,     26400
    140820,     25557,     26429,     26310,     25446
    140821,     26429,     26428,     26311,     26310
    140822,     25534,     26398,     26429,     25557
    140823,     26398,     26399,     26428,     26429
    140824,     26066,     26475,     26476,     26067
    140825,     26067,     26476,     26431,     26068
    140826,     26475,     26471,     26472,     26476
    140827,     26476,     26472,     26430,     26431
    140828,     26065,     26477,     26475,     26066
    140829,     26477,     26470,     26471,     26475
    140830,     26063,     26474,     26478,     26064
    140831,     26064,     26478,     26477,     26065
    140832,     26474,     26468,     26469,     26478
    140833,     26478,     26469,     26470,     26477
    140834,     26061,     26479,     26480,     26062
    140835,     26062,     26480,     26474,     26063
    140836,     26479,     26466,     26467,     26480
    140837,     26480,     26467,     26468,     26474
    140838,     26060,     26481,     26479,     26061
    140839,     26481,     26465,     26466,     26479
    140840,     26058,     26473,     26482,     26059
    140841,     26059,     26482,     26481,     26060
    140842,     26473,     26463,     26464,     26482
    140843,     26482,     26464,     26465,     26481
    140844,     26056,     26484,     26485,     26057
    140845,     26057,     26485,     26473,     26058
    140846,     26484,     26461,     26462,     26485
    140847,     26485,     26462,     26463,     26473
    140848,     26055,     26486,     26484,     26056
    140849,     26486,     26460,     26461,     26484
    140850,     26053,     26483,     26487,     26054
    140851,     26054,     26487,     26486,     26055
    140852,     26483,     26458,     26459,     26487
    140853,     26487,     26459,     26460,     26486
    140854,     26051,     26488,     26489,     26052
    140855,     26052,     26489,     26483,     26053
    140856,     26488,     26456,     26457,     26489
    140857,     26489,     26457,     26458,     26483
    140858,     26050,     26490,     26488,     26051
    140859,     26490,     26455,     26456,     26488
    140860,     26048,     26408,     26491,     26049
    140861,     26049,     26491,     26490,     26050
    140862,     26408,     26407,     26454,     26491
    140863,     26491,     26454,     26455,     26490
    140864,     26072,     26521,     26322,     26073
    140865,     26521,     26522,     26319,     26322
    140866,     26520,     26523,     26453,     26451
    140867,     26415,     26524,     26069,     26068
    140868,     26522,     26525,     26320,     26319
    140869,     26525,     26526,     26321,     26320
    140870,     26526,     26527,     26325,     26321
    140871,     26527,     26528,     26326,     26325
    140872,     26528,     26529,     26323,     26326
    140873,     26529,     26530,     26324,     26323
    140874,     26530,     26531,     26492,     26324
    140875,     26531,     26532,     26493,     26492
    140876,     26532,     26533,     26494,     26493
    140877,     26533,     26534,     26495,     26494
    140878,     26534,     26535,     26496,     26495
    140879,     26535,     26536,     26497,     26496
    140880,     26536,     26537,     26498,     26497
    140881,     26537,     26538,     26499,     26498
    140882,     26538,     26539,     26500,     26499
    140883,     26539,     26540,     26501,     26500
    140884,     26540,     26541,     26502,     26501
    140885,     26541,     26504,     26503,     26502
    140886,     26446,     26542,     26445,     26447
    140887,     26541,     26543,     26505,     26504
    140888,     26543,     26544,     26506,     26505
    140889,     26523,     26545,     26452,     26453
    140890,     26545,     26546,     26450,     26452
    140891,     26546,     26547,     26448,     26450
    140892,     26547,     26548,     26449,     26448
    140893,     26548,     26542,     26446,     26449
    140894,     26544,     26549,     26507,     26506
    140895,     26549,     26550,     26508,     26507
    140896,     26550,     26551,     26509,     26508
    140897,     26551,     26552,     26510,     26509
    140898,     26552,     26553,     26511,     26510
    140899,     26553,     26554,     26512,     26511
    140900,     26554,     26555,     26513,     26512
    140901,     26555,     26556,     26514,     26513
    140902,     26556,     26557,     26515,     26514
    140903,     26557,     26558,     26516,     26515
    140904,     26558,     26559,     26517,     26516
    140905,     26559,     26560,     26518,     26517
    140906,     26560,     26561,     26519,     26518
    140907,     26561,     26523,     26520,     26519
    140908,     26524,     26562,     26070,     26069
    140909,     26562,     26563,     26071,     26070
    140910,     26563,     26521,     26072,     26071
    140911,     26542,     26564,     26443,     26445
    140912,     26564,     26674,     26444,     26443
    140913,     26674,     26673,     26441,     26444
    140914,     26565,     26566,     26442,     26441
    140915,     26566,     26567,     26440,     26442
    140916,     26567,     26568,     26438,     26440
    140917,     26568,     26569,     26439,     26438
    140918,     26569,     26570,     26436,     26439
    140919,     26570,     26571,     26437,     26436
    140920,     26571,     26572,     26435,     26437
    140921,     26572,     26573,     26432,     26435
    140922,     26573,     26574,     26433,     26432
    140923,     26574,     26575,     26434,     26433
    140924,     26575,     26683,     26419,     26434
    140925,     26683,     26682,     26418,     26419
    140926,     26682,     26681,     26417,     26418
    140927,     26681,     26576,     26416,     26417
    140928,     26576,     26524,     26415,     26416
    140929,     26540,     26577,     26543,     26541
    140930,     26577,     26578,     26544,     26543
    140931,     26578,     26579,     26549,     26544
    140932,     26579,     26580,     26550,     26549
    140933,     26580,     26581,     26551,     26550
    140934,     26581,     26582,     26552,     26551
    140935,     26582,     26583,     26553,     26552
    140936,     26583,     26584,     26554,     26553
    140937,     26584,     26585,     26555,     26554
    140938,     26585,     26586,     26556,     26555
    140939,     26586,     26587,     26557,     26556
    140940,     26587,     26588,     26558,     26557
    140941,     26588,     26589,     26559,     26558
    140942,     26589,     26590,     26560,     26559
    140943,     26590,     26591,     26561,     26560
    140944,     26591,     26545,     26523,     26561
    140945,     26563,     26592,     26522,     26521
    140946,     26592,     26593,     26525,     26522
    140947,     26593,     26594,     26526,     26525
    140948,     26594,     26595,     26527,     26526
    140949,     26595,     26596,     26528,     26527
    140950,     26596,     26597,     26529,     26528
    140951,     26597,     26598,     26530,     26529
    140952,     26598,     26599,     26531,     26530
    140953,     26599,     26600,     26532,     26531
    140954,     26600,     26601,     26533,     26532
    140955,     26601,     26602,     26534,     26533
    140956,     26602,     26603,     26535,     26534
    140957,     26603,     26604,     26536,     26535
    140958,     26604,     26605,     26537,     26536
    140959,     26605,     26606,     26538,     26537
    140960,     26606,     26607,     26539,     26538
    140961,     26607,     26577,     26540,     26539
    140962,     26607,     26608,     26578,     26577
    140963,     26608,     26609,     26579,     26578
    140964,     26609,     26610,     26580,     26579
    140965,     26610,     26611,     26581,     26580
    140966,     26611,     26612,     26582,     26581
    140967,     26612,     26613,     26583,     26582
    140968,     26613,     26614,     26584,     26583
    140969,     26614,     26615,     26585,     26584
    140970,     26615,     26616,     26586,     26585
    140971,     26616,     26617,     26587,     26586
    140972,     26617,     26618,     26588,     26587
    140973,     26618,     26619,     26589,     26588
    140974,     26619,     26620,     26590,     26589
    140975,     26620,     26621,     26591,     26590
    140976,     26621,     26546,     26545,     26591
    140977,     26606,     26622,     26608,     26607
    140978,     26622,     26623,     26609,     26608
    140979,     26623,     26624,     26610,     26609
    140980,     26624,     26625,     26611,     26610
    140981,     26625,     26626,     26612,     26611
    140982,     26626,     26627,     26613,     26612
    140983,     26627,     26628,     26614,     26613
    140984,     26628,     26629,     26615,     26614
    140985,     26629,     26630,     26616,     26615
    140986,     26630,     26631,     26617,     26616
    140987,     26631,     26632,     26618,     26617
    140988,     26632,     26633,     26619,     26618
    140989,     26633,     26634,     26620,     26619
    140990,     26634,     26635,     26621,     26620
    140991,     26635,     26547,     26546,     26621
    140992,     26562,     26636,     26592,     26563
    140993,     26636,     26637,     26593,     26592
    140994,     26637,     26638,     26594,     26593
    140995,     26638,     26639,     26595,     26594
    140996,     26639,     26640,     26596,     26595
    140997,     26640,     26641,     26597,     26596
    140998,     26641,     26642,     26598,     26597
    140999,     26642,     26643,     26599,     26598
    141000,     26643,     26644,     26600,     26599
    141001,     26644,     26645,     26601,     26600
    141002,     26645,     26646,     26602,     26601
    141003,     26646,     26647,     26603,     26602
    141004,     26647,     26648,     26604,     26603
    141005,     26648,     26649,     26605,     26604
    141006,     26649,     26622,     26606,     26605
    141007,     26649,     26650,     26623,     26622
    141008,     26650,     26651,     26624,     26623
    141009,     26651,     26652,     26625,     26624
    141010,     26652,     26653,     26626,     26625
    141011,     26653,     26654,     26627,     26626
    141012,     26654,     26655,     26628,     26627
    141013,     26655,     26656,     26629,     26628
    141014,     26656,     26657,     26630,     26629
    141015,     26657,     26658,     26631,     26630
    141016,     26658,     26659,     26632,     26631
    141017,     26659,     26660,     26633,     26632
    141018,     26660,     26661,     26634,     26633
    141019,     26661,     26662,     26635,     26634
    141020,     26662,     26548,     26547,     26635
    141021,     26648,     26663,     26650,     26649
    141022,     26663,     26664,     26651,     26650
    141023,     26664,     26665,     26652,     26651
    141024,     26665,     26666,     26653,     26652
    141025,     26666,     26667,     26654,     26653
    141026,     26667,     26668,     26655,     26654
    141027,     26668,     26669,     26656,     26655
    141028,     26669,     26670,     26657,     26656
    141029,     26670,     26671,     26658,     26657
    141030,     26671,     26672,     26659,     26658
    141031,     26672,     26673,     26660,     26659
    141032,     26673,     26674,     26661,     26660
    141033,     26674,     26564,     26662,     26661
    141034,     26564,     26542,     26548,     26662
    141035,     26673,     26672,     26565,     26441
    141036,     26671,     26718,     26565,     26672
    141037,     26670,     26675,     26718,     26671
    141038,     26691,     26567,     26566,     26717
    141039,     26669,     26676,     26675,     26670
    141040,     26668,     26677,     26676,     26669
    141041,     26667,     26678,     26677,     26668
    141042,     26666,     26695,     26678,     26667
    141043,     26665,     26694,     26695,     26666
    141044,     26664,     26679,     26694,     26665
    141045,     26663,     26680,     26679,     26664
    141046,     26647,     26680,     26663,     26648
    141047,     26576,     26636,     26562,     26524
    141048,     26576,     26681,     26637,     26636
    141049,     26681,     26682,     26638,     26637
    141050,     26682,     26683,     26639,     26638
    141051,     26575,     26684,     26639,     26683
    141052,     26574,     26685,     26684,     26575
    141053,     26639,     26684,     26715,     26640
    141054,     26573,     26686,     26685,     26574
    141055,     26572,     26687,     26686,     26573
    141056,     26571,     26688,     26687,     26572
    141057,     26570,     26689,     26688,     26571
    141058,     26569,     26696,     26689,     26570
    141059,     26568,     26690,     26696,     26569
    141060,     26567,     26691,     26690,     26568
    141061,     26676,     26690,     26691,     26675
    141062,     26676,     26677,     26696,     26690
    141063,     26646,     26692,     26680,     26647
    141064,     26692,     26693,     26679,     26680
    141065,     26689,     26696,     26677,     26678
    141066,     26695,     26697,     26689,     26678
    141067,     26697,     26698,     26688,     26689
    141068,     26694,     26699,     26697,     26695
    141069,     26679,     26693,     26699,     26694
    141070,     26698,     26700,     26687,     26688
    141071,     26699,     26701,     26698,     26697
    141072,     26701,     26702,     26700,     26698
    141073,     26693,     26708,     26701,     26699
    141074,     26708,     26703,     26702,     26701
    141075,     26700,     26704,     26686,     26687
    141076,     26702,     26705,     26704,     26700
    141077,     26703,     26706,     26705,     26702
    141078,     26645,     26707,     26692,     26646
    141079,     26707,     26708,     26693,     26692
    141080,     26707,     26709,     26703,     26708
    141081,     26709,     26710,     26706,     26703
    141082,     26644,     26709,     26707,     26645
    141083,     26643,     26710,     26709,     26644
    141084,     26704,     26711,     26685,     26686
    141085,     26705,     26712,     26711,     26704
    141086,     26706,     26713,     26712,     26705
    141087,     26710,     26714,     26713,     26706
    141088,     26642,     26714,     26710,     26643
    141089,     26640,     26715,     26716,     26641
    141090,     26711,     26715,     26684,     26685
    141091,     26716,     26712,     26713,     26714
    141092,     26716,     26715,     26711,     26712
    141093,     26714,     26642,     26641,     26716
    141094,     26565,     26718,     26717,     26566
    141095,     26691,     26717,     26718,     26675
    141096,     26755,     26752,     26751,     26757
    141097,     26757,     26751,     26747,     26746
    141098,     26756,     26755,     26757,     26758
    141099,     26758,     26757,     26746,     26745
    141100,     26731,     26756,     26758,     26732
    141101,     26732,     26758,     26745,     26733
    141102,     26452,     26450,     26754,     26759
    141103,     26759,     26754,     26753,     26760
    141104,     26760,     26753,     26752,     26755
    141105,     26451,     26453,     26761,     26729
    141106,     26453,     26452,     26759,     26761
    141107,     26756,     26731,     26730,     26762
    141108,     26762,     26730,     26729,     26761
    141109,     26755,     26756,     26762,     26760
    141110,     26760,     26762,     26761,     26759
    141111,     26763,     26726,     26725,     26767
    141112,     26767,     26725,     26724,     26750
    141113,     26764,     26763,     26767,     26766
    141114,     26766,     26767,     26750,     26749
    141115,     26765,     26764,     26766,     26768
    141116,     26768,     26766,     26749,     26748
    141117,     26752,     26765,     26768,     26751
    141118,     26751,     26768,     26748,     26747
    141119,     26449,     26446,     26771,     26769
    141120,     26446,     26447,     26728,     26771
    141121,     26763,     26764,     26770,     26772
    141122,     26772,     26770,     26769,     26771
    141123,     26726,     26763,     26772,     26727
    141124,     26727,     26772,     26771,     26728
    141125,     26450,     26448,     26773,     26754
    141126,     26448,     26449,     26769,     26773
    141127,     26765,     26752,     26753,     26774
    141128,     26774,     26753,     26754,     26773
    141129,     26764,     26765,     26774,     26770
    141130,     26770,     26774,     26773,     26769
    141131,     26779,     26776,     26775,     26781
    141132,     26781,     26775,     25921,     25920
    141133,     26780,     26779,     26781,     26782
    141134,     26782,     26781,     25920,     25919
    141135,     26736,     26780,     26782,     26737
    141136,     26737,     26782,     25919,     25918
    141137,     26746,     26747,     26778,     26783
    141138,     26783,     26778,     26777,     26784
    141139,     26784,     26777,     26776,     26779
    141140,     26733,     26745,     26785,     26734
    141141,     26745,     26746,     26783,     26785
    141142,     26780,     26736,     26735,     26786
    141143,     26786,     26735,     26734,     26785
    141144,     26779,     26780,     26786,     26784
    141145,     26784,     26786,     26785,     26783
    141146,     26787,     26721,     26720,     26791
    141147,     26791,     26720,     25899,     25924
    141148,     26788,     26787,     26791,     26790
    141149,     26790,     26791,     25924,     25923
    141150,     26789,     26788,     26790,     26792
    141151,     26792,     26790,     25923,     25922
    141152,     26776,     26789,     26792,     26775
    141153,     26775,     26792,     25922,     25921
    141154,     26749,     26750,     26795,     26793
    141155,     26750,     26724,     26723,     26795
    141156,     26787,     26788,     26794,     26796
    141157,     26796,     26794,     26793,     26795
    141158,     26721,     26787,     26796,     26722
    141159,     26722,     26796,     26795,     26723
    141160,     26747,     26748,     26797,     26778
    141161,     26748,     26749,     26793,     26797
    141162,     26789,     26776,     26777,     26798
    141163,     26798,     26777,     26778,     26797
    141164,     26788,     26789,     26798,     26794
    141165,     26794,     26798,     26797,     26793
    141166,     26813,     26727,     26728,     26814
    141167,     26814,     26728,     26447,     26810
    141168,     26807,     26813,     26814,     26808
    141169,     26808,     26814,     26810,     26809
    141170,     26727,     26813,     26815,     26726
    141171,     26813,     26807,     26806,     26815
    141172,     26812,     26724,     26725,     26816
    141173,     26816,     26725,     26726,     26815
    141174,     26804,     26812,     26816,     26805
    141175,     26805,     26816,     26815,     26806
    141176,     26817,     26722,     26723,     26818
    141177,     26818,     26723,     26724,     26812
    141178,     26802,     26817,     26818,     26803
    141179,     26803,     26818,     26812,     26804
    141180,     26722,     26817,     26819,     26721
    141181,     26817,     26802,     26801,     26819
    141182,     25991,     25899,     26720,     26820
    141183,     26820,     26720,     26721,     26819
    141184,     25979,     25991,     26820,     26800
    141185,     26800,     26820,     26819,     26801
    141186,     26416,     26415,     26845,     26844
    141187,     26415,     26068,     26431,     26845
    141188,     26844,     26845,     26841,     26840
    141189,     26845,     26431,     26430,     26841
    141190,     26417,     26416,     26844,     26846
    141191,     26846,     26844,     26840,     26839
    141192,     26419,     26418,     26847,     26843
    141193,     26418,     26417,     26846,     26847
    141194,     26843,     26847,     26838,     26837
    141195,     26847,     26846,     26839,     26838
    141196,     26433,     26434,     26849,     26848
    141197,     26434,     26419,     26843,     26849
    141198,     26848,     26849,     26836,     26835
    141199,     26849,     26843,     26837,     26836
    141200,     26432,     26433,     26848,     26850
    141201,     26850,     26848,     26835,     26834
    141202,     26437,     26435,     26851,     26842
    141203,     26435,     26432,     26850,     26851
    141204,     26842,     26851,     26833,     26832
    141205,     26851,     26850,     26834,     26833
    141206,     26439,     26436,     26854,     26853
    141207,     26436,     26437,     26842,     26854
    141208,     26853,     26854,     26831,     26830
    141209,     26854,     26842,     26832,     26831
    141210,     26438,     26439,     26853,     26855
    141211,     26855,     26853,     26830,     26829
    141212,     26442,     26440,     26856,     26852
    141213,     26440,     26438,     26855,     26856
    141214,     26852,     26856,     26828,     26827
    141215,     26856,     26855,     26829,     26828
    141216,     26444,     26441,     26858,     26857
    141217,     26441,     26442,     26852,     26858
    141218,     26857,     26858,     26826,     26825
    141219,     26858,     26852,     26827,     26826
    141220,     26443,     26444,     26857,     26859
    141221,     26859,     26857,     26825,     26824
    141222,     26447,     26445,     26860,     26810
    141223,     26445,     26443,     26859,     26860
    141224,     26810,     26860,     26823,     26809
    141225,     26860,     26859,     26824,     26823
