<svg width="111" height="103" viewBox="0 0 111 103" fill="none" xmlns="http://www.w3.org/2000/svg">
<path d="M96.9954 34.2935C96.5609 34.2935 96.1313 34.3142 95.7074 34.3535V17.9442C95.7074 8.04981 87.0433 0 76.3938 0H33.4754C22.8263 0 14.1626 8.04981 14.1626 17.9442V34.3535C13.7388 34.3142 13.3096 34.2935 12.8751 34.2935C5.77595 34.2935 0 39.6595 0 46.2556C0 50.371 2.2339 54.1469 5.97595 56.3576L6.19419 56.4862C8.77186 58.0085 9.83388 58.6588 10.2446 59.4854C10.738 60.4795 10.7354 62.4196 10.7304 65.9414L10.7296 88.1242C10.7296 91.4217 13.6173 94.1043 17.1669 94.1051V96.0996C17.1669 99.3975 20.0547 102.081 23.6042 102.081C27.1542 102.081 30.0424 99.3975 30.0424 96.0996V94.1051H79.8281V96.0996C79.8281 99.3975 82.7163 102.081 86.2663 102.081C89.8163 102.081 92.704 99.3975 92.704 96.0996V94.1051C96.2536 94.1043 99.1405 91.4217 99.1405 88.1242V76.2099C99.1409 76.1935 99.1413 76.1776 99.1413 76.1612L99.14 65.9412C99.1351 62.4194 99.1325 60.4793 99.6259 59.4856C100.037 58.6588 101.099 58.0083 103.677 56.4864L103.895 56.3572C107.637 54.1469 109.871 50.3706 109.871 46.2556C109.871 39.6595 104.095 34.2935 96.9954 34.2935ZM18.4544 17.9442C18.4544 10.2483 25.1926 3.98752 33.4754 3.98752H76.3938C84.677 3.98752 91.4156 10.2483 91.4156 17.9442V35.4766C87.1027 37.4127 84.1203 41.5209 84.1203 46.2744V51.1162C74.6159 48.6599 64.8125 47.4118 54.935 47.4118C45.058 47.4118 35.2546 48.6599 25.7501 51.1162V46.2953C25.7506 46.2822 25.7506 46.2688 25.7506 46.2556C25.7506 41.5155 22.7677 37.4107 18.4544 35.4758V17.9442ZM84.1203 55.2595V64.1991C84.1203 65.2984 83.1577 66.1928 81.9744 66.1928H27.8965C26.7128 66.1928 25.7501 65.2984 25.7501 64.1991V55.2599C35.2387 52.6991 45.0484 51.3993 54.935 51.3993C64.8221 51.3993 74.6322 52.6993 84.1203 55.2595ZM25.7506 96.0996C25.7506 97.199 24.7879 98.093 23.6042 98.093C22.421 98.093 21.4587 97.199 21.4587 96.0996V94.1051H25.7506V96.0996ZM88.4122 96.0996C88.4122 97.199 87.4495 98.093 86.2663 98.093C85.0826 98.093 84.1199 97.199 84.1199 96.0996V94.1051H88.4122V96.0996ZM101.592 52.9923L101.375 53.121C98.3508 54.9064 96.6849 55.8901 95.7287 57.8153C94.8392 59.6064 94.8422 61.7252 94.848 65.9464L94.8493 76.1126C94.8489 76.1285 94.8484 76.1449 94.8484 76.1612V88.1242C94.8484 89.2236 93.8858 90.1176 92.7025 90.1176H90.5579H81.974H27.8965H19.3128H17.1682C15.9845 90.1176 15.0214 89.2236 15.0214 88.1242L15.021 76.1612L15.0223 65.9464C15.0281 61.7252 15.0311 59.6064 14.1416 57.8153C13.1856 55.8901 11.5199 54.9064 8.4959 53.121L8.2783 52.9923C5.78217 51.5178 4.29183 48.9994 4.29183 46.2556C4.29183 41.8584 8.14225 38.281 12.8751 38.281C17.601 38.281 21.4469 41.8476 21.4587 46.2353C21.4587 46.2481 21.4583 46.2614 21.4583 46.2742V53.754C21.4583 53.7609 21.4583 53.7675 21.4583 53.7747V64.1991C21.4583 67.497 24.3465 70.1804 27.8965 70.1804H81.9744C85.524 70.1804 88.4122 67.497 88.4122 64.1991V53.7833C88.4122 53.7711 88.4122 53.7588 88.4122 53.7466V46.2556C88.4122 41.8584 92.2626 38.281 96.9954 38.281C101.728 38.281 105.579 41.8584 105.579 46.2556C105.579 48.9994 104.089 51.5178 101.592 52.9923Z" transform="translate(0.759766 0.239258)" fill="#1FBCAB"/>
<path d="M2.24785 0H2.14592C0.960941 0 0 0.892606 0 1.99376C0 3.09471 0.960941 3.98752 2.14592 3.98752H2.24785C3.43304 3.98752 4.39377 3.09471 4.39377 1.99376C4.39377 0.892606 3.43325 0 2.24785 0Z" transform="translate(59.8672 82.3838)" fill="#1FBCAB"/>
<path d="M16.524 0H2.14592C0.960727 0 0 0.892606 0 1.99376C0 3.09471 0.960727 3.98752 2.14592 3.98752H16.524C17.7087 3.98752 18.6699 3.09471 18.6699 1.99376C18.6699 0.892606 17.7087 0 16.524 0Z" transform="translate(66.209 82.3838)" fill="#1FBCAB"/>
<path d="M16.5244 0H2.14592C0.961156 0 0 0.893005 0 1.99376C0 3.09491 0.961156 3.98752 2.14592 3.98752H16.5244C17.7092 3.98752 18.6703 3.09491 18.6703 1.99376C18.6703 0.893005 17.7092 0 16.5244 0Z" transform="translate(32.0898 8.21484)" fill="#1FBCAB"/>
<path d="M2.24785 0H2.14592C0.961156 0 0 0.893005 0 1.99376C0 3.09491 0.961156 3.98752 2.14592 3.98752H2.24785C3.43282 3.98752 4.39376 3.09491 4.39376 1.99376C4.39376 0.893005 3.43282 0 2.24785 0Z" transform="translate(52.709 8.21484)" fill="#1FBCAB"/>
<path d="M15.1888 45.6863C10.9647 46.3727 8.87384 46.9836 7.45908 47.3814C7.45908 46.7217 7.3046 44.5934 7.3046 41.8787C7.3046 38.4852 5.7454 34.671 0.210854 31.7457C0.128776 31.7023 0.163779 31.6644 0.163779 31.5959C0.163779 31.3246 0.16547 30.5533 0.16547 30.0609C0.16547 28.9135 0.120735 27.0083 0.120732 26.3419C0.120732 22.8554 -5.14061e-08 23.1119 0 16.1012C6.42577e-08 7.33789 2.39855 5.55371 5.05477 3.50785C8.8406 0.591947 11.4422 0 13.7037 0H26.5279H47.4466C51.9701 0 60.3019 0.323715 62.2894 0.724958C66.1395 1.50222 67.3235 2.63237 69.1672 4.39235L69.1807 4.40522C71.1331 6.26883 72.7756 10.56 72.7756 10.9146L73.1272 12.3005V16.724L73.1458 21.4744L73.1121 31.7902C72.2641 32.0731 68.6388 34.9062 67.7155 36.2375C66.6411 37.7866 66.1641 39.6498 65.9508 40.6189C65.7375 41.588 65.8362 47.3667 65.8362 47.3667L62.0649 46.4305C61.2797 46.1979 55.8718 45.0676 50.2182 44.4748C45.5914 43.9898 45.1253 43.6577 36.8738 43.6577C32.4564 43.6577 28.8307 43.7238 23.9285 44.3275C20.6912 44.7262 19.1121 45.0488 15.1888 45.6863Z" transform="translate(19.0488 4.00195)" fill="white"/>
<path d="M0 12.9374L0.101056 4.0268C0.765331 3.6663 2.75816 3.18562 5.72787 2.3845C8.92164 1.52293 12.0179 1.17202 18.6617 0.381595C21.1082 0.0905353 26.4541 0.00111635 32.6904 0C35.8442 -0.000564111 44.7142 0.80727 51.3175 2.19644C56.1571 3.21459 58.8241 3.77648 58.7722 4.04277V12.7989C58.7722 13.329 58.7464 13.9214 58.4963 14.3141C58.0994 14.9373 57.2829 15.2179 56.7882 15.2179L48.1855 15.2243H25.7755L6.68436 15.2561H2.14805C0.480028 15.2561 0 13.8011 0 12.9374Z" transform="translate(26.1094 51.4648)" fill="#1FBCAB"/>
<path d="M0.474555 10.6748C0.715364 11.3558 1.49751 12.7388 2.17111 13.3894C2.43511 13.6444 3.41168 14.4555 3.99115 14.7988C5.70752 15.8159 5.44726 15.548 7.28823 16.872C7.60219 17.0978 7.96983 17.2451 8.24356 17.4974C9.49352 18.6496 10.3733 20.4464 10.5863 21.9013C10.6261 29.7395 10.7049 46.1325 10.7049 47.0544V49.8842C10.7049 50.0971 11.2742 52.0472 13.203 51.9508L57.1008 51.9205C66.8531 51.9461 86.5496 51.9536 88.465 51.9536C90.2493 51.9536 90.6593 50.5083 90.6593 49.8647L90.6423 44.5617C90.6423 37.3434 90.4268 23.9919 90.7697 22.369C91.1758 20.447 90.8582 20.3905 92.394 18.4708C93.9298 16.551 96.238 15.5471 97.8082 14.5184C99.4178 13.4638 100.948 11.7301 101.273 9.29372C101.627 6.63837 100.316 3.95727 100.055 3.58633C98.6215 1.5454 96.9431 0.915711 95.498 0.463364C93.5609 -0.142968 91.2679 0.0866433 90.084 0.463364C87.5993 1.25396 86.827 2.36886 86.5133 2.62897C85.6403 3.35285 84.1964 5.7906 84.1073 7.79964C84.1997 12.6486 84.2919 25.0544 84.1908 26.284C84.1618 26.6366 84.1109 27.2021 84.0495 27.3582C83.6044 28.4906 83.5324 29.1533 81.9212 30.584C80.3101 32.0148 77.4302 32.1125 75.7066 31.9635H38.369C35.5783 31.9635 30.5923 31.9891 26.7241 31.9635C24.0399 31.9458 22.0135 32.0293 21.1362 31.5409C18.9946 30.3488 19.4414 30.5753 18.1554 29.0618C17.417 28.1928 17.1546 26.1017 17.253 25.5563C17.253 20.3139 17.3053 12.5161 17.3053 11.8111C17.3053 10.9299 17.6689 7.39593 16.7876 4.97231C15.9063 2.54869 14.9061 1.83767 12.813 0.955903C10.7199 0.0741333 10.0873 0 8.21453 0C6.34174 0 3.94463 1.20522 3.1182 1.79061C1.42919 2.98699 0.7156 4.64869 0.474555 5.30295C-0.335138 7.50067 0.0469999 9.46562 0.474555 10.6748Z" transform="translate(4.97266 38.4141)" fill="white"/>
<path d="M0.0168447 0L4.30577 0.0118241V2.13195C4.26937 2.91783 3.64772 3.47555 3.61008 3.50139C3.36309 3.67096 2.87856 3.9422 2.56746 3.9757C2.33868 4.00034 2.13133 4.01336 1.94264 3.9971C1.72443 3.9783 1.46255 3.89561 1.36062 3.86016C1.16376 3.79168 0.885592 3.65046 0.671615 3.44932C0.433787 3.22576 0.172071 2.83955 0.106714 2.62337C0.0510798 2.43934 0.00400506 2.25104 0.00400566 1.93436C0.00400635 1.57021 -0.0109183 0.558661 0.0168447 0Z" transform="translate(22.2109 94.3291)" fill="white"/>
<path d="M0.0151372 0L4.30407 0.0118241V2.13195C4.26766 2.91783 3.64601 3.47555 3.60837 3.50139C3.36138 3.67096 2.87685 3.9422 2.56575 3.9757C2.30146 4.0399 1.96338 4.01422 1.96338 4.01422C1.96338 4.01422 1.5336 3.92557 1.43167 3.89011C1.23481 3.82164 1.06895 3.75993 0.628158 3.46644C0.586662 3.43881 0.254549 3.1279 0.126406 2.76459C0.0675367 2.59769 0.00629548 2.40056 0.00629549 1.94537C0.00629549 1.58122 -0.0126258 0.558661 0.0151372 0Z" transform="translate(84.8789 94.3291)" fill="white"/>
</svg>
