<svg width="79" height="79" viewBox="0 0 79 79" fill="none" xmlns="http://www.w3.org/2000/svg">
<path d="M76.7837 75.4305H75.2569V47.6442C75.2569 46.8011 74.5733 46.1175 73.7302 46.1175H64.4403C63.8856 42.8514 61.5781 40.1077 58.3506 39.0426L40.0237 32.9945C38.9153 32.6287 37.8509 32.1533 36.8402 31.5788L37.8631 30.5559C38.4593 29.9597 38.4593 28.993 37.8631 28.3968L30.4 20.9336C30.1136 20.6473 29.7253 20.4864 29.3205 20.4864C28.9156 20.4864 28.5273 20.6473 28.2409 20.9336L28.1866 20.9879L7.9633 0.764522C7.36696 0.168337 6.40054 0.168337 5.80405 0.764522C5.20787 1.36071 5.20787 2.32743 5.80405 2.92376L26.0275 23.147L12.6425 36.532L10.2801 34.1695L16.1404 28.3092C16.7366 27.713 16.7366 26.7463 16.1404 26.1499C15.5441 25.5538 14.5777 25.5538 13.9812 26.1499L8.12085 32.0103L2.74847 26.6379C2.15244 26.0418 1.18602 26.0417 0.589229 26.6379C-0.00695643 27.2341 -0.00695643 28.2008 0.589229 28.7971L10.4833 38.6912L10.4291 38.7454C9.83292 39.3416 9.83292 40.3083 10.4291 40.9046L17.8922 48.3679C18.1786 48.6541 18.5668 48.815 18.9717 48.815C19.3766 48.815 19.7649 48.6541 20.0513 48.3679L21.1888 47.2303L22.0206 48.0567C26.2119 52.2212 31.7742 54.5148 37.6828 54.5148C37.7907 54.5148 37.8979 54.5206 38.0048 54.5294V75.4308H34.3376C33.4945 75.4308 32.8108 76.1145 32.8108 76.9576C32.8108 77.8006 33.4945 78.4843 34.3376 78.4843H39.5316H73.7302H76.7837C77.6267 78.4843 78.3104 77.8006 78.3104 76.9576C78.3104 76.1145 77.6269 75.4305 76.7837 75.4305ZM24.173 45.8905L23.3481 45.0709L34.6139 33.8051C36.0092 34.6749 37.5009 35.3773 39.0669 35.8941L57.3938 41.9422C59.3615 42.5915 60.8129 44.1821 61.3195 46.1175H45.8365L43.0541 43.3349C42.4579 42.739 41.4915 42.7388 40.8948 43.3349C40.2987 43.9311 40.2987 44.8978 40.8948 45.4941L48.3411 52.9404C48.7094 53.3086 48.8865 53.8166 48.8272 54.3341C48.768 54.8517 48.4804 55.3064 48.0381 55.5818C47.4904 55.9227 46.7836 55.9212 46.2375 55.5781L41.3811 52.5267C40.2718 51.8296 38.9928 51.4612 37.6828 51.4612C32.5863 51.461 27.7882 49.4827 24.173 45.8905Z" fill="#C53A3A"/>
<path d="M63.4113 56.8655L54.4554 65.8214L51.207 62.5728C50.6108 61.9769 49.6444 61.9766 49.0477 62.5728C48.4515 63.169 48.4515 64.1357 49.0477 64.732L53.3758 69.0603C53.6621 69.3466 54.0505 69.5075 54.4554 69.5075C54.8603 69.5075 55.2487 69.3466 55.5349 69.0603L65.5704 59.0249C66.1666 58.4287 66.1666 57.462 65.5704 56.8656C64.974 56.2694 64.0076 56.2694 63.4113 56.8655Z" fill="white"/>
<path d="M20.458 23.9909C20.742 23.7069 20.9055 23.313 20.9055 22.9115C20.9055 22.51 20.7421 22.1161 20.458 21.8321C20.1742 21.5481 19.7803 21.3848 19.3788 21.3848C18.9772 21.3848 18.5834 21.5481 18.2994 21.8321C18.0154 22.1161 17.8521 22.51 17.8521 22.9115C17.8521 23.313 18.0153 23.7069 18.2994 23.9909C18.5835 24.2749 18.9772 24.4382 19.3788 24.4382C19.7803 24.4382 20.174 24.2749 20.458 23.9909Z" fill="#C53A3A"/>
</svg>
