<svg width="46" height="46" viewBox="0 0 46 46" fill="none" xmlns="http://www.w3.org/2000/svg">
<path d="M42.3361 2.46442C40.6937 0.821577 38.7148 0 36.4011 0H8.40016C6.08643 0 4.10758 0.821577 2.46442 2.46442C0.821576 4.10758 0 6.08633 0 8.40017V36.4008C0 38.7144 0.821576 40.6934 2.46442 42.3365C4.10758 43.9797 6.08643 44.8013 8.40016 44.8013H36.4008C38.7145 44.8013 40.6934 43.9797 42.3358 42.3365C43.979 40.6934 44.8005 38.7145 44.8005 36.4008V8.40017C44.8004 6.08633 43.9789 4.10727 42.3361 2.46442ZM15.8669 37.3341H7.46652V28.9337L23.3337 13.067L31.7335 21.467L15.8669 37.3341ZM36.284 16.917L33.6011 19.6007L25.2006 11.2001L27.8835 8.51683C28.4282 7.97283 29.089 7.70026 29.8672 7.70026C30.6447 7.70026 31.3062 7.97242 31.8501 8.51683L36.2839 12.9504C36.8278 13.4946 37.1006 14.1557 37.1006 14.9338C37.1007 15.7115 36.8287 16.3725 36.284 16.917Z" transform="translate(0.859375 0.669922)" fill="#FF5000"/>
<path d="M-1.12237e-07 1.51739V3.15002H2.80002V5.95076H4.43316L5.95005 4.43378L1.51658 1.4965e-07L-1.12237e-07 1.51739Z" transform="translate(11.1289 29.2612)" fill="#FF5000"/>
<path d="M0.271992 8.75972C-0.0587026 9.0897 -0.0877156 9.38126 0.184236 9.63442C0.436982 9.90718 0.728752 9.87776 1.05934 9.54707L9.54696 1.05925C9.87765 0.729272 9.90646 0.4375 9.63431 0.184652C9.38115 -0.0878102 9.08999 -0.058797 8.7596 0.271999L0.271992 8.75972Z" transform="translate(15.082 17.6997)" fill="#FF5000"/>
<rect width="32.1963" height="32.4723" transform="translate(6.32031 7.81006)" fill="#FF5000"/>
<path d="M12.3084 12.5649C11.0953 11.9651 9.80557 11.5081 8.52862 11.0339C7.78799 10.7597 7.07929 10.4398 6.45358 9.99419C5.22132 9.11442 5.45756 7.68622 6.90051 7.12066C7.30914 6.9607 7.73692 6.90929 8.17108 6.88644C9.84388 6.80646 11.4337 7.08067 12.9469 7.73193C13.7003 8.05755 13.9493 7.95473 14.2047 7.25205C14.4728 6.50939 14.6963 5.75531 14.9453 5.00693C15.1113 4.50421 14.907 4.17287 14.3771 3.96149C13.4066 3.57874 12.4106 3.30452 11.3635 3.15599C9.99712 2.96747 9.99712 2.96176 9.99073 1.73351C9.98435 0.00253905 9.98435 0.00253901 8.04338 0.00253901C7.76246 0.00253901 7.48153 -0.00317377 7.2006 0.00253901C6.29396 0.0253901 6.14073 0.16821 6.11519 0.985137C6.10242 1.35075 6.11519 1.71637 6.1088 2.0877C6.10242 3.17313 6.09603 3.15599 4.93401 3.53304C2.12472 4.44708 0.388066 6.16091 0.202908 8.90305C0.0369049 11.331 1.45432 12.9705 3.6826 14.1645C5.05532 14.9015 6.57489 15.3356 8.03061 15.9126C8.59886 16.1354 9.14156 16.3925 9.61403 16.7467C11.0123 17.7807 10.7569 19.5002 9.09687 20.1515C8.20939 20.5 7.27083 20.5857 6.30673 20.4771C4.81908 20.3115 3.39528 19.963 2.05449 19.3403C1.26916 18.9747 1.03931 19.0718 0.771151 19.8316C0.5413 20.4886 0.336988 21.1512 0.132676 21.8139C-0.141868 22.7051 -0.0397127 22.9165 0.911615 23.3335C2.12472 23.8591 3.42082 24.1276 4.74247 24.3161C5.7768 24.4647 5.80872 24.5046 5.82149 25.4644C5.82788 25.8986 5.82787 26.3384 5.83426 26.7726C5.84064 27.321 6.13434 27.641 6.76643 27.6524C7.48153 27.6638 8.203 27.6638 8.91809 27.6467C9.50549 27.6352 9.80558 27.3496 9.80558 26.8183C9.80558 26.2242 9.8375 25.6243 9.81196 25.0302C9.78004 24.4247 10.0737 24.1162 10.725 23.9562C12.2254 23.5906 13.5023 22.8708 14.4856 21.7968C17.2183 18.8261 16.1776 14.4787 12.3084 12.5649Z" transform="translate(15.248 9.2417)" fill="white"/>
</svg>
