<svg width="130" height="81" viewBox="0 0 130 81" fill="none" xmlns="http://www.w3.org/2000/svg">
<mask id="path-1-inside-1" fill="white">
<path d="M121.554 43.8882V13.1422C121.554 5.96176 115.713 0.121835 108.534 0.121835H43.4248C42.3797 0.121835 41.5336 0.967926 41.5336 2.01298C41.5336 3.05706 42.3797 3.90413 43.4248 3.90413H108.534C113.628 3.90413 117.772 8.04793 117.772 13.1422V43.8705H116.146C116.498 43.0352 116.689 42.1291 116.689 41.1983C116.689 38.069 114.592 35.4234 111.731 34.5851C113.46 32.4123 114.402 29.74 114.402 26.922C114.402 23.6282 113.12 20.5305 110.789 18.201C105.982 13.3924 98.1559 13.3924 93.3472 18.201C91.0178 20.5305 89.7344 23.6273 89.7344 26.922C89.7344 27.116 89.7403 27.3091 89.7491 27.5012C87.9427 27.0638 86.0624 26.9112 84.1978 27.0609L79.6738 27.4224C79.3557 25.6011 77.6615 24.3226 75.8039 24.5492L67.2917 25.5893C65.6586 25.7883 64.4274 27.0885 64.2422 28.6546L60.7869 28.9313C59.6 29.0259 58.4988 29.6051 57.7414 30.5211L48.133 22.6856C43.6356 19.0186 37.0835 19.5367 33.2165 23.8646L22.2833 36.105C22.235 36.1591 22.1917 36.2153 22.1503 36.2724H11.3944V13.1412C11.3944 8.04793 15.5382 3.90315 20.6325 3.90315L43.4248 3.90413C44.4699 3.90413 41.5356 2.97141 41.5356 1.92635C41.5356 0.882279 44.4699 0.121835 43.4248 0.121835L20.6325 0.12085C13.453 0.12085 7.6121 5.96176 7.6121 13.1412V37.4179C5.79581 38.6354 4.59808 40.7068 4.59808 43.053C4.59808 43.574 4.66112 44.0941 4.77932 44.5994C1.98199 45.8779 0.0317383 48.6998 0.0317383 51.9709V55.3257C0.0317383 59.7926 3.66531 63.4262 8.13315 63.4262H9.28656V66.5583C9.28656 69.8698 11.9814 72.5647 15.2929 72.5647C18.6044 72.5647 21.2993 69.8698 21.2993 66.5583V63.4262H49.2243C50.2694 63.4262 47.682 62.5801 47.682 61.535C47.682 60.491 50.2694 59.6439 49.2243 59.6439H8.13315C5.75149 59.6439 3.81404 57.7064 3.81404 55.3257V51.9709C3.81404 49.5893 5.75149 47.6528 8.13315 47.6528H77.234L72.8933 59.6439H49.2243C48.1793 59.6439 47.3332 60.491 47.3332 61.535C47.3332 62.5801 48.1793 63.4262 49.2243 63.4262H71.5241L70.5805 66.0324C70.3363 66.7061 70.223 67.4211 70.2437 68.1323C69.8802 68.4918 69.5581 68.8976 69.2961 69.3527L66.7352 73.792C65.9965 75.0734 65.9581 76.6248 66.6337 77.9407C67.3085 79.2576 68.5909 80.1313 70.0634 80.279L73.105 80.5824C73.2488 80.5972 73.3926 80.604 73.5355 80.604C75.073 80.604 76.517 79.7826 77.2961 78.4332L79.2286 75.0823C79.8038 74.0855 80.0432 72.9853 79.9851 71.9136C80.5406 71.3413 80.974 70.6588 81.2498 69.8954L83.5921 63.4272L99.675 63.413C100.719 63.413 99.0096 62.5801 99.0096 61.536C99.0096 60.491 100.719 59.659 99.675 59.659L84.9612 59.6449L89.3019 47.6528H121.034C123.416 47.6528 125.353 49.5902 125.353 51.9709V55.3257C125.353 57.7074 123.416 59.6449 121.034 59.6449H99.9072C98.8631 59.6449 98.016 60.491 98.016 61.536C98.016 62.5801 98.8631 63.4272 99.9072 63.4272H107.867V66.5583C107.867 69.8698 110.562 72.5647 113.873 72.5647C117.186 72.5647 119.88 69.8698 119.88 66.5583V63.4272H121.034C125.501 63.4272 129.135 59.7926 129.135 55.3257V51.9709C129.134 47.6794 125.779 44.1581 121.554 43.8882ZM17.517 66.5583C17.517 67.7846 16.5192 68.7824 15.2929 68.7824C14.0666 68.7824 13.0689 67.7846 13.0689 66.5583V63.4262H17.517V66.5583ZM112.907 41.1983C112.907 42.2167 112.406 43.1721 111.568 43.7553C111.515 43.7907 111.466 43.8301 111.419 43.8705H99.7023C99.6481 43.8212 99.591 43.774 99.5299 43.7296C98.7134 43.1465 98.2258 42.2 98.2258 41.1983C98.2258 40.3315 98.5932 39.5031 99.2216 38.918C100.157 39.1387 101.113 39.251 102.068 39.251C103.968 39.251 105.866 38.8127 107.601 37.9429C107.826 38.0375 108.073 38.0897 108.332 38.0897H109.798C111.512 38.0897 112.907 39.4844 112.907 41.1983ZM75.9851 28.3384L76.0235 28.6595C76.191 30.0266 75.2139 31.2756 73.8457 31.443L70.8514 31.8085C69.4843 31.9729 68.2353 30.9978 68.0679 29.6307L68.0285 29.3096L75.9851 28.3384ZM8.49759 43.8705C8.42274 43.6065 8.38038 43.3347 8.38038 43.053C8.38038 41.3992 9.72586 40.0547 11.3786 40.0547H57.7591L58.3777 43.8705H8.49759ZM39.0387 36.2724L41.4854 33.5332L44.8451 36.2724H39.0387ZM36.0375 26.3842C38.5531 23.5682 42.8161 23.2313 45.7424 25.6179L56.8845 34.7024C56.8874 34.7043 56.8894 34.7063 56.8914 34.7073L57.1455 36.2724H50.7372C50.6466 36.1513 50.5422 36.038 50.4191 35.9375L42.5501 29.5213C41.7188 28.8496 40.5112 28.9471 39.7981 29.7439L34.1168 36.105C34.0685 36.1591 34.0252 36.2153 33.9838 36.2724H27.2052L36.0375 26.3842ZM75.9516 73.1921L74.0191 76.543C73.9098 76.7321 73.698 76.8434 73.4803 76.8188L70.4387 76.5154C70.1757 76.4888 70.0496 76.3155 69.9984 76.215C69.9462 76.1145 69.8792 75.9106 70.0112 75.6821L72.5722 71.2428C72.8322 70.7917 73.2528 70.4687 73.7561 70.3337C73.9245 70.2884 74.0949 70.2658 74.2653 70.2658C74.6022 70.2658 74.9361 70.3544 75.2365 70.5278C76.1683 71.0646 76.4894 72.2603 75.9516 73.1921ZM90.3844 39.1042C89.4034 38.7476 88.3189 39.2559 87.9634 40.2379L77.9688 67.8457C77.7108 67.627 77.4301 67.4271 77.1267 67.2517C76.2944 66.7711 75.3744 66.5131 74.4397 66.4855L84.4066 38.9505C84.7622 37.9685 84.2549 36.8851 83.2719 36.5295C82.2909 36.1729 81.2055 36.6812 80.8499 37.6642L78.6032 43.8705H62.2092L60.5171 33.4317C60.4786 33.1944 60.5791 33.0229 60.6431 32.9412C60.7072 32.8604 60.849 32.7205 61.0893 32.7018L65.0647 32.3847C66.1541 34.332 68.2353 35.6095 70.5441 35.6095C70.7962 35.6095 74.3047 35.1968 74.3047 35.1968C76.6775 34.9072 78.5815 33.3233 79.3961 31.2391L84.5002 30.8314C86.6543 30.658 88.7474 30.9811 90.7272 31.7779C91.3369 33.2032 92.2185 34.5152 93.3472 35.644C94.0367 36.3325 94.7883 36.9195 95.5821 37.411C94.8513 38.5231 94.4435 39.839 94.4435 41.1983C94.4435 42.1281 94.6346 43.0343 94.9872 43.8705H90.6711L91.5191 41.5263C91.8747 40.5433 91.3674 39.4588 90.3844 39.1042ZM116.097 66.5583C116.097 67.7846 115.099 68.7824 113.873 68.7824C112.647 68.7824 111.649 67.7846 111.649 66.5583V63.4262H116.097V66.5583Z"/>
</mask>
<path d="M121.554 43.8882V13.1422C121.554 5.96176 115.713 0.121835 108.534 0.121835H43.4248C42.3797 0.121835 41.5336 0.967926 41.5336 2.01298C41.5336 3.05706 42.3797 3.90413 43.4248 3.90413H108.534C113.628 3.90413 117.772 8.04793 117.772 13.1422V43.8705H116.146C116.498 43.0352 116.689 42.1291 116.689 41.1983C116.689 38.069 114.592 35.4234 111.731 34.5851C113.46 32.4123 114.402 29.74 114.402 26.922C114.402 23.6282 113.12 20.5305 110.789 18.201C105.982 13.3924 98.1559 13.3924 93.3472 18.201C91.0178 20.5305 89.7344 23.6273 89.7344 26.922C89.7344 27.116 89.7403 27.3091 89.7491 27.5012C87.9427 27.0638 86.0624 26.9112 84.1978 27.0609L79.6738 27.4224C79.3557 25.6011 77.6615 24.3226 75.8039 24.5492L67.2917 25.5893C65.6586 25.7883 64.4274 27.0885 64.2422 28.6546L60.7869 28.9313C59.6 29.0259 58.4988 29.6051 57.7414 30.5211L48.133 22.6856C43.6356 19.0186 37.0835 19.5367 33.2165 23.8646L22.2833 36.105C22.235 36.1591 22.1917 36.2153 22.1503 36.2724H11.3944V13.1412C11.3944 8.04793 15.5382 3.90315 20.6325 3.90315L43.4248 3.90413C44.4699 3.90413 41.5356 2.97141 41.5356 1.92635C41.5356 0.882279 44.4699 0.121835 43.4248 0.121835L20.6325 0.12085C13.453 0.12085 7.6121 5.96176 7.6121 13.1412V37.4179C5.79581 38.6354 4.59808 40.7068 4.59808 43.053C4.59808 43.574 4.66112 44.0941 4.77932 44.5994C1.98199 45.8779 0.0317383 48.6998 0.0317383 51.9709V55.3257C0.0317383 59.7926 3.66531 63.4262 8.13315 63.4262H9.28656V66.5583C9.28656 69.8698 11.9814 72.5647 15.2929 72.5647C18.6044 72.5647 21.2993 69.8698 21.2993 66.5583V63.4262H49.2243C50.2694 63.4262 47.682 62.5801 47.682 61.535C47.682 60.491 50.2694 59.6439 49.2243 59.6439H8.13315C5.75149 59.6439 3.81404 57.7064 3.81404 55.3257V51.9709C3.81404 49.5893 5.75149 47.6528 8.13315 47.6528H77.234L72.8933 59.6439H49.2243C48.1793 59.6439 47.3332 60.491 47.3332 61.535C47.3332 62.5801 48.1793 63.4262 49.2243 63.4262H71.5241L70.5805 66.0324C70.3363 66.7061 70.223 67.4211 70.2437 68.1323C69.8802 68.4918 69.5581 68.8976 69.2961 69.3527L66.7352 73.792C65.9965 75.0734 65.9581 76.6248 66.6337 77.9407C67.3085 79.2576 68.5909 80.1313 70.0634 80.279L73.105 80.5824C73.2488 80.5972 73.3926 80.604 73.5355 80.604C75.073 80.604 76.517 79.7826 77.2961 78.4332L79.2286 75.0823C79.8038 74.0855 80.0432 72.9853 79.9851 71.9136C80.5406 71.3413 80.974 70.6588 81.2498 69.8954L83.5921 63.4272L99.675 63.413C100.719 63.413 99.0096 62.5801 99.0096 61.536C99.0096 60.491 100.719 59.659 99.675 59.659L84.9612 59.6449L89.3019 47.6528H121.034C123.416 47.6528 125.353 49.5902 125.353 51.9709V55.3257C125.353 57.7074 123.416 59.6449 121.034 59.6449H99.9072C98.8631 59.6449 98.016 60.491 98.016 61.536C98.016 62.5801 98.8631 63.4272 99.9072 63.4272H107.867V66.5583C107.867 69.8698 110.562 72.5647 113.873 72.5647C117.186 72.5647 119.88 69.8698 119.88 66.5583V63.4272H121.034C125.501 63.4272 129.135 59.7926 129.135 55.3257V51.9709C129.134 47.6794 125.779 44.1581 121.554 43.8882ZM17.517 66.5583C17.517 67.7846 16.5192 68.7824 15.2929 68.7824C14.0666 68.7824 13.0689 67.7846 13.0689 66.5583V63.4262H17.517V66.5583ZM112.907 41.1983C112.907 42.2167 112.406 43.1721 111.568 43.7553C111.515 43.7907 111.466 43.8301 111.419 43.8705H99.7023C99.6481 43.8212 99.591 43.774 99.5299 43.7296C98.7134 43.1465 98.2258 42.2 98.2258 41.1983C98.2258 40.3315 98.5932 39.5031 99.2216 38.918C100.157 39.1387 101.113 39.251 102.068 39.251C103.968 39.251 105.866 38.8127 107.601 37.9429C107.826 38.0375 108.073 38.0897 108.332 38.0897H109.798C111.512 38.0897 112.907 39.4844 112.907 41.1983ZM75.9851 28.3384L76.0235 28.6595C76.191 30.0266 75.2139 31.2756 73.8457 31.443L70.8514 31.8085C69.4843 31.9729 68.2353 30.9978 68.0679 29.6307L68.0285 29.3096L75.9851 28.3384ZM8.49759 43.8705C8.42274 43.6065 8.38038 43.3347 8.38038 43.053C8.38038 41.3992 9.72586 40.0547 11.3786 40.0547H57.7591L58.3777 43.8705H8.49759ZM39.0387 36.2724L41.4854 33.5332L44.8451 36.2724H39.0387ZM36.0375 26.3842C38.5531 23.5682 42.8161 23.2313 45.7424 25.6179L56.8845 34.7024C56.8874 34.7043 56.8894 34.7063 56.8914 34.7073L57.1455 36.2724H50.7372C50.6466 36.1513 50.5422 36.038 50.4191 35.9375L42.5501 29.5213C41.7188 28.8496 40.5112 28.9471 39.7981 29.7439L34.1168 36.105C34.0685 36.1591 34.0252 36.2153 33.9838 36.2724H27.2052L36.0375 26.3842ZM75.9516 73.1921L74.0191 76.543C73.9098 76.7321 73.698 76.8434 73.4803 76.8188L70.4387 76.5154C70.1757 76.4888 70.0496 76.3155 69.9984 76.215C69.9462 76.1145 69.8792 75.9106 70.0112 75.6821L72.5722 71.2428C72.8322 70.7917 73.2528 70.4687 73.7561 70.3337C73.9245 70.2884 74.0949 70.2658 74.2653 70.2658C74.6022 70.2658 74.9361 70.3544 75.2365 70.5278C76.1683 71.0646 76.4894 72.2603 75.9516 73.1921ZM90.3844 39.1042C89.4034 38.7476 88.3189 39.2559 87.9634 40.2379L77.9688 67.8457C77.7108 67.627 77.4301 67.4271 77.1267 67.2517C76.2944 66.7711 75.3744 66.5131 74.4397 66.4855L84.4066 38.9505C84.7622 37.9685 84.2549 36.8851 83.2719 36.5295C82.2909 36.1729 81.2055 36.6812 80.8499 37.6642L78.6032 43.8705H62.2092L60.5171 33.4317C60.4786 33.1944 60.5791 33.0229 60.6431 32.9412C60.7072 32.8604 60.849 32.7205 61.0893 32.7018L65.0647 32.3847C66.1541 34.332 68.2353 35.6095 70.5441 35.6095C70.7962 35.6095 74.3047 35.1968 74.3047 35.1968C76.6775 34.9072 78.5815 33.3233 79.3961 31.2391L84.5002 30.8314C86.6543 30.658 88.7474 30.9811 90.7272 31.7779C91.3369 33.2032 92.2185 34.5152 93.3472 35.644C94.0367 36.3325 94.7883 36.9195 95.5821 37.411C94.8513 38.5231 94.4435 39.839 94.4435 41.1983C94.4435 42.1281 94.6346 43.0343 94.9872 43.8705H90.6711L91.5191 41.5263C91.8747 40.5433 91.3674 39.4588 90.3844 39.1042ZM116.097 66.5583C116.097 67.7846 115.099 68.7824 113.873 68.7824C112.647 68.7824 111.649 67.7846 111.649 66.5583V63.4262H116.097V66.5583Z" fill="#4F3076"/>
<path d="M121.554 43.8882H120.554V44.8264L121.49 44.8862L121.554 43.8882ZM117.772 43.8705V44.8705H118.772V43.8705H117.772ZM116.146 43.8705L115.225 43.4825L114.64 44.8705H116.146V43.8705ZM111.731 34.5851L110.948 33.9624L110.022 35.1265L111.45 35.5448L111.731 34.5851ZM110.789 18.201L110.082 18.9081L110.082 18.9083L110.789 18.201ZM93.3472 18.201L94.0543 18.9081L93.3472 18.201ZM89.7491 27.5012L89.5138 28.4731L90.8095 28.7868L90.7481 27.4551L89.7491 27.5012ZM84.1978 27.0609L84.2775 28.0577L84.2779 28.0577L84.1978 27.0609ZM79.6738 27.4224L78.6887 27.5944L78.8455 28.4917L79.7535 28.4192L79.6738 27.4224ZM75.8039 24.5492L75.6828 23.5565L75.6826 23.5566L75.8039 24.5492ZM67.2917 25.5893L67.4127 26.582L67.413 26.5819L67.2917 25.5893ZM64.2422 28.6546L64.3221 29.6514L65.1391 29.5859L65.2353 28.772L64.2422 28.6546ZM60.7869 28.9313L60.8664 29.9282L60.8668 29.9281L60.7869 28.9313ZM57.7414 30.5211L57.1094 31.2961L57.8791 31.9238L58.5121 31.1583L57.7414 30.5211ZM48.133 22.6856L48.765 21.9106L48.7649 21.9106L48.133 22.6856ZM33.2165 23.8646L32.4708 23.1984L32.4707 23.1985L33.2165 23.8646ZM22.2833 36.105L21.5375 35.4388L21.5366 35.4398L22.2833 36.105ZM22.1503 36.2724V37.2724H22.6608L22.9603 36.8589L22.1503 36.2724ZM11.3944 36.2724H10.3944V37.2724H11.3944V36.2724ZM20.6325 3.90315L20.6325 2.90315H20.6325V3.90315ZM20.6325 0.12085L20.6325 -0.87915H20.6325V0.12085ZM7.6121 37.4179L8.16888 38.2486L8.6121 37.9515V37.4179H7.6121ZM4.77932 44.5994L5.195 45.5089L5.93947 45.1686L5.75303 44.3716L4.77932 44.5994ZM9.28656 63.4262H10.2866V62.4262H9.28656V63.4262ZM21.2993 63.4262V62.4262H20.2993V63.4262H21.2993ZM77.234 47.6528L78.1743 47.9932L78.6596 46.6528H77.234V47.6528ZM72.8933 59.6439V60.6439H73.5948L73.8336 59.9843L72.8933 59.6439ZM71.5241 63.4262L72.4644 63.7666L72.9497 62.4262H71.5241V63.4262ZM70.5805 66.0324L71.5207 66.3733L71.5208 66.3729L70.5805 66.0324ZM70.2437 68.1323L70.9469 68.8432L71.2559 68.5376L71.2433 68.1032L70.2437 68.1323ZM69.2961 69.3527L70.1623 69.8524L70.1628 69.8516L69.2961 69.3527ZM66.7352 73.792L65.869 73.2923L65.8688 73.2925L66.7352 73.792ZM66.6337 77.9407L67.5237 77.4847L67.5233 77.4839L66.6337 77.9407ZM70.0634 80.279L69.9636 81.274L69.9642 81.2741L70.0634 80.279ZM73.105 80.5824L73.2072 79.5876L73.2043 79.5873L73.105 80.5824ZM77.2961 78.4332L78.1621 78.9332L78.1624 78.9328L77.2961 78.4332ZM79.2286 75.0823L78.3625 74.5825L78.3624 74.5827L79.2286 75.0823ZM79.9851 71.9136L79.2676 71.2171L78.9629 71.531L78.9865 71.9678L79.9851 71.9136ZM81.2498 69.8954L80.3095 69.5549L80.3093 69.5556L81.2498 69.8954ZM83.5921 63.4272L83.5912 62.4272L82.8904 62.4278L82.6518 63.0867L83.5921 63.4272ZM99.675 63.413V62.413L99.6742 62.413L99.675 63.413ZM99.675 59.659L99.6741 60.659H99.675V59.659ZM84.9612 59.6449L84.0209 59.3045L83.5362 60.6435L84.9602 60.6449L84.9612 59.6449ZM89.3019 47.6528V46.6528H88.6004L88.3617 47.3124L89.3019 47.6528ZM107.867 63.4272H108.867V62.4272H107.867V63.4272ZM119.88 63.4272V62.4272H118.88V63.4272H119.88ZM129.135 51.9709L130.135 51.9709L130.135 51.9707L129.135 51.9709ZM13.0689 63.4262V62.4262H12.0689V63.4262H13.0689ZM17.517 63.4262H18.517V62.4262H17.517V63.4262ZM111.568 43.7553L112.123 44.5873L112.131 44.5818L112.139 44.5762L111.568 43.7553ZM111.419 43.8705V44.8705H111.788L112.068 44.6309L111.419 43.8705ZM99.7023 43.8705L99.0296 44.6104L99.3157 44.8705H99.7023V43.8705ZM99.5299 43.7296L100.117 42.9203L100.111 42.9158L99.5299 43.7296ZM99.2216 38.918L99.4511 37.9447L98.9312 37.8221L98.5402 38.1861L99.2216 38.918ZM107.601 37.9429L107.987 37.0207L107.563 36.843L107.153 37.049L107.601 37.9429ZM75.9851 28.3384L76.978 28.2196L76.8589 27.2243L75.8639 27.3458L75.9851 28.3384ZM76.0235 28.6595L75.0306 28.7783L75.0309 28.7811L76.0235 28.6595ZM73.8457 31.443L73.9669 32.4357L73.9672 32.4356L73.8457 31.443ZM70.8514 31.8085L70.9709 32.8013L70.9726 32.8011L70.8514 31.8085ZM68.0679 29.6307L69.0604 29.5091L69.0604 29.5089L68.0679 29.6307ZM68.0285 29.3096L67.9073 28.3169L66.9141 28.4382L67.0359 29.4313L68.0285 29.3096ZM8.49759 43.8705L7.53553 44.1433L7.74174 44.8705H8.49759V43.8705ZM57.7591 40.0547L58.7462 39.8947L58.6101 39.0547H57.7591V40.0547ZM58.3777 43.8705V44.8705H59.5529L59.3648 43.7105L58.3777 43.8705ZM39.0387 36.2724L38.2929 35.6062L36.8047 37.2724H39.0387V36.2724ZM41.4854 33.5332L42.1173 32.7581L41.3764 32.1541L40.7396 32.867L41.4854 33.5332ZM44.8451 36.2724V37.2724H47.6542L45.477 35.4974L44.8451 36.2724ZM36.0375 26.3842L35.2917 25.718L35.2917 25.718L36.0375 26.3842ZM45.7424 25.6179L45.1104 26.3928L45.1105 26.3929L45.7424 25.6179ZM56.8845 34.7024L56.2526 35.4774L56.2898 35.5077L56.3298 35.5344L56.8845 34.7024ZM56.8914 34.7073L57.8784 34.547L57.7964 34.0417L57.3385 33.8128L56.8914 34.7073ZM57.1455 36.2724V37.2724H58.321L58.1326 36.1121L57.1455 36.2724ZM50.7372 36.2724L49.9365 36.8714L50.2364 37.2724H50.7372V36.2724ZM50.4191 35.9375L51.0513 35.1627L51.051 35.1625L50.4191 35.9375ZM42.5501 29.5213L43.1821 28.7463L43.1786 28.7435L42.5501 29.5213ZM39.7981 29.7439L39.0529 29.0771L39.0523 29.0778L39.7981 29.7439ZM34.1168 36.105L33.371 35.4388L33.3701 35.4398L34.1168 36.105ZM33.9838 36.2724V37.2724H34.4943L34.7938 36.8589L33.9838 36.2724ZM27.2052 36.2724L26.4594 35.6062L24.9712 37.2724H27.2052V36.2724ZM75.9516 73.1921L75.0855 72.6922L75.0853 72.6925L75.9516 73.1921ZM74.0191 76.543L74.8848 77.0435L74.8854 77.0426L74.0191 76.543ZM73.4803 76.8188L73.5927 75.825L73.5796 75.8237L73.4803 76.8188ZM70.4387 76.5154L70.3381 77.5103L70.3395 77.5105L70.4387 76.5154ZM69.9984 76.215L70.8893 75.7608L70.8858 75.7539L69.9984 76.215ZM70.0112 75.6821L70.8772 76.1823L70.8774 76.1818L70.0112 75.6821ZM72.5722 71.2428L73.4384 71.7425L73.4385 71.7422L72.5722 71.2428ZM73.7561 70.3337L74.0151 71.2996L74.0159 71.2994L73.7561 70.3337ZM75.2365 70.5278L74.7367 71.3939L74.7373 71.3942L75.2365 70.5278ZM90.3844 39.1042L90.0428 40.0441L90.0451 40.0449L90.3844 39.1042ZM87.9634 40.2379L87.0231 39.8975L87.0231 39.8975L87.9634 40.2379ZM77.9688 67.8457L77.3224 68.6086L78.4196 69.5383L78.9091 68.1861L77.9688 67.8457ZM77.1267 67.2517L77.6271 66.3859L77.6268 66.3858L77.1267 67.2517ZM74.4397 66.4855L73.4994 66.1451L73.0291 67.4443L74.4102 67.4851L74.4397 66.4855ZM84.4066 38.9505L83.4664 38.6101L83.4663 38.6102L84.4066 38.9505ZM83.2719 36.5295L82.9303 37.4693L82.9318 37.4699L83.2719 36.5295ZM80.8499 37.6642L81.7902 38.0046L81.7903 38.0043L80.8499 37.6642ZM78.6032 43.8705V44.8705H79.3047L79.5434 44.2109L78.6032 43.8705ZM62.2092 43.8705L61.2221 44.0305L61.3583 44.8705H62.2092V43.8705ZM60.5171 33.4317L59.5299 33.5915L59.5299 33.5917L60.5171 33.4317ZM60.6431 32.9412L59.8595 32.32L59.8558 32.3246L60.6431 32.9412ZM61.0893 32.7018L61.167 33.6988L61.1689 33.6987L61.0893 32.7018ZM65.0647 32.3847L65.9374 31.8964L65.6243 31.3368L64.9852 31.3878L65.0647 32.3847ZM74.3047 35.1968L74.4216 36.19L74.4259 36.1894L74.3047 35.1968ZM79.3961 31.2391L79.3164 30.2423L78.6925 30.2922L78.4647 30.8751L79.3961 31.2391ZM84.5002 30.8314L84.5798 31.8282L84.5804 31.8281L84.5002 30.8314ZM90.7272 31.7779L91.6466 31.3846L91.484 31.0046L91.1006 30.8502L90.7272 31.7779ZM93.3472 35.644L92.6401 36.3511L92.6406 36.3516L93.3472 35.644ZM95.5821 37.411L96.4178 37.9603L96.9821 37.1016L96.1085 36.5608L95.5821 37.411ZM94.9872 43.8705V44.8705H96.4942L95.9087 43.482L94.9872 43.8705ZM90.6711 43.8705L89.7307 43.5303L89.2459 44.8705H90.6711V43.8705ZM91.5191 41.5263L92.4595 41.8664L92.4595 41.8664L91.5191 41.5263ZM111.649 63.4262V62.4262H110.649V63.4262H111.649ZM116.097 63.4262H117.097V62.4262H116.097V63.4262ZM122.554 43.8882V13.1422H120.554V43.8882H122.554ZM122.554 13.1422C122.554 5.40942 116.265 -0.878165 108.534 -0.878165V1.12183C115.161 1.12183 120.554 6.51409 120.554 13.1422H122.554ZM108.534 -0.878165H43.4248V1.12183H108.534V-0.878165ZM43.4248 -0.878165C41.8275 -0.878165 40.5336 0.415639 40.5336 2.01298H42.5336C42.5336 1.52021 42.932 1.12183 43.4248 1.12183V-0.878165ZM40.5336 2.01298C40.5336 3.609 41.8271 4.90413 43.4248 4.90413V2.90413C42.9324 2.90413 42.5336 2.50511 42.5336 2.01298H40.5336ZM43.4248 4.90413H108.534V2.90413H43.4248V4.90413ZM108.534 4.90413C113.076 4.90413 116.772 8.60022 116.772 13.1422H118.772C118.772 7.49565 114.18 2.90413 108.534 2.90413V4.90413ZM116.772 13.1422V43.8705H118.772V13.1422H116.772ZM117.772 42.8705H116.146V44.8705H117.772V42.8705ZM117.068 44.2585C117.47 43.3042 117.689 42.2664 117.689 41.1983H115.689C115.689 41.9917 115.526 42.7662 115.225 43.4825L117.068 44.2585ZM117.689 41.1983C117.689 37.6113 115.286 34.5846 112.012 33.6255L111.45 35.5448C113.898 36.2621 115.689 38.5267 115.689 41.1983H117.689ZM112.513 35.2079C114.384 32.8582 115.402 29.9664 115.402 26.922H113.402C113.402 29.5136 112.537 31.9664 110.948 33.9624L112.513 35.2079ZM115.402 26.922C115.402 23.3631 114.014 20.0109 111.496 17.4938L110.082 18.9083C112.225 21.0501 113.402 23.8934 113.402 26.922H115.402ZM111.496 17.494C106.298 12.2947 97.8393 12.2948 92.6401 17.4939L94.0543 18.9081C98.4725 14.49 105.665 14.4901 110.082 18.9081L111.496 17.494ZM92.6401 17.4939C90.1232 20.0108 88.7344 23.3619 88.7344 26.922H90.7344C90.7344 23.8926 91.9123 21.0502 94.0543 18.9081L92.6401 17.4939ZM88.7344 26.922C88.7344 27.136 88.7409 27.3452 88.7502 27.5473L90.7481 27.4551C90.7397 27.273 90.7344 27.0961 90.7344 26.922H88.7344ZM89.9844 26.5292C88.0761 26.0672 86.0893 25.9058 84.1178 26.0641L84.2779 28.0577C86.0354 27.9165 87.8093 28.0604 89.5138 28.4731L89.9844 26.5292ZM84.1182 26.0641L79.5942 26.4255L79.7535 28.4192L84.2775 28.0577L84.1182 26.0641ZM80.6589 27.2503C80.2501 24.9098 78.0739 23.265 75.6828 23.5565L75.9249 25.5418C77.2492 25.3803 78.4613 26.2925 78.6887 27.5944L80.6589 27.2503ZM75.6826 23.5566L67.1704 24.5967L67.413 26.5819L75.9251 25.5418L75.6826 23.5566ZM67.1708 24.5967C65.0665 24.853 63.4869 26.5267 63.2491 28.5371L65.2353 28.772C65.3679 27.6502 66.2507 26.7235 67.4127 26.582L67.1708 24.5967ZM64.1624 27.6578L60.7071 27.9345L60.8668 29.9281L64.3221 29.6514L64.1624 27.6578ZM60.7075 27.9345C59.2479 28.0508 57.8984 28.7619 56.9707 29.8838L58.5121 31.1583C59.0992 30.4482 59.9522 30.001 60.8664 29.9282L60.7075 27.9345ZM58.3734 29.7461L48.765 21.9106L47.501 23.4606L57.1094 31.2961L58.3734 29.7461ZM48.7649 21.9106C43.8529 17.9055 36.694 18.4718 32.4708 23.1984L33.9622 24.5309C37.4731 20.6015 43.4182 20.1316 47.501 23.4606L48.7649 21.9106ZM32.4707 23.1985L21.5375 35.4388L23.0291 36.7711L33.9623 24.5308L32.4707 23.1985ZM21.5366 35.4398C21.4583 35.5277 21.3933 35.6128 21.3404 35.6859L22.9603 36.8589C22.9901 36.8178 23.0118 36.7906 23.03 36.7702L21.5366 35.4398ZM22.1503 35.2724H11.3944V37.2724H22.1503V35.2724ZM12.3944 36.2724V13.1412H10.3944V36.2724H12.3944ZM12.3944 13.1412C12.3944 8.60015 16.0905 4.90315 20.6325 4.90315V2.90315C14.9858 2.90315 10.3944 7.49572 10.3944 13.1412H12.3944ZM20.6324 4.90315L43.4247 4.90413L43.4248 2.90413L20.6325 2.90315L20.6324 4.90315ZM43.4248 4.90413C43.5157 4.90413 43.6401 4.89999 43.7694 4.87449C43.8325 4.86203 44.2044 4.79557 44.4559 4.44533C44.8194 3.93917 44.5843 3.4348 44.4823 3.27447C44.3798 3.1134 44.2526 3.00767 44.1999 2.96497C44.0749 2.86374 43.9188 2.76771 43.8033 2.69792C43.7382 2.65861 43.6681 2.61714 43.5997 2.57669C43.53 2.53539 43.46 2.49395 43.3887 2.45094C43.0923 2.27209 42.8306 2.09953 42.6491 1.93514C42.4253 1.73237 42.5356 1.73415 42.5356 1.92635H40.5356C40.5356 2.64108 41.0127 3.15135 41.3064 3.41739C41.6424 3.72181 42.0489 3.97838 42.3554 4.16334C42.4349 4.21128 42.5116 4.25671 42.581 4.2978C42.6519 4.33974 42.7135 4.37618 42.7693 4.40989C42.8253 4.44371 42.8684 4.47054 42.9014 4.49217C42.9368 4.51539 42.9463 4.52338 42.9411 4.51916C42.9378 4.51652 42.9225 4.504 42.901 4.48232C42.8819 4.46303 42.8392 4.41776 42.7947 4.34786C42.7183 4.22765 42.4877 3.75731 42.8314 3.2787C42.9599 3.09978 43.1145 3.01231 43.197 2.97386C43.283 2.93375 43.3526 2.91816 43.3822 2.91232C43.4396 2.90099 43.4645 2.90413 43.4248 2.90413V4.90413ZM42.5356 1.92635C42.5356 2.13396 42.409 2.14831 42.6222 1.96853C42.795 1.82288 43.0494 1.67085 43.3416 1.51549C43.4889 1.43715 43.6109 1.37585 43.7479 1.30459C43.8598 1.24634 44.013 1.16579 44.1349 1.08245C44.1817 1.05047 44.3188 0.956339 44.4345 0.80425C44.4939 0.726133 44.6083 0.555001 44.6411 0.305971C44.6802 0.00771521 44.5863 -0.282615 44.3995 -0.498255C44.2438 -0.677873 44.0663 -0.758068 43.9786 -0.791812C43.8804 -0.82957 43.7929 -0.847234 43.7359 -0.856474C43.6221 -0.874927 43.5105 -0.878165 43.4248 -0.878165V1.12183C43.4697 1.12183 43.4577 1.12454 43.4157 1.11773C43.3947 1.11432 43.3361 1.10391 43.2604 1.0748C43.1952 1.0497 43.0336 0.979555 42.8879 0.811353C42.7109 0.607129 42.6208 0.329585 42.6581 0.0454537C42.689 -0.189451 42.7959 -0.345119 42.8426 -0.406461C42.8958 -0.476446 42.9452 -0.519899 42.9646 -0.536374C42.9875 -0.555818 43.0034 -0.566724 43.0061 -0.568519C43.0101 -0.571305 42.9991 -0.563691 42.9617 -0.54279C42.9269 -0.523325 42.8823 -0.499558 42.8247 -0.46959C42.7198 -0.415023 42.5567 -0.33233 42.4026 -0.25036C42.0918 -0.0850979 41.678 0.148743 41.3332 0.439327C41.029 0.695776 40.5356 1.19671 40.5356 1.92635H42.5356ZM43.4248 -0.878165L20.6325 -0.87915L20.6324 1.12085L43.4247 1.12183L43.4248 -0.878165ZM20.6325 -0.87915C12.9007 -0.87915 6.6121 5.40947 6.6121 13.1412H8.6121C8.6121 6.51404 14.0053 1.12085 20.6325 1.12085V-0.87915ZM6.6121 13.1412V37.4179H8.6121V13.1412H6.6121ZM7.05532 36.5873C4.97473 37.9819 3.59808 40.3583 3.59808 43.053H5.59808C5.59808 41.0552 6.61689 39.2889 8.16888 38.2486L7.05532 36.5873ZM3.59808 43.053C3.59808 43.6544 3.67079 44.2509 3.8056 44.8271L5.75303 44.3716C5.65144 43.9373 5.59808 43.4937 5.59808 43.053H3.59808ZM4.36363 43.6899C1.22526 45.1242 -0.968262 48.2923 -0.968262 51.9709H1.03174C1.03174 49.1074 2.73872 46.6315 5.195 45.5089L4.36363 43.6899ZM-0.968262 51.9709V55.3257H1.03174V51.9709H-0.968262ZM-0.968262 55.3257C-0.968262 60.345 3.1131 64.4262 8.13315 64.4262V62.4262C4.21752 62.4262 1.03174 59.2402 1.03174 55.3257H-0.968262ZM8.13315 64.4262H9.28656V62.4262H8.13315V64.4262ZM8.28656 63.4262V66.5583H10.2866V63.4262H8.28656ZM8.28656 66.5583C8.28656 70.4221 11.4292 73.5647 15.2929 73.5647V71.5647C12.5337 71.5647 10.2866 69.3175 10.2866 66.5583H8.28656ZM15.2929 73.5647C19.1567 73.5647 22.2993 70.4221 22.2993 66.5583H20.2993C20.2993 69.3175 18.0521 71.5647 15.2929 71.5647V73.5647ZM22.2993 66.5583V63.4262H20.2993V66.5583H22.2993ZM21.2993 64.4262H49.2243V62.4262H21.2993V64.4262ZM49.2243 64.4262C49.3154 64.4262 49.4285 64.4221 49.5447 64.4026C49.6242 64.3893 49.8796 64.3443 50.1103 64.1459C50.2475 64.0278 50.3825 63.8489 50.4424 63.6078C50.5006 63.3732 50.4662 63.167 50.4185 63.0242C50.336 62.7774 50.1813 62.6205 50.1315 62.5707C50.0064 62.4455 49.8488 62.3378 49.7554 62.2747C49.6548 62.2068 49.5029 62.1088 49.3975 62.039C49.1436 61.8707 48.9266 61.7138 48.7771 61.5644C48.6034 61.3906 48.682 61.3872 48.682 61.535H46.682C46.682 62.2054 47.084 62.6996 47.3628 62.9784C47.6658 63.2815 48.0303 63.5322 48.2926 63.706C48.4453 63.8073 48.5352 63.864 48.6358 63.932C48.7435 64.0048 48.7464 64.0141 48.717 63.9846C48.7149 63.9826 48.5918 63.8682 48.5216 63.6582C48.48 63.5338 48.447 63.3446 48.5014 63.1256C48.5574 62.9 48.6833 62.7352 48.8059 62.6297C49.0074 62.4564 49.2112 62.4306 49.2138 62.4302C49.253 62.4236 49.2638 62.4262 49.2243 62.4262V64.4262ZM48.682 61.535C48.682 61.6833 48.6031 61.6801 48.777 61.5062C48.9266 61.3567 49.1437 61.1998 49.3977 61.0314C49.5032 60.9614 49.6548 60.8635 49.7556 60.7954C49.849 60.7323 50.0067 60.6245 50.1318 60.4992C50.1816 60.4493 50.3362 60.2924 50.4186 60.0457C50.4662 59.9029 50.5006 59.6969 50.4424 59.4625C50.3826 59.2216 50.2479 59.0427 50.1106 58.9246C49.8799 58.7259 49.6245 58.6808 49.5449 58.6675C49.4286 58.6479 49.3155 58.6439 49.2243 58.6439V60.6439C49.2638 60.6439 49.2529 60.6464 49.2136 60.6398C49.2109 60.6394 49.007 60.6135 48.8056 60.4401C48.6829 60.3345 48.5573 60.1697 48.5013 59.9443C48.447 59.7255 48.48 59.5365 48.5215 59.4122C48.5916 59.2023 48.7146 59.0879 48.7167 59.0859C48.7462 59.0563 48.7432 59.0657 48.6355 59.1385C48.5351 59.2064 48.445 59.2633 48.2924 59.3645C48.0302 59.5384 47.6658 59.789 47.3628 60.092C47.0843 60.3705 46.682 60.8647 46.682 61.535H48.682ZM49.2243 58.6439H8.13315V60.6439H49.2243V58.6439ZM8.13315 58.6439C6.30362 58.6439 4.81404 57.154 4.81404 55.3257H2.81404C2.81404 58.2589 5.19935 60.6439 8.13315 60.6439V58.6439ZM4.81404 55.3257V51.9709H2.81404V55.3257H4.81404ZM4.81404 51.9709C4.81404 50.1418 6.30347 48.6528 8.13315 48.6528V46.6528C5.1995 46.6528 2.81404 49.0367 2.81404 51.9709H4.81404ZM8.13315 48.6528H77.234V46.6528H8.13315V48.6528ZM76.2938 47.3124L71.953 59.3035L73.8336 59.9843L78.1743 47.9932L76.2938 47.3124ZM72.8933 58.6439H49.2243V60.6439H72.8933V58.6439ZM49.2243 58.6439C47.6266 58.6439 46.3332 59.939 46.3332 61.535H48.3332C48.3332 61.0429 48.7319 60.6439 49.2243 60.6439V58.6439ZM46.3332 61.535C46.3332 63.1324 47.627 64.4262 49.2243 64.4262V62.4262C48.7316 62.4262 48.3332 62.0278 48.3332 61.535H46.3332ZM49.2243 64.4262H71.5241V62.4262H49.2243V64.4262ZM70.5839 63.0858L69.6403 65.692L71.5208 66.3729L72.4644 63.7666L70.5839 63.0858ZM69.6404 65.6916C69.3528 66.4848 69.2198 67.3254 69.2441 68.1614L71.2433 68.1032C71.2262 67.5169 71.3197 66.9275 71.5207 66.3733L69.6404 65.6916ZM69.5404 67.4214C69.1194 67.8378 68.7403 68.3139 68.4295 68.8537L70.1628 69.8516C70.3759 69.4814 70.6411 69.1458 70.9469 68.8432L69.5404 67.4214ZM68.4299 68.853L65.869 73.2923L67.6014 74.2917L70.1623 69.8524L68.4299 68.853ZM65.8688 73.2925C64.9607 74.8678 64.9132 76.7792 65.7442 78.3975L67.5233 77.4839C67.0029 76.4703 67.0322 75.279 67.6016 74.2914L65.8688 73.2925ZM65.7438 78.3967C66.5735 80.0162 68.1538 81.0924 69.9636 81.274L70.1633 79.284C69.028 79.1701 68.0434 78.499 67.5237 77.4847L65.7438 78.3967ZM69.9642 81.2741L73.0058 81.5774L73.2043 79.5873L70.1627 79.2839L69.9642 81.2741ZM73.0028 81.5771C73.1826 81.5956 73.3605 81.604 73.5355 81.604V79.604C73.4247 79.604 73.3151 79.5987 73.2072 79.5876L73.0028 81.5771ZM73.5355 81.604C75.4275 81.604 77.203 80.5944 78.1621 78.9332L76.4301 77.9331C75.831 78.9708 74.7185 79.604 73.5355 79.604V81.604ZM78.1624 78.9328L80.0949 75.5819L78.3624 74.5827L76.4298 77.9336L78.1624 78.9328ZM80.0947 75.5821C80.7706 74.4109 81.0518 73.1171 80.9836 71.8595L78.9865 71.9678C79.0346 72.8535 78.8371 73.7601 78.3625 74.5825L80.0947 75.5821ZM80.7026 72.6102C81.3544 71.9387 81.8651 71.1353 82.1903 70.2352L80.3093 69.5556C80.0829 70.1822 79.7268 70.744 79.2676 71.2171L80.7026 72.6102ZM82.19 70.2359L84.5323 63.7676L82.6518 63.0867L80.3095 69.5549L82.19 70.2359ZM83.5929 64.4272L99.6759 64.413L99.6742 62.413L83.5912 62.4272L83.5929 64.4272ZM99.675 64.413C99.8275 64.413 100.104 64.4049 100.369 64.2814C100.522 64.2101 100.725 64.075 100.867 63.8308C101.013 63.5779 101.029 63.3199 101.002 63.1256C100.957 62.8102 100.784 62.5766 100.73 62.5035C100.651 62.3953 100.556 62.2865 100.486 62.207C100.323 62.0208 100.198 61.8792 100.103 61.7307C100.008 61.5826 100.01 61.526 100.01 61.536H98.0096C98.0096 62.068 98.225 62.5071 98.4181 62.8089C98.611 63.1102 98.848 63.3725 98.9818 63.5252C99.0605 63.615 99.0974 63.6592 99.1166 63.6853C99.1614 63.7466 99.053 63.6286 99.0215 63.4076C99.0006 63.2605 99.0107 63.0444 99.1362 62.8278C99.2566 62.62 99.4236 62.5156 99.5233 62.469C99.6816 62.3952 99.7836 62.413 99.675 62.413V64.413ZM100.01 61.536C100.01 61.5456 100.008 61.4888 100.103 61.3408C100.198 61.1924 100.323 61.0508 100.486 60.8648C100.555 60.7854 100.651 60.6766 100.73 60.5684C100.783 60.4955 100.957 60.2619 101.002 59.9464C101.029 59.752 101.013 59.4938 100.866 59.2408C100.725 58.9966 100.522 58.8616 100.369 58.7904C100.104 58.6671 99.8274 58.659 99.675 58.659V60.659C99.7837 60.659 99.6818 60.6768 99.5237 60.6031C99.4241 60.5567 99.257 60.4524 99.1364 60.2444C99.0107 60.0278 99.0005 59.8114 99.0215 59.6642C99.0531 59.443 99.1617 59.3249 99.1167 59.3862C99.0976 59.4123 99.0607 59.4565 98.9819 59.5464C98.8481 59.699 98.611 59.9613 98.4181 60.2628C98.2248 60.5648 98.0096 61.0039 98.0096 61.536H100.01ZM99.676 58.659L84.9621 58.6449L84.9602 60.6449L99.6741 60.659L99.676 58.659ZM85.9015 59.9852L90.2422 47.9932L88.3617 47.3124L84.0209 59.3045L85.9015 59.9852ZM89.3019 48.6528H121.034V46.6528H89.3019V48.6528ZM121.034 48.6528C122.863 48.6528 124.353 50.1427 124.353 51.9709H126.353C126.353 49.0378 123.968 46.6528 121.034 46.6528V48.6528ZM124.353 51.9709V55.3257H126.353V51.9709H124.353ZM124.353 55.3257C124.353 57.1551 122.863 58.6449 121.034 58.6449V60.6449C123.968 60.6449 126.353 58.2597 126.353 55.3257H124.353ZM121.034 58.6449H99.9072V60.6449H121.034V58.6449ZM99.9072 58.6449C98.3112 58.6449 97.016 59.9383 97.016 61.536H99.016C99.016 61.0436 99.415 60.6449 99.9072 60.6449V58.6449ZM97.016 61.536C97.016 63.1324 98.3108 64.4272 99.9072 64.4272V62.4272C99.4154 62.4272 99.016 62.0278 99.016 61.536H97.016ZM99.9072 64.4272H107.867V62.4272H99.9072V64.4272ZM106.867 63.4272V66.5583H108.867V63.4272H106.867ZM106.867 66.5583C106.867 70.4221 110.009 73.5647 113.873 73.5647V71.5647C111.114 71.5647 108.867 69.3175 108.867 66.5583H106.867ZM113.873 73.5647C117.738 73.5647 120.88 70.422 120.88 66.5583H118.88C118.88 69.3176 116.633 71.5647 113.873 71.5647V73.5647ZM120.88 66.5583V63.4272H118.88V66.5583H120.88ZM119.88 64.4272H121.034V62.4272H119.88V64.4272ZM121.034 64.4272C126.053 64.4272 130.135 60.3449 130.135 55.3257H128.135C128.135 59.2403 124.948 62.4272 121.034 62.4272V64.4272ZM130.135 55.3257V51.9709H128.135V55.3257H130.135ZM130.135 51.9707C130.134 47.1477 126.365 43.1935 121.618 42.8903L121.49 44.8862C125.192 45.1227 128.134 48.2111 128.135 51.9712L130.135 51.9707ZM16.517 66.5583C16.517 67.2323 15.9669 67.7824 15.2929 67.7824V69.7824C17.0715 69.7824 18.517 68.3369 18.517 66.5583H16.517ZM15.2929 67.7824C14.6189 67.7824 14.0689 67.2323 14.0689 66.5583H12.0689C12.0689 68.3369 13.5144 69.7824 15.2929 69.7824V67.7824ZM14.0689 66.5583V63.4262H12.0689V66.5583H14.0689ZM13.0689 64.4262H17.517V62.4262H13.0689V64.4262ZM16.517 63.4262V66.5583H18.517V63.4262H16.517ZM111.907 41.1983C111.907 41.8881 111.568 42.5375 110.997 42.9343L112.139 44.5762C113.245 43.8068 113.907 42.5453 113.907 41.1983H111.907ZM111.014 42.9232C110.914 42.9894 110.832 43.0568 110.769 43.1101L112.068 44.6309C112.1 44.6035 112.116 44.592 112.123 44.5873L111.014 42.9232ZM111.419 42.8705H99.7023V44.8705H111.419V42.8705ZM100.375 43.1306C100.298 43.0602 100.212 42.9891 100.117 42.9203L98.9425 44.5389C98.9699 44.5588 98.9987 44.5823 99.0296 44.6104L100.375 43.1306ZM100.111 42.9158C99.5569 42.5201 99.2258 41.8764 99.2258 41.1983H97.2258C97.2258 42.5235 97.8698 43.773 98.9488 44.5434L100.111 42.9158ZM99.2258 41.1983C99.2258 40.613 99.4749 40.0486 99.903 39.6499L98.5402 38.1861C97.7115 38.9577 97.2258 40.0499 97.2258 41.1983H99.2258ZM98.9921 39.8914C100.002 40.1295 101.034 40.251 102.068 40.251V38.251C101.191 38.251 100.313 38.1479 99.4511 37.9447L98.9921 39.8914ZM102.068 40.251C104.122 40.251 106.173 39.7773 108.049 38.8368L107.153 37.049C105.559 37.848 103.815 38.251 102.068 38.251V40.251ZM107.214 38.8652C107.559 39.0098 107.937 39.0897 108.332 39.0897V37.0897C108.209 37.0897 108.094 37.0652 107.987 37.0207L107.214 38.8652ZM108.332 39.0897H109.798V37.0897H108.332V39.0897ZM109.798 39.0897C110.96 39.0897 111.907 40.0367 111.907 41.1983H113.907C113.907 38.9321 112.064 37.0897 109.798 37.0897V39.0897ZM74.9922 28.4572L75.0306 28.7783L77.0164 28.5407L76.978 28.2196L74.9922 28.4572ZM75.0309 28.7811C75.1312 29.5994 74.5448 30.35 73.7242 30.4504L73.9672 32.4356C75.883 32.2012 77.2508 30.4539 77.0161 28.5379L75.0309 28.7811ZM73.7246 30.4504L70.7303 30.8158L70.9726 32.8011L73.9669 32.4357L73.7246 30.4504ZM70.732 30.8156C69.9104 30.9145 69.1606 30.327 69.0604 29.5091L67.0753 29.7522C67.31 31.6686 69.0581 33.0314 70.9709 32.8013L70.732 30.8156ZM69.0604 29.5089L69.021 29.1878L67.0359 29.4313L67.0753 29.7524L69.0604 29.5089ZM68.1496 30.3022L76.1063 29.331L75.8639 27.3458L67.9073 28.3169L68.1496 30.3022ZM9.45966 43.5977C9.40723 43.4128 9.38038 43.2329 9.38038 43.053H7.38038C7.38038 43.4365 7.43824 43.8003 7.53553 44.1433L9.45966 43.5977ZM9.38038 43.053C9.38038 41.9517 10.2779 41.0547 11.3786 41.0547V39.0547C9.17379 39.0547 7.38038 40.8467 7.38038 43.053H9.38038ZM11.3786 41.0547H57.7591V39.0547H11.3786V41.0547ZM56.772 40.2147L57.3906 44.0305L59.3648 43.7105L58.7462 39.8947L56.772 40.2147ZM58.3777 42.8705H8.49759V44.8705H58.3777V42.8705ZM39.7845 36.9386L42.2312 34.1993L40.7396 32.867L38.2929 35.6062L39.7845 36.9386ZM40.8535 34.3082L44.2132 37.0475L45.477 35.4974L42.1173 32.7581L40.8535 34.3082ZM44.8451 35.2724H39.0387V37.2724H44.8451V35.2724ZM36.7832 27.0504C38.9426 24.6331 42.5986 24.3443 45.1104 26.3928L46.3745 24.8429C43.0336 22.1183 38.1636 22.5032 35.2917 25.718L36.7832 27.0504ZM45.1105 26.3929L56.2526 35.4774L57.5164 33.9273L46.3744 24.8428L45.1105 26.3929ZM56.3298 35.5344C56.3092 35.5207 56.2932 35.5089 56.2834 35.5015C56.2768 35.4965 56.2666 35.4885 56.2744 35.4945C56.2764 35.4962 56.2945 35.5104 56.3181 35.5268C56.3423 35.5437 56.386 35.5726 56.4442 35.6017L57.3385 33.8128C57.3958 33.8415 57.4384 33.8698 57.4617 33.886C57.4842 33.9017 57.5012 33.9151 57.5022 33.9158C57.5089 33.921 57.4975 33.9121 57.4896 33.9062C57.4786 33.8978 57.4612 33.885 57.4392 33.8703L56.3298 35.5344ZM55.9043 34.8675L56.1584 36.4327L58.1326 36.1121L57.8784 34.547L55.9043 34.8675ZM57.1455 35.2724H50.7372V37.2724H57.1455V35.2724ZM51.538 35.6734C51.4055 35.4963 51.2459 35.3215 51.0513 35.1627L49.7869 36.7123C49.8385 36.7544 49.8878 36.8062 49.9365 36.8714L51.538 35.6734ZM51.051 35.1625L43.1821 28.7463L41.9182 30.2964L49.7872 36.7125L51.051 35.1625ZM43.1786 28.7435C41.9328 27.7369 40.1212 27.8834 39.0529 29.0771L40.5433 30.4108C40.9013 30.0108 41.5048 29.9623 41.9216 30.2991L43.1786 28.7435ZM39.0523 29.0778L33.371 35.4388L34.8626 36.7711L40.5439 30.4101L39.0523 29.0778ZM33.3701 35.4398C33.2918 35.5277 33.2268 35.6128 33.1739 35.6859L34.7938 36.8589C34.8235 36.8178 34.8453 36.7906 34.8634 36.7702L33.3701 35.4398ZM33.9838 35.2724H27.2052V37.2724H33.9838V35.2724ZM27.951 36.9386L36.7833 27.0504L35.2917 25.718L26.4594 35.6062L27.951 36.9386ZM75.0853 72.6925L73.1528 76.0434L74.8854 77.0426L76.8179 73.6917L75.0853 72.6925ZM73.1534 76.0425C73.2357 75.9001 73.4009 75.8034 73.5927 75.8251L73.3679 77.8125C73.9951 77.8834 74.5839 77.5641 74.8848 77.0435L73.1534 76.0425ZM73.5796 75.8237L70.538 75.5204L70.3395 77.5105L73.3811 77.8139L73.5796 75.8237ZM70.5393 75.5205C70.6224 75.5289 70.7105 75.5671 70.7808 75.6259C70.841 75.6763 70.8727 75.7281 70.8893 75.7608L69.1075 76.6692C69.2407 76.9305 69.6041 77.4361 70.3381 77.5103L70.5393 75.5205ZM70.8858 75.7539C70.9036 75.7881 70.9273 75.8447 70.9331 75.9233C70.9398 76.015 70.9193 76.1093 70.8772 76.1823L69.1453 75.182C68.7762 75.821 68.9742 76.4127 69.1111 76.6761L70.8858 75.7539ZM70.8774 76.1818L73.4384 71.7425L71.706 70.7432L69.145 75.1824L70.8774 76.1818ZM73.4385 71.7422C73.566 71.5211 73.7681 71.3658 74.0151 71.2996L73.4971 69.3678C72.7375 69.5715 72.0984 70.0624 71.7058 70.7435L73.4385 71.7422ZM74.0159 71.2994C74.1011 71.2765 74.1842 71.2658 74.2653 71.2658V69.2658C74.0057 69.2658 73.748 69.3004 73.4963 69.368L74.0159 71.2994ZM74.2653 71.2658C74.4256 71.2658 74.5873 71.3077 74.7367 71.3939L75.7363 69.6616C75.2849 69.4011 74.7788 69.2658 74.2653 69.2658V71.2658ZM74.7373 71.3942C75.1902 71.6551 75.3472 72.2389 75.0855 72.6922L76.8177 73.692C77.6316 72.2817 77.1464 70.474 75.7357 69.6613L74.7373 71.3942ZM90.726 38.1644C89.2243 37.6186 87.5665 38.3968 87.0231 39.8975L88.9036 40.5784C89.0714 40.1149 89.5825 39.8767 90.0429 40.0441L90.726 38.1644ZM87.0231 39.8975L77.0286 67.5053L78.9091 68.1861L88.9036 40.5783L87.0231 39.8975ZM78.6153 67.0827C78.3137 66.8272 77.9843 66.5924 77.6271 66.3859L76.6263 68.1175C76.8758 68.2617 77.1078 68.4268 77.3224 68.6086L78.6153 67.0827ZM77.6268 66.3858C76.6512 65.8223 75.5695 65.5184 74.4692 65.4859L74.4102 67.4851C75.1793 67.5078 75.9376 67.7198 76.6266 68.1177L77.6268 66.3858ZM75.38 66.8259L85.3469 39.2909L83.4663 38.6102L73.4994 66.1451L75.38 66.8259ZM85.3469 39.291C85.8905 37.7896 85.1146 36.1326 83.6121 35.5891L82.9318 37.4699C83.3953 37.6375 83.6339 38.1475 83.4664 38.6101L85.3469 39.291ZM83.6135 35.5896C82.112 35.0439 80.4528 35.822 79.9095 37.324L81.7903 38.0043C81.9581 37.5403 82.4698 37.302 82.9303 37.4693L83.6135 35.5896ZM79.9096 37.3238L77.6629 43.5301L79.5434 44.2109L81.7902 38.0046L79.9096 37.3238ZM78.6032 42.8705H62.2092V44.8705H78.6032V42.8705ZM63.1964 43.7105L61.5042 33.2717L59.5299 33.5917L61.2221 44.0305L63.1964 43.7105ZM61.5042 33.272C61.5142 33.3338 61.5063 33.3979 61.4878 33.4519C61.4714 33.5 61.4489 33.5342 61.4304 33.5577L59.8558 32.3246C59.6957 32.529 59.4305 32.9771 59.5299 33.5915L61.5042 33.272ZM61.4268 33.5624C61.4117 33.5814 61.3852 33.6108 61.3421 33.6386C61.2936 33.6699 61.2316 33.6938 61.167 33.6988L61.0117 31.7048C60.3844 31.7537 60.0136 32.1256 59.8595 32.32L61.4268 33.5624ZM61.1689 33.6987L65.1442 33.3815L64.9852 31.3878L61.0098 31.705L61.1689 33.6987ZM64.192 32.8729C65.453 35.1271 67.8629 36.6095 70.5441 36.6095V34.6095C68.6078 34.6095 66.8551 33.5369 65.9374 31.8964L64.192 32.8729ZM70.5441 36.6095C70.6759 36.6095 71.0193 36.5739 71.3437 36.5394C71.7117 36.5004 72.1768 36.4484 72.6318 36.3968C73.0873 36.3451 73.5347 36.2934 73.8681 36.2546C74.0348 36.2352 74.1731 36.2191 74.2697 36.2078C74.318 36.2021 74.356 36.1977 74.3818 36.1946C74.3947 36.1931 74.4047 36.1919 74.4114 36.1912C74.4147 36.1908 74.4172 36.1905 74.4189 36.1903C74.4198 36.1902 74.4204 36.1901 74.4209 36.19C74.4211 36.19 74.4213 36.19 74.4214 36.19C74.4214 36.19 74.4215 36.19 74.4215 36.19C74.4215 36.19 74.4216 36.19 74.3047 35.1968C74.1879 34.2037 74.1879 34.2037 74.1879 34.2037C74.1879 34.2037 74.1878 34.2037 74.1878 34.2037C74.1877 34.2037 74.1875 34.2037 74.1873 34.2037C74.1869 34.2038 74.1863 34.2039 74.1854 34.2039C74.1838 34.2041 74.1813 34.2044 74.178 34.2048C74.1714 34.2056 74.1615 34.2068 74.1487 34.2083C74.1231 34.2113 74.0854 34.2157 74.0372 34.2213C73.941 34.2326 73.8033 34.2487 73.6371 34.268C73.3048 34.3066 72.8593 34.3581 72.4061 34.4095C71.9526 34.4611 71.4932 34.5123 71.1325 34.5506C70.7281 34.5936 70.5384 34.6095 70.5441 34.6095V36.6095ZM74.4259 36.1894C77.1793 35.8534 79.3847 34.0152 80.3275 31.6032L78.4647 30.8751C77.7782 32.6315 76.1758 33.961 74.1836 34.2042L74.4259 36.1894ZM79.4757 32.236L84.5798 31.8282L84.4206 29.8345L79.3164 30.2423L79.4757 32.236ZM84.5804 31.8281C86.5797 31.6672 88.5175 31.9665 90.3538 32.7056L91.1006 30.8502C88.9773 29.9956 86.729 29.6488 84.42 29.8346L84.5804 31.8281ZM89.8078 32.1712C90.4675 33.7134 91.421 35.132 92.6401 36.3511L94.0543 34.9369C93.0159 33.8984 92.2063 32.693 91.6466 31.3846L89.8078 32.1712ZM92.6406 36.3516C93.3864 37.0963 94.1988 37.7307 95.0558 38.2613L96.1085 36.5608C95.3777 36.1083 94.6871 35.5687 94.0538 34.9364L92.6406 36.3516ZM94.7465 36.8618C93.9111 38.1328 93.4435 39.6389 93.4435 41.1983H95.4435C95.4435 40.039 95.7915 38.9133 96.4178 37.9603L94.7465 36.8618ZM93.4435 41.1983C93.4435 42.2656 93.6629 43.3036 94.0658 44.259L95.9087 43.482C95.6063 42.7649 95.4435 41.9906 95.4435 41.1983H93.4435ZM94.9872 42.8705H90.6711V44.8705H94.9872V42.8705ZM91.6114 44.2107L92.4595 41.8664L90.5788 41.1861L89.7307 43.5303L91.6114 44.2107ZM92.4595 41.8664C93.0025 40.3652 92.2281 38.7062 90.7238 38.1635L90.0451 40.0449C90.5068 40.2114 90.7469 40.7213 90.5788 41.1861L92.4595 41.8664ZM115.097 66.5583C115.097 67.2323 114.547 67.7824 113.873 67.7824V69.7824C115.652 69.7824 117.097 68.3369 117.097 66.5583H115.097ZM113.873 67.7824C113.199 67.7824 112.649 67.2323 112.649 66.5583H110.649C110.649 68.3369 112.095 69.7824 113.873 69.7824V67.7824ZM112.649 66.5583V63.4262H110.649V66.5583H112.649ZM111.649 64.4262H116.097V62.4262H111.649V64.4262ZM115.097 63.4262V66.5583H117.097V63.4262H115.097Z" fill="#D7D7D7" mask="url(#path-1-inside-1)"/>
<path d="M111.618 66.6988C111.618 67.9276 112.614 68.9238 113.843 68.9238V68.9238C115.072 68.9238 116.068 67.9276 116.068 66.6988V63.3995H111.618V66.6988Z" fill="#4F3076"/>
<path d="M11.3497 36.3698L11.3306 14.8209V13.3036C11.3306 11.4979 11.8682 9.94232 12.0546 9.61378C12.548 8.74424 13.4398 7.10836 14.6448 6.14532C15.7506 5.26155 16.764 4.53343 18.1138 4.24596C18.4949 4.16478 19.3159 3.91466 20.3625 3.87486C23.8195 3.74339 30.4803 3.87477 32.3302 3.87477H46.2357L106.303 3.90859C108.107 3.90859 109.544 3.79026 110.846 4.20215C112.233 4.64098 113.435 4.94767 114.665 6.20479C115.897 7.46406 116.591 8.27009 117.351 10.4446C117.957 12.1821 117.816 13.471 117.816 15.2363C117.816 16.6485 117.749 35.1185 117.749 43.9449L116.102 43.8894C116.528 43.6126 116.72 41.1217 116.656 40.3978C116.611 39.8882 116.389 39.1106 116.146 38.5504C115.702 37.5252 115.105 36.7691 114.809 36.4704C113.878 35.5326 113.562 35.4196 112.863 35.021C112.638 34.893 112.034 34.678 111.755 34.5785L111.722 34.5667C112.264 34.1009 113.265 31.9462 113.836 30.6209C114.123 29.9531 114.501 27.633 114.321 25.4091C114.225 24.2265 112.997 20.5133 111.748 19.2762C110.388 17.9301 109.557 17.1556 108.578 16.4946C107.903 16.0386 105.667 14.9274 103.652 14.7068C101.637 14.4861 100.424 14.7562 99.7797 14.8557C98.6523 15.0299 97.7689 15.3912 96.3928 16.1184C94.3898 17.1769 93.4422 18.1164 92.6806 18.8987C92.0686 19.5273 91.0551 21.2541 90.6328 22.1461C90.2105 23.0382 89.9066 24.7007 89.8711 24.8258C89.8356 24.951 89.6276 27.1619 89.7109 27.4547C89.1284 27.3292 86.3228 26.9906 86.3228 26.9906C85.4566 26.9906 82.4974 27.0999 81.957 27.1454C80.9604 27.2293 80.188 27.3152 79.7469 27.3152C79.5094 26.7034 78.9989 25.4255 77.9188 24.9331C76.4824 24.2784 75.6741 24.5819 74.5441 24.6939C73.141 24.833 69.8808 25.2561 67.182 25.5602C67.064 25.6065 66.1707 25.8088 65.7569 26.1233C65.1838 26.5588 64.5424 27.4867 64.5424 27.4867C64.5424 27.4867 64.1602 28.3319 64.2221 28.6364C64.0615 28.6566 63.5753 28.6749 63.3967 28.6914C62.5577 28.7691 61.6484 28.82 61.5177 28.8323C60.8697 28.8933 59.6998 29.1033 59.2907 29.2974C58.7917 29.5342 58.2456 30.0844 57.7216 30.5382C57.3286 30.3277 54.6018 28.0331 53.3232 26.9985C51.8853 25.835 50.111 24.2605 47.9134 22.5164C47.0394 21.8228 45.8391 21.2532 44.3508 20.6152C44.1175 20.5152 42.7507 20.2947 41.2263 20.2179C39.2318 20.1174 34.9164 22.2722 34.596 22.5841C33.6117 23.5423 31.7921 25.4989 30.7298 26.6089C29.482 27.9128 27.0955 30.7782 26.4369 31.5053C25.5293 32.5073 25.4138 32.7332 24.6073 33.4986C23.9721 34.1015 22.5302 36.011 22.1899 36.3698H20.348H11.3497Z" fill="#4F3076"/>
<path d="M13.0337 66.6871C13.0337 67.9259 14.038 68.9302 15.2768 68.9302V68.9302C16.5156 68.9302 17.5198 67.9259 17.5198 66.6871V63.4059H13.0337V66.6871Z" fill="#4F3076"/>
<path d="M111.618 66.5711C111.618 67.8702 112.671 68.9233 113.97 68.9233V68.9233C115.269 68.9233 116.323 67.8702 116.323 66.5711V63.3991H111.618V66.5711Z" fill="#4F3076"/>
<path d="M3.45703 51.6203C3.45703 49.4105 5.2489 47.6194 7.45869 47.6203L77.337 47.6493L72.979 59.6995L7.46111 59.7663C5.25038 59.7686 3.45703 57.977 3.45703 55.7663V51.6203Z" fill="#4F3076"/>
<path d="M125.533 55.69C125.533 57.8972 123.745 59.6873 121.538 59.69L84.75 59.7358L89.2879 47.6042L121.525 47.5412C123.738 47.5368 125.533 49.329 125.533 51.5412V55.69Z" fill="#4F3076"/>
<circle cx="102.043" cy="26.9669" r="9.07944" fill="white"/>
</svg>
