<svg width="78" height="78" viewBox="0 0 78 78" fill="none" xmlns="http://www.w3.org/2000/svg">
<path d="M52.555 48.9533L52.5549 48.9533L52.5585 48.9628C53.556 51.5639 53.7657 53.4668 53.5963 54.847C53.4283 56.2159 52.8848 57.0953 52.3209 57.6602C51.6451 58.3187 50.7803 58.7497 49.8476 58.893L49.7181 58.9128L49.615 58.9937C49.5812 59.0202 49.5451 59.0435 49.5071 59.0634L1.6286 77.1796L1.6284 77.1797C1.47761 77.2369 1.31338 77.2469 1.15722 77.2086L1.15705 77.2086C0.730786 77.1042 0.469924 76.6739 0.574424 76.2477L0.574568 76.2471L3.10048 65.8897L3.10049 65.8896C3.20452 65.4629 3.63471 65.2013 4.06157 65.3054C4.48829 65.4094 4.74985 65.8396 4.6458 66.2665L4.64578 66.2665L2.70377 74.2366L2.47912 75.1585L3.36658 74.8225L14.1668 70.7339L14.9396 70.4414L14.3218 69.8925C10.474 66.4743 8.08198 61.712 7.6378 56.5844C7.63778 56.5842 7.63777 56.584 7.63775 56.5838L7.02677 49.3128L7.02695 49.3128L7.02599 49.3042C6.99239 48.8675 7.31863 48.4857 7.75536 48.451L7.76284 48.4504L7.7703 48.4496C7.77197 48.4494 7.77438 48.4492 7.78043 48.4487C7.78305 48.4485 7.78636 48.4483 7.79058 48.448C8.21956 48.4199 8.59025 48.7445 8.619 49.1732L8.61894 49.1732L8.61958 49.1809L9.22031 56.4557L9.22041 56.457C9.65022 61.5063 12.1283 66.1596 16.078 69.3343C16.1376 69.3869 16.1885 69.4482 16.2292 69.5161L16.444 69.8747L16.835 69.7267L31.975 63.9978L33.0856 63.5775L32.0089 63.0768C21.5506 58.2133 13.7982 48.9489 10.8547 37.7969C10.5262 36.5469 10.2578 35.2687 10.0572 33.9909C9.98917 33.5574 10.2856 33.1506 10.7192 33.0826C11.1528 33.0146 11.5595 33.311 11.6276 33.7446L11.6276 33.7451C13.7046 46.9026 22.6677 57.9407 35.1186 62.6743L35.296 62.7418L35.4735 62.6745L44.6722 59.1866L46.0002 58.6831L44.6496 58.2436C43.6057 57.9039 42.5853 57.4959 41.595 57.0221C36.0561 54.1573 31.021 50.409 26.6876 45.9246L26.6876 45.9246L26.6816 45.9186C22.0933 41.3296 18.0109 35.973 15.6681 31.1966C14.4958 28.8066 13.7737 26.5911 13.6237 24.7071C13.4746 22.835 13.8915 21.3405 14.9341 20.2915C16.1822 19.1825 17.8693 18.7052 19.5138 18.9962L19.5271 18.9986L19.5406 19.0002C19.9616 19.0513 20.2683 19.4242 20.2372 19.8473C20.2057 20.2753 19.8406 20.5992 19.4153 20.5832C18.2523 20.3474 17.0436 20.6352 16.1113 21.3715L16.0883 21.3896L16.0676 21.4103C15.2552 22.2226 15.0476 23.5286 15.2413 25.0372C15.4375 26.5661 16.0585 28.4243 17.0671 30.4915C19.0862 34.6302 22.7029 39.6967 27.8019 44.7969C32.005 49.1519 36.8876 52.7953 42.2591 55.5844L42.2663 55.5881L42.2737 55.5916C44.2905 56.5567 46.1189 57.1529 47.6249 57.3412C49.1069 57.5265 50.4012 57.3299 51.1946 56.538L51.1954 56.5372C51.8533 55.8777 52.0969 54.8623 52.0548 53.6965C52.0123 52.5191 51.6774 51.1031 51.0753 49.5318L51.0754 49.5318L51.0717 49.5227C51.0673 49.5119 51.0633 49.5016 51.0597 49.4917C50.9111 49.079 51.1252 48.6239 51.538 48.4751L51.5381 48.4751C51.9508 48.3263 52.4062 48.5403 52.555 48.9533Z" fill="#FF56E4" stroke="#FF56E4"/>
<path d="M65.0688 45.9131L65.0682 45.9129C58.1515 43.3235 50.6758 42.5976 43.3901 43.808C43.39 43.808 43.3898 43.8081 43.3897 43.8081L38.7712 44.5837C38.343 44.6688 38.0634 45.0837 38.1459 45.513L65.0688 45.9131ZM65.0688 45.9131C65.3803 46.0292 65.5864 46.3267 65.5858 46.6589V46.659C65.5851 47.0979 65.2288 47.4531 64.7898 47.4524L64.7854 47.4524C64.6901 47.4531 64.5952 47.4374 64.5052 47.406C57.8519 44.9144 50.6601 44.216 43.6517 45.3812L43.6515 45.3812M65.0688 45.9131L43.6515 45.3812M43.6515 45.3812L39.0334 46.1505M43.6515 45.3812L39.0334 46.1505M39.0334 46.1505C38.6157 46.2074 38.2256 45.9278 38.1459 45.513L39.0334 46.1505Z" fill="#FF56E4" stroke="#FF56E4"/>
<path d="M41.1473 38.1718L41.1473 38.1718L68.3355 25.225C68.732 25.0362 69.2062 25.2045 69.395 25.6009C69.5837 25.9973 69.4154 26.4716 69.019 26.6603L41.8347 39.6052C41.8321 39.6064 41.8296 39.6076 41.8271 39.6089C41.4314 39.7949 40.9595 39.6263 40.7714 39.2312L40.7713 39.2309C40.7709 39.23 40.7704 39.2291 40.77 39.2282C40.5834 38.8324 40.7519 38.36 41.1473 38.1718ZM41.6934 39.7037C41.6941 39.703 41.6963 39.7009 41.6988 39.6984L41.6947 39.7025L41.6937 39.7035L41.6934 39.7037Z" fill="#FF56E4" stroke="#FF56E4"/>
<path d="M31.0049 8.93607L31.0048 8.93609L31.0069 8.94571C32.7399 16.6873 32.0253 24.776 28.9621 32.0939L28.962 32.0943L27.0782 36.6063L27.0781 36.6064C26.9547 36.9024 26.6655 37.0951 26.3446 37.0951L26.3437 37.0951C26.2396 37.0953 26.1367 37.0747 26.0414 37.0346L26.0411 37.0345C25.6382 36.8653 25.4475 36.4027 25.614 35.9988C25.6141 35.9986 25.6142 35.9984 25.6143 35.9982L27.4959 31.4831C27.496 31.483 27.496 31.4828 27.4961 31.4827C30.4323 24.4664 31.1169 16.7113 29.4556 9.28916L29.4556 9.28915L29.4536 9.28072C29.4506 9.26814 29.4489 9.26053 29.4478 9.25502L29.4478 9.25502L29.4473 9.25251C29.3599 8.82243 29.6377 8.40292 30.0678 8.31549C30.4979 8.22808 30.9174 8.50588 31.0049 8.93607Z" fill="#FF56E4" stroke="#FF56E4"/>
<path d="M67.8779 50.5417C67.8779 48.6728 69.393 47.1577 71.262 47.1577C73.1309 47.1577 74.646 48.6728 74.646 50.5417C74.646 52.4107 73.1309 53.9258 71.262 53.9258C69.393 53.9258 67.8779 52.4107 67.8779 50.5417ZM69.4673 50.5417C69.4673 51.5329 70.2708 52.3364 71.262 52.3364C72.2531 52.3364 73.0566 51.5329 73.0566 50.5417C73.0566 49.5506 72.2531 48.7471 71.262 48.7471C70.2708 48.7471 69.4673 49.5506 69.4673 50.5417Z" fill="#FF56E4" stroke="#FF56E4"/>
<path d="M36.8066 14.2908C36.8066 12.4218 38.3217 10.9067 40.1907 10.9067C42.0596 10.9067 43.5747 12.4218 43.5747 14.2908C43.5747 16.1597 42.0596 17.6748 40.1907 17.6748C38.3217 17.6748 36.8066 16.1597 36.8066 14.2908ZM38.396 14.2908C38.396 15.2819 39.1995 16.0854 40.1907 16.0854C41.1818 16.0854 41.9854 15.2819 41.9854 14.2908C41.9854 13.2996 41.1818 12.4961 40.1907 12.4961C39.1995 12.4961 38.396 13.2996 38.396 14.2908Z" fill="#FF56E4" stroke="#FF56E4"/>
<path d="M30.627 2.63867C30.627 3.79259 29.6915 4.72802 28.5376 4.72802C27.3837 4.72802 26.4482 3.79259 26.4482 2.63867C26.4482 1.48475 27.3837 0.549316 28.5376 0.549316C29.6915 0.549316 30.627 1.48475 30.627 2.63867Z" fill="#FF56E4" stroke="#FF56E4"/>
<path d="M63.9941 7.81714C63.9941 7.37829 64.35 7.02246 64.7888 7.02246C65.2277 7.02246 65.5835 7.37829 65.5835 7.81714V9.11181C65.5835 9.55066 65.2277 9.90649 64.7888 9.90649C64.35 9.90649 63.9941 9.55066 63.9941 9.11181V7.81714Z" fill="#FF56E4" stroke="#FF56E4"/>
<path d="M63.9941 1.34399C63.9941 0.90515 64.35 0.549316 64.7888 0.549316C65.2277 0.549316 65.5835 0.90515 65.5835 1.34399V2.63867C65.5835 3.07751 65.2277 3.43335 64.7888 3.43335C64.35 3.43335 63.9941 3.07751 63.9941 2.63867V1.34399Z" fill="#FF56E4" stroke="#FF56E4"/>
<path d="M67.3782 4.43311H68.6728C69.1117 4.43311 69.4675 4.78894 69.4675 5.22778C69.4675 5.66663 69.1117 6.02246 68.6728 6.02246H67.3782C66.9393 6.02246 66.5835 5.66663 66.5835 5.22778C66.5835 4.78894 66.9393 4.43311 67.3782 4.43311Z" fill="#FF56E4" stroke="#FF56E4"/>
<path d="M60.905 4.43311H62.1997C62.6385 4.43311 62.9944 4.78894 62.9944 5.22778C62.9944 5.66663 62.6385 6.02246 62.1997 6.02246H60.905C60.4662 6.02246 60.1104 5.66663 60.1104 5.22778C60.1104 4.78894 60.4662 4.43311 60.905 4.43311Z" fill="#FF56E4" stroke="#FF56E4"/>
<path d="M54.4307 21.2642H54.9307V20.7642V16.853V16.353H54.4307H50.5195H50.0195V16.853V20.7642V21.2642H50.5195H54.4307ZM49.2249 14.7637H55.7254C56.1643 14.7637 56.5201 15.1195 56.5201 15.5583V22.0589C56.5201 22.4978 56.1643 22.8536 55.7254 22.8536H49.2249C48.786 22.8536 48.4302 22.4978 48.4302 22.0589V15.5583C48.4302 15.1195 48.786 14.7637 49.2249 14.7637Z" fill="#FF56E4" stroke="#FF56E4"/>
<path d="M32.9534 38.1851L32.9534 38.1851L45.8961 26.5367C46.2133 26.2363 46.2286 25.7358 45.9295 25.4164C45.6387 25.106 45.1554 25.0798 44.8328 25.356L31.8903 37.0044C31.8902 37.0044 31.8902 37.0044 31.8901 37.0045C31.5643 37.2981 31.538 37.8002 31.8314 38.1263L32.9534 38.1851ZM32.9534 38.1851C32.6273 38.4786 32.1251 38.4523 31.8315 38.1264L32.9534 38.1851Z" fill="#FF56E4" stroke="#FF56E4"/>
<path d="M69.1733 31.1213C69.1733 30.6825 69.5292 30.3267 69.968 30.3267C70.4069 30.3267 70.7627 30.6825 70.7627 31.1213V32.416C70.7627 32.8549 70.4069 33.2107 69.968 33.2107C69.5292 33.2107 69.1733 32.8549 69.1733 32.416V31.1213Z" fill="#FF56E4" stroke="#FF56E4"/>
<path d="M75.1035 29.9542L74.195 29.0457C73.8792 28.7434 73.3783 28.753 73.0741 29.0678L75.1035 29.9542ZM75.1035 29.9542C75.3983 30.2622 75.3975 30.7484 75.1009 31.0556L75.1035 29.9542ZM73.0715 30.1693C72.7767 29.861 72.7776 29.3748 73.0741 29.0678L75.1008 31.0556C74.7967 31.3704 74.2958 31.38 73.98 31.0778L73.0715 30.1693Z" fill="#FF56E4" stroke="#FF56E4"/>
<path d="M75.1467 25.1479H76.4414C76.8802 25.1479 77.2361 25.5038 77.2361 25.9426C77.2361 26.3815 76.8802 26.7373 76.4414 26.7373H75.1467C74.7079 26.7373 74.3521 26.3815 74.3521 25.9426C74.3521 25.5038 74.7079 25.1479 75.1467 25.1479Z" fill="#FF56E4" stroke="#FF56E4"/>
<path d="M75.0815 20.8105L75.0815 20.8105C74.7745 20.514 74.2882 20.513 73.9799 20.8078L73.0681 21.7196C73.0681 21.7197 73.0681 21.7197 73.0681 21.7197C72.7578 22.0301 72.7579 22.5331 73.0683 22.8435L75.0815 20.8105ZM75.0815 20.8105C75.3962 21.1144 75.4058 21.6155 75.1036 21.9313L74.1916 22.8433L74.5452 23.1968L74.1916 22.8433C74.0425 22.9924 73.8405 23.0762 73.6299 23.0762C73.4195 23.0762 73.2175 22.9925 73.0683 22.8435L75.0815 20.8105Z" fill="#FF56E4" stroke="#FF56E4"/>
<path d="M69.1733 19.4695C69.1733 19.0306 69.5292 18.6748 69.968 18.6748C70.4069 18.6748 70.7627 19.0306 70.7627 19.4695V20.7642C70.7627 21.203 70.4069 21.5588 69.968 21.5588C69.5292 21.5588 69.1733 21.203 69.1733 20.7642V19.4695Z" fill="#FF56E4" stroke="#FF56E4"/>
<path d="M65.9543 20.8079C65.6384 20.5057 65.1375 20.5152 64.8334 20.8299L65.9543 20.8079ZM65.9543 20.8079L66.8628 21.7163C67.1576 22.0244 67.1568 22.5105 66.8601 22.8178L65.9543 20.8079ZM64.8308 21.9314C64.536 21.6232 64.5369 21.1369 64.8334 20.83L64.8308 21.9314ZM64.8308 21.9314L65.7392 22.8399C66.055 23.1421 66.556 23.1326 66.8601 22.8178L64.8308 21.9314Z" fill="#FF56E4" stroke="#FF56E4"/>
<path d="M13.1 13.4396L12.4527 9.65522L13.1 13.4396ZM13.1 13.4396C13.1481 13.7202 13.1024 14.0087 12.9699 14.2607L13.1 13.4396ZM10.5022 8.63451L10.5022 8.63457C10.3151 8.81676 10.2296 9.07936 10.2734 9.33705L10.5943 11.2071L10.766 12.2074L9.86829 11.7339L8.19248 10.8501C8.19237 10.85 8.19226 10.85 8.19216 10.8499C7.96086 10.7286 7.6846 10.7287 7.45334 10.8501L7.45317 10.8502L5.77009 11.7332L4.8738 12.2034L5.04501 11.2058L5.36609 9.33501L5.36627 9.33396C5.41078 9.07794 5.32715 8.81624 5.14249 8.63346C5.14213 8.63311 5.14178 8.63276 5.14143 8.63241L3.78304 7.31023L3.0565 6.60304L4.05983 6.45714L5.93841 6.18396L5.93859 6.18393C6.19729 6.14641 6.42101 5.98392 6.53675 5.74956C6.53677 5.74951 6.5368 5.74947 6.53682 5.74942C6.53683 5.74939 6.53685 5.74935 6.53687 5.74932L7.37441 4.04965L7.82256 3.14017L8.27128 4.04937L9.11023 5.74929L9.11025 5.74932C9.22582 5.98354 9.44904 6.146 9.70746 6.18397L10.5022 8.63451ZM10.5022 8.63451L11.8617 7.31006L12.5873 6.60304L11.5847 6.45714L9.70787 6.18403L10.5022 8.63451ZM15.0521 5.80295L15.0522 5.80344C15.1461 6.09072 15.0689 6.4062 14.8531 6.61765C14.853 6.61774 14.8529 6.61783 14.8528 6.61792L12.1037 9.29714L11.9155 9.48053L11.9598 9.73952L12.6072 13.5239L12.6072 13.524C12.6367 13.6964 12.6087 13.8734 12.5274 14.0279L12.5273 14.028C12.3231 14.4165 11.8427 14.5658 11.4541 14.3616L8.05557 12.5749L7.82257 12.4524L7.58972 12.5752L4.19119 14.367L4.19083 14.3672C4.03457 14.4498 3.85538 14.4779 3.68125 14.4472C3.24911 14.3709 2.9606 13.9587 3.03691 13.5265L3.03735 13.5239L3.68469 9.73952L3.72898 9.4806L3.54091 9.29722L0.792659 6.61758C0.792623 6.61755 0.792588 6.61751 0.792552 6.61748C0.66763 6.49539 0.586459 6.33565 0.561546 6.16285L0.561538 6.16279C0.498846 5.72832 0.800185 5.32536 1.2345 5.26269L1.23508 5.2626L5.03495 4.70978L5.29477 4.67198L5.41116 4.43663L7.10466 1.01229C7.17706 0.894471 7.27721 0.796151 7.39653 0.725913L7.39662 0.72586C7.79522 0.491105 8.3074 0.619606 8.54873 1.01197L10.2343 4.43582L10.3505 4.67189L10.6109 4.70978L14.4107 5.2626L14.4108 5.2626C14.7099 5.30613 14.9585 5.51558 15.0521 5.80295Z" fill="#FF56E4" stroke="#FF56E4"/>
<path d="M72.9407 65.2225L73.0891 65.4452H73.2187C77.0352 67.8697 78.3052 72.8623 76.0885 76.8217L76.0883 76.8216L76.0819 76.8339C76.0757 76.8457 76.0688 76.858 76.0611 76.8712C75.8371 77.2484 75.3497 77.3728 74.9723 77.1489C74.5949 76.925 74.4704 76.4375 74.6943 76.06L74.6944 76.06L74.6985 76.0528C75.9979 73.7764 75.879 70.957 74.3926 68.7981L73.5078 67.5131L73.4808 69.073C73.4621 70.1511 73.1949 71.2103 72.7001 72.1681C71.4385 74.4191 68.5918 75.2241 66.338 73.9656C64.0844 72.7073 63.2758 69.8623 64.5294 67.6074C65.5917 65.8608 67.3521 64.6535 69.3644 64.2915L70.237 64.1345L69.6512 63.469C67.0119 60.4709 63.4235 58.4697 59.4859 57.7999C59.0721 57.7179 58.7941 57.3265 58.8538 56.9082L58.8538 56.9082C58.9155 56.4756 59.3149 56.1743 59.7473 56.233C64.9146 57.1041 69.4945 60.0667 72.4075 64.4228C72.4076 64.4229 72.4076 64.4229 72.4076 64.423L72.9407 65.2225ZM65.912 68.3955L65.9109 68.3976C65.0864 69.8914 65.6292 71.7706 67.1228 72.5951C68.6162 73.4194 70.495 72.8772 71.3198 71.3841C71.7679 70.5805 71.9577 69.4694 71.9002 68.4885C71.8712 67.9929 71.7779 67.5037 71.6043 67.0837C71.4324 66.6678 71.1634 66.2772 70.7572 66.0505L70.7573 66.0504L70.7458 66.0443C70.4708 65.9001 70.1633 65.8287 69.8526 65.8371L69.8266 65.8378L69.8009 65.8412C68.1978 66.0526 66.7763 66.9777 65.9335 68.3576L65.9284 68.3659L65.9237 68.3745L65.9167 68.3871L65.912 68.3955Z" fill="#FF56E4" stroke="#FF56E4"/>
</svg>
