<svg width="66" height="80" viewBox="0 0 66 80" fill="none" xmlns="http://www.w3.org/2000/svg">
<path d="M30.9556 47.2374L17.4714 79.7925L14.2495 73.9416L23.1768 41.5874L30.9556 47.2374Z" fill="#85A627"/>
<path d="M15.5238 35.5127L0.154785 72.6198L11.6811 69.2797L14.2493 73.9414L26.6607 43.9734L15.5238 35.5127Z" fill="#85A627"/>
<path d="M34.6133 47.2374L48.0975 79.7925L51.3194 73.9416L42.3921 41.5874L34.6133 47.2374Z" fill="#85A627"/>
<path d="M50.0451 35.5127L38.9082 43.9734L51.3196 73.9414L53.8879 69.2797L65.4141 72.6198L50.0451 35.5127Z" fill="#85A627"/>
<path d="M32.7843 0.677734L24.0903 25.6499L32.7843 50.6221C46.576 50.6221 57.7564 39.4417 57.7564 25.6499C57.7564 11.858 46.576 0.677734 32.7843 0.677734Z" fill="#85A627"/>
<path d="M7.8125 25.6499C7.8125 39.4416 18.9928 50.6221 32.7847 50.6221V0.677734C18.993 0.677734 7.8125 11.858 7.8125 25.6499Z" fill="#85A627"/>
<path d="M32.7852 5.89453V45.4064C43.6785 45.4064 52.5412 36.5439 52.5412 25.6504C52.5412 14.7569 43.6785 5.89453 32.7852 5.89453Z" fill="white"/>
<path d="M32.7843 5.89453C21.891 5.89453 13.0283 14.757 13.0283 25.6506C13.0283 36.5441 21.891 45.4066 32.7843 45.4066C41.76 45.4066 49.0627 36.5441 49.0627 25.6506C49.0627 14.757 41.76 5.89453 32.7843 5.89453Z" fill="white"/>
<path d="M32.7844 11.1104L37.1967 19.5767L46.6123 21.1569L39.9238 27.9696L41.3304 37.4123L32.7844 33.1565L24.2383 37.4123L25.6449 27.9696L18.9565 21.1569L28.3721 19.5767L32.7844 11.1104Z" fill="#85A627"/>
</svg>
