<svg width="101" height="81" viewBox="0 0 101 81" fill="none" xmlns="http://www.w3.org/2000/svg">
<path d="M99.4445 29.0551C99.075 28.7284 97.7255 27.7806 95.8834 29.3871C91.9742 32.7983 88.9432 32.734 87.9043 32.5787C94.5553 21.0278 93.736 20.2995 92.6328 19.3463C92.258 19.025 90.9031 18.0986 89.061 19.6944C85.4195 22.87 82.651 21.7561 81.7031 21.1885L89.8375 7.58655C90.389 6.67619 90.2016 5.49807 89.4091 4.7912C88.6058 4.08433 87.417 4.04684 86.5869 4.70016C85.6712 5.40168 83.1436 6.5798 76.4069 6.5798C61.3806 6.5798 38.0753 0.807019 37.8396 0.748113C36.9453 0.523199 36.0136 0.876635 35.4834 1.6317C2.52289 48.8475 -0.170713 55.1932 0.161302 57.0193C0.161302 57.0247 0.161302 57.03 0.161302 57.03C-0.0796771 57.9243 0.263048 58.8347 0.953853 59.3648C0.75036 60.4144 1.29122 61.4854 2.32475 61.8603C44.7852 77.3418 60.2346 80.5388 66.0663 80.5388C69.0116 80.5388 69.5096 79.7249 69.7881 79.259C102.17 31.4649 101.26 30.6616 99.4445 29.0551ZM86.5173 25.9759C81.8852 34.2763 71.6409 50.8449 62.0071 65.9141C60.6362 66.3639 51.7736 67.9865 9.6987 57.2389C11.2892 57.0621 12.9867 56.9443 14.8449 56.9443C31.6974 56.9443 53.7496 64.0987 53.9691 64.1737C54.1994 64.254 54.435 64.2862 54.6653 64.2862C55.4257 64.2862 56.154 63.8845 56.561 63.2044L79.4165 24.9959C81.0123 25.9438 83.5399 26.6988 86.5173 25.9759ZM38.2466 5.41774C43.7356 6.71903 62.8907 11.0192 76.3962 11.0192C78.8703 11.0192 81.023 10.8746 82.8812 10.5854L53.6586 59.4291C48.0571 57.7101 29.8338 52.5157 14.8449 52.5157C11.664 52.5157 8.79905 52.7567 6.28216 53.2333C11.6105 44.1778 27.3919 20.9957 38.2466 5.41774ZM66.5589 76.1262C66.5215 76.1316 66.484 76.1316 66.4572 76.1423C65.6432 76.1691 63.6404 76.1102 59.2814 75.2212C53.8942 74.1181 44.405 71.6387 28.072 66.1819C40.0192 68.8005 50.9542 70.6641 57.9426 70.6641C61.8947 70.6641 64.5829 70.075 65.4879 68.688L65.4933 68.6934C75.0146 53.8009 81.4032 43.5566 85.6284 36.4504C85.773 36.5415 85.9068 36.6539 86.0782 36.7128C86.2389 36.7717 88.82 37.6232 92.5632 36.3915C86.86 45.7522 74.9396 63.7346 66.5589 76.1262Z" fill="#2AAA60"/>
<path d="M57.6863 27.2236C57.5578 27.0469 56.7492 25.9813 54.2269 25.0173L53.0327 24.5247C51.0567 23.7535 49.7179 23.4108 49.6644 23.4001C49.568 23.3787 49.4609 23.3626 49.3538 23.3573C49.2735 23.3573 48.995 23.3412 48.7915 23.2877C48.2935 23.1484 47.4206 23.1431 47.26 23.1431C47.0618 23.1431 42.269 23.2287 39.72 25.0548C39.4951 25.1994 38.4509 25.9866 37.819 28.2732C37.7011 28.2893 37.578 28.3161 37.4655 28.3589C36.6837 28.632 36.507 29.5049 36.4641 30.019C36.3409 30.4635 36.4909 30.7848 36.689 31.0043C35.8965 33.639 38.4883 36.7235 42.1405 37.4197C46.3978 38.2283 51.8011 36.4558 53.9538 34.2923C54.3608 34.1852 54.8213 33.9817 55.2176 33.5908C55.7424 33.1678 56.551 32.4127 56.2297 31.9254C56.2083 31.904 56.1976 31.8772 56.1655 31.8504C57.2847 30.9615 59.1643 29.0551 57.6863 27.2236ZM54.4144 31.6416C54.2376 31.7701 54.2055 31.9415 54.3394 32.086C54.409 32.1664 54.5107 32.2253 54.6339 32.2735C54.5215 32.4716 54.1894 32.8197 53.8253 33.1035C53.8092 33.1142 53.7878 33.1303 53.7771 33.1464C53.5736 33.3606 53.3326 33.4944 53.0916 33.5373C52.8882 33.5694 52.7114 33.6444 52.6204 33.7461C50.9335 35.5829 46.1033 37.2644 42.6385 36.6057C39.7254 36.0542 37.5619 33.2481 38.3545 31.0418C38.3973 30.924 38.3491 30.8062 38.2152 30.7044C38.0706 30.592 38.0224 30.3938 38.0867 30.1582C38.0921 30.1422 38.0974 30.1261 38.0974 30.11C38.1188 29.778 38.2206 29.4246 38.333 29.2157C38.4937 29.2371 38.649 29.2371 38.8043 29.2104C39.0935 29.1622 39.2916 29.0283 39.3291 28.8676C39.8967 26.3561 40.9892 25.6278 40.9892 25.6278C41.0052 25.6171 41.0159 25.6118 41.0374 25.601C43.1205 24.0909 47.3349 24.0159 47.3617 24.0159C47.5545 24.0159 47.9186 24.0267 48.0954 24.0588C48.4434 24.1552 48.8933 24.2034 49.1289 24.2141C49.493 24.3158 50.5962 24.6371 52.0849 25.2155L53.2737 25.7135C55.5282 26.5703 56.1494 27.4914 56.1494 27.4967C56.1601 27.5075 56.1708 27.5235 56.1815 27.5342C57.5631 29.2104 55.1694 31.1007 54.4144 31.6416Z" fill="#2AAA60"/>
<path d="M16.6665 44.9811C22.6696 47.9425 33.4708 50.3255 33.4708 50.3255C34.0598 50.4379 34.6221 50.5343 35.179 50.62V50.6468C35.179 50.6468 46.3337 52.4514 54.3127 52.1408C54.3127 52.1408 55.3837 52.2105 56.1495 51.0163C56.1495 51.0163 58.977 45.6987 57.3705 42.7534C57.3705 42.7534 56.8832 41.9715 55.0678 41.1683C55.0678 41.1683 54.9179 41.104 54.6769 41.0076C53.1186 40.2097 51.5549 39.5939 51.5549 39.5939C51.2175 39.4493 50.939 39.3208 50.682 39.1976C49.6431 38.6407 48.8131 37.6982 48.8131 37.6982C39.8861 41.3182 36.7481 35.3955 36.7481 35.3955C35.6021 36.2309 28.0139 36.0113 28.0139 36.0113C25.7059 36.0328 24.4582 36.4879 24.4582 36.4879C19.9867 38.2712 16.4416 43.4549 16.4416 43.4549C15.7562 44.6705 16.6665 44.9811 16.6665 44.9811Z" fill="#2AAA60"/>
<path d="M48.4795 37.8164C48.5919 37.7789 48.6991 37.7468 48.8115 37.7039C48.8115 37.6664 48.8222 37.645 48.8222 37.645C48.6991 37.7093 48.5919 37.7521 48.4795 37.8164Z" fill="#2AAA60"/>
<path d="M36.7841 35.3633L36.7412 35.4008L36.7841 35.3793V35.3633Z" fill="#2AAA60"/>
<path d="M35.7834 15.2553C36.1904 15.3142 36.5706 15.2928 36.924 15.1911C37.2828 15.0947 37.572 14.918 37.7915 14.6663L39.1892 12.9901C39.6176 12.4707 40.0782 12.0958 40.5922 11.8549C41.0903 11.6139 41.7811 11.555 42.6379 11.6781C43.0663 11.737 43.3394 11.8334 43.4465 11.9727C43.559 12.1119 43.559 12.2672 43.4519 12.4493C43.3555 12.626 43.1787 12.8723 42.9163 13.1829L41.2777 15.1482C41.0528 15.4106 41.0207 15.6195 41.1545 15.7855C41.2938 15.9515 41.5669 16.0639 41.9631 16.1175C42.3755 16.1764 42.7557 16.155 43.1198 16.0586C43.4679 15.9676 43.7625 15.7908 43.9874 15.5284L45.3583 13.8844C45.7974 13.3596 46.199 13.0008 46.5685 12.8241C46.8791 12.6903 47.2325 12.5939 47.6235 12.5403C48.0144 12.4868 48.3892 12.4814 48.7373 12.535C49.1657 12.5939 49.4388 12.6903 49.562 12.8295C49.6798 12.9687 49.7066 13.124 49.6156 13.29C49.5352 13.456 49.3853 13.6756 49.1604 13.938L47.4253 16.0104C47.2111 16.2674 47.179 16.4763 47.3182 16.6477C47.4682 16.8137 47.7413 16.9261 48.1375 16.985C48.5499 17.0386 48.9355 17.0279 49.2942 16.9315C49.6423 16.8351 49.9369 16.6584 50.1564 16.4013L52.1646 13.9915C52.5662 13.5096 52.7429 13.1454 52.7054 12.8884C52.6572 12.6046 52.427 12.3636 52.0146 12.1547C51.5969 11.9459 51.04 11.796 50.3171 11.6942C49.7066 11.6032 49.0908 11.5871 48.4803 11.6407C47.8698 11.6942 47.2325 11.812 46.5792 12.0048C46.4721 11.7103 46.2419 11.4693 45.8724 11.2819C45.5029 11.0891 44.9781 10.9499 44.3194 10.8535C43.6821 10.7678 43.0609 10.7464 42.429 10.7892C41.8132 10.8374 41.1599 10.9606 40.4959 11.148L40.5976 11.0302C40.7636 10.832 40.769 10.6607 40.6244 10.5107C40.4798 10.3661 40.2227 10.2644 39.864 10.2162C39.4837 10.1627 39.141 10.1841 38.809 10.2698C38.477 10.3554 38.2199 10.5161 38.0272 10.7464L35.0819 14.2807C34.8677 14.5378 34.8355 14.7466 34.9748 14.918C35.114 15.084 35.3871 15.1964 35.7834 15.2553Z" fill="#2AAA60"/>
<path d="M59.533 15.2011C59.0135 15.1851 58.3977 15.1637 57.6854 15.1369C56.9732 15.1047 56.518 15.0833 56.336 15.0833C55.4792 15.0512 54.7134 15.1262 54.0547 15.2975C53.396 15.4689 52.9248 15.7313 52.6463 16.0633C52.4375 16.315 52.3786 16.5667 52.4803 16.8184C52.5821 17.0754 52.8337 17.295 53.2407 17.4931C53.6531 17.6913 54.1939 17.8358 54.8687 17.9322C55.6077 18.0393 56.3253 18.0715 57.0107 18.0393C57.7015 18.0126 58.4673 17.9269 59.2973 17.7823C59.4044 18.05 59.5437 18.2642 59.699 18.4195C59.865 18.5748 60.0845 18.6712 60.3576 18.7141C60.6789 18.7623 61.0056 18.7462 61.3483 18.6766C61.6857 18.6123 61.916 18.5106 62.0231 18.3821C62.082 18.3124 62.1355 18.1411 62.1784 17.8626C62.2266 17.5895 62.3444 17.3325 62.5372 17.1022C62.7514 16.8559 62.9388 16.6309 63.1101 16.4328C63.2762 16.2293 63.4904 15.983 63.7313 15.6992C64.1115 15.2386 64.2883 14.8531 64.2454 14.5371C64.2026 14.2212 63.9027 13.9534 63.3404 13.7339C62.7942 13.5143 61.932 13.3215 60.7753 13.1609C59.7472 13.0163 58.8261 12.9574 58.0121 12.9895C57.2035 13.027 56.5555 13.1234 56.0468 13.284C55.5648 13.434 55.2221 13.616 55.04 13.8356C54.9222 13.9748 54.9437 14.1033 55.0829 14.2212C55.2221 14.339 55.4417 14.4193 55.7308 14.4621C56.0629 14.505 56.2931 14.5103 56.4484 14.4675C56.593 14.4247 56.8608 14.3336 57.241 14.1944C57.6319 14.0552 58.0282 13.9695 58.4459 13.9213C58.8529 13.8838 59.3991 13.9106 60.0631 14.007C60.8449 14.1194 61.2894 14.264 61.4126 14.4514C61.5304 14.6389 61.4768 14.8959 61.2305 15.2279C60.6147 15.2279 60.0524 15.2172 59.533 15.2011ZM60.4701 16.1436C60.1167 16.572 59.7311 16.8666 59.3402 17.0165C58.9921 17.1557 58.5583 17.2468 58.0335 17.295C57.4927 17.3378 56.9732 17.3271 56.4484 17.2521C55.9558 17.1825 55.6184 17.0594 55.4256 16.888C55.2328 16.7166 55.2221 16.5346 55.3774 16.3471C55.522 16.1651 55.7683 16.0419 56.1003 15.9776C56.4538 15.9134 56.7804 15.8812 57.0964 15.8866C57.4123 15.8919 57.9586 15.9134 58.7672 15.9455C59.5597 15.9723 60.1809 15.983 60.62 15.9723L60.4701 16.1436Z" fill="#2AAA60"/>
<path d="M69.8955 20.5724C69.617 20.7117 69.2421 20.7973 68.7923 20.8295C68.3478 20.867 67.7802 20.8348 67.1001 20.7384C66.7627 20.6956 66.4789 20.6367 66.254 20.5724C66.013 20.5082 65.8363 20.4332 65.6917 20.3475C65.5739 20.2618 65.4615 20.1654 65.3758 20.069C65.2901 19.9619 65.2098 19.8548 65.1348 19.7531C64.9848 19.555 64.7064 19.4264 64.3262 19.3729C64.0156 19.33 63.7157 19.3408 63.4105 19.405C63.1159 19.4693 62.9017 19.5764 62.7839 19.7263C62.6179 19.9245 62.65 20.1494 62.8749 20.3904C63.0999 20.6313 63.5229 20.8616 64.1387 21.0812C64.7546 21.3007 65.5096 21.4721 66.4147 21.6006C67.4107 21.7452 68.2836 21.8148 69.0172 21.8094C69.7669 21.8094 70.4256 21.7452 70.9932 21.606C71.5716 21.4721 72.0696 21.2686 72.5034 21.0062C72.9371 20.7331 73.3227 20.3904 73.6708 19.9834L76.6643 16.3955C76.8999 16.1116 77.0016 15.876 76.9749 15.6939C76.9374 15.5119 76.6589 15.3941 76.1662 15.3191C75.8021 15.2655 75.4647 15.287 75.1488 15.3726C74.8168 15.4583 74.5704 15.6083 74.3884 15.8171L74.2491 15.9885C74.0189 15.635 73.6868 15.3512 73.2477 15.1424C72.8193 14.9282 72.2249 14.7729 71.4698 14.6658C70.8594 14.5801 70.2435 14.548 69.6331 14.5801C69.0172 14.6122 68.4335 14.7033 67.8659 14.8478C67.2929 14.9978 66.7788 15.2066 66.3129 15.4744C65.8417 15.7421 65.4561 16.0634 65.1455 16.4329C64.7278 16.931 64.5457 17.3915 64.5832 17.8253C64.6261 18.259 64.8831 18.6232 65.3651 18.9284C65.847 19.2337 66.5325 19.4479 67.4107 19.571C68.1497 19.6781 68.8351 19.6888 69.4778 19.6299C70.1311 19.5657 70.7576 19.4264 71.3895 19.2176C71.0414 19.6246 70.7737 19.9084 70.597 20.0905C70.4203 20.2725 70.1846 20.4332 69.8955 20.5724ZM70.3346 18.7731C69.8526 18.8267 69.3974 18.8267 68.953 18.7624C68.214 18.6607 67.7213 18.4465 67.4696 18.1252C67.2233 17.8038 67.2982 17.3915 67.7213 16.8935C68.1336 16.4008 68.6799 16.0527 69.3653 15.8492C70.04 15.6404 70.7523 15.5976 71.502 15.6993C72.2785 15.8064 72.7765 16.0367 73.0175 16.3794C73.2531 16.7221 73.1621 17.1505 72.7444 17.6539C72.4766 17.9699 72.1339 18.2215 71.7055 18.4143C71.2824 18.5964 70.8219 18.7196 70.3346 18.7731Z" fill="#2AAA60"/>
</svg>
