<svg width="85" height="79" viewBox="0 0 85 79" fill="none" xmlns="http://www.w3.org/2000/svg">
<path d="M69.4443 53.1797V78.401V78.4846H84.8146V62.064L69.4443 53.1797Z" fill="#24CB8F"/>
<path d="M0.659668 78.4846H16.0299V78.401V53.1602L0.659668 62.064V78.4846Z" fill="#24CB8F"/>
<path d="M18.7446 44.5767V78.401H34.5025V64.0607C34.5025 59.563 38.1489 55.9167 42.6466 55.9167H42.8279C47.3256 55.9167 50.9719 59.563 50.9719 64.0607V78.401H66.7298V44.5767L42.7372 24.6748L18.7446 44.5767Z" fill="#24CB8F"/>
<path d="M8.12549 41.0551L12.1964 45.9953L42.7371 20.8296L73.2778 45.9953L77.3487 41.0551L44.6374 14.101V8.10295H50.5095V4.3024H44.6374V0.0493164H40.8368V4.3024H34.9647V8.10295H40.8368V14.101L8.12549 41.0551Z" fill="#24CB8F"/>
</svg>
