<svg width="144" height="121" viewBox="0 0 144 121" fill="none" xmlns="http://www.w3.org/2000/svg">
<path d="M122.346 87.6113C123.525 92.6239 120.447 97.671 115.484 98.8615C113.165 99.4179 110.844 99.0258 108.903 97.9488L102.524 112.862C107.542 115.265 113.37 116.029 119.193 114.632C132.787 111.371 141.189 97.5965 137.961 83.866C137.774 83.0715 137.548 82.2968 137.294 81.5385L121.899 86.242C122.077 86.6819 122.234 87.1351 122.346 87.6113Z" fill="#828282"/>
<path d="M121.374 85.1393L135.632 77.6718C135.042 76.5615 134.376 75.5066 133.642 74.5119L120.901 84.3907C121.07 84.6315 121.228 84.8808 121.374 85.1393Z" fill="#828282"/>
<path d="M115.224 97.7565C119.583 96.7106 122.288 92.2773 121.252 87.8737C120.217 83.4699 115.828 80.7392 111.468 81.785C107.109 82.8309 104.404 87.2639 105.44 91.6671C106.475 96.0703 110.865 98.8023 115.224 97.7565ZM112.373 85.6324C114.636 85.0895 116.906 86.5024 117.444 88.788C117.981 91.0735 116.582 93.366 114.319 93.9089C112.056 94.4518 109.786 93.0391 109.249 90.7534C108.711 88.4679 110.11 86.1752 112.373 85.6324Z" fill="#DB3F54"/>
<path d="M89.7778 99.0512C91.6441 103.904 94.877 107.923 98.9126 110.753L107.879 97.2959C106.442 96.233 105.303 94.7511 104.662 92.9749L89.7778 99.0512Z" fill="#828282"/>
<path d="M111.208 80.68C114.57 79.8735 117.944 81.0444 120.139 83.4394L130.879 71.3547C124.884 65.5436 116.185 62.8254 107.5 64.9091C94.1231 68.1181 85.7811 81.5068 88.5941 95.0167L104.323 91.8054C103.224 86.8344 106.287 81.8608 111.208 80.68Z" fill="#828282"/>
<path d="M57.704 114.404C89.1064 114.404 114.563 88.9478 114.563 57.5453C114.563 26.1429 89.1064 0.686272 57.704 0.686272C26.3016 0.686272 0.844902 26.1429 0.844902 57.5453C0.844902 88.9478 26.3016 114.404 57.704 114.404Z" fill="white"/>
<path d="M57.704 8.5289C84.7316 8.5289 106.72 30.5177 106.72 57.5453C106.72 84.573 84.7316 106.562 57.704 106.562C30.6763 106.562 8.68753 84.573 8.68753 57.5453C8.68753 30.5177 30.6763 8.5289 57.704 8.5289ZM57.704 0.686272C26.3021 0.686272 0.844902 26.1435 0.844902 57.5453C0.844902 88.9472 26.3021 114.404 57.704 114.404C89.1059 114.404 114.563 88.9472 114.563 57.5453C114.563 26.1435 89.1059 0.686272 57.704 0.686272Z" fill="#828282"/>
<path d="M57.7035 12.211C56.6212 12.211 55.7428 13.0874 55.7428 14.1717V16.1323C55.7428 17.2166 56.6212 18.093 57.7035 18.093C58.7858 18.093 59.6641 17.2166 59.6641 16.1323V14.1717C59.6641 13.0894 58.7858 12.211 57.7035 12.211Z" fill="#828282"/>
<path d="M57.7035 96.5193C56.6212 96.5193 55.7428 97.3957 55.7428 98.4799V100.441C55.7428 101.525 56.6212 102.401 57.7035 102.401C58.7858 102.401 59.6641 101.525 59.6641 100.441V98.4799C59.6641 97.3977 58.7858 96.5193 57.7035 96.5193Z" fill="#828282"/>
<path d="M100.838 55.3455H98.8772C97.7949 55.3455 96.9165 56.2219 96.9165 57.3061C96.9165 58.3904 97.7949 59.2668 98.8772 59.2668H100.838C101.92 59.2668 102.798 58.3904 102.798 57.3061C102.798 56.2219 101.92 55.3455 100.838 55.3455Z" fill="#828282"/>
<path d="M16.5298 55.3455H14.5692C13.4869 55.3455 12.6085 56.2219 12.6085 57.3061C12.6085 58.3904 13.4869 59.2668 14.5692 59.2668H16.5298C17.6121 59.2668 18.4905 58.3904 18.4905 57.3061C18.4905 56.2219 17.6121 55.3455 16.5298 55.3455Z" fill="#828282"/>
<path d="M86.8177 25.42L85.4315 26.8062C84.6649 27.5728 84.6649 28.8119 85.4315 29.5785C85.8138 29.9608 86.3157 30.153 86.8177 30.153C87.3196 30.153 87.8215 29.9608 88.2038 29.5785L89.59 28.1923C90.3566 27.4257 90.3566 26.1866 89.59 25.42C88.8234 24.6533 87.5843 24.6533 86.8177 25.42Z" fill="#828282"/>
<path d="M27.2032 85.0357L25.817 86.4219C25.0504 87.1885 25.0504 88.4277 25.817 89.1943C26.1993 89.5766 26.7013 89.7688 27.2032 89.7688C27.7051 89.7688 28.207 89.5766 28.5894 89.1943L29.9756 87.8081C30.7422 87.0415 30.7422 85.8023 29.9756 85.0357C29.2089 84.2691 27.9678 84.2691 27.2032 85.0357Z" fill="#828282"/>
<path d="M88.2038 85.0357C87.4372 84.2691 86.1981 84.2691 85.4315 85.0357C84.6649 85.8023 84.6649 87.0415 85.4315 87.8081L86.8177 89.1943C87.2 89.5766 87.7019 89.7688 88.2038 89.7688C88.7058 89.7688 89.2077 89.5766 89.59 89.1943C90.3566 88.4277 90.3566 87.1885 89.59 86.4219L88.2038 85.0357Z" fill="#828282"/>
<path d="M28.5894 25.42C27.8227 24.6533 26.5836 24.6533 25.817 25.42C25.0504 26.1866 25.0504 27.4257 25.817 28.1923L27.2032 29.5785C27.5855 29.9608 28.0874 30.153 28.5894 30.153C29.0913 30.153 29.5932 29.9608 29.9756 29.5785C30.7422 28.8119 30.7422 27.5728 29.9756 26.8062L28.5894 25.42Z" fill="#828282"/>
<path d="M51.8221 59.2688H36.1368C35.0546 59.2688 34.1762 58.3924 34.1762 57.3081C34.1762 56.2239 35.0546 55.3475 36.1368 55.3475H51.8221C52.9044 55.3475 53.7828 56.2239 53.7828 57.3081C53.7828 58.3924 52.9044 59.2688 51.8221 59.2688Z" fill="#DB3F54"/>
<path d="M57.704 53.3868C56.6217 53.3868 55.7433 52.5104 55.7433 51.4261V29.8589C55.7433 28.7747 56.6217 27.8982 57.704 27.8982C58.7863 27.8982 59.6646 28.7747 59.6646 29.8589V51.4261C59.6646 52.5084 58.7863 53.3868 57.704 53.3868Z" fill="#DB3F54"/>
<path d="M57.7041 65.1507C53.3789 65.1507 49.8615 61.6333 49.8615 57.3081C49.8615 52.9829 53.3789 49.4655 57.7041 49.4655C62.0294 49.4655 65.5468 52.9829 65.5468 57.3081C65.5468 61.6333 62.0294 65.1507 57.7041 65.1507ZM57.7041 53.3868C55.5415 53.3868 53.7828 55.1455 53.7828 57.3081C53.7828 59.4707 55.5415 61.2294 57.7041 61.2294C59.8667 61.2294 61.6255 59.4707 61.6255 57.3081C61.6255 55.1455 59.8667 53.3868 57.7041 53.3868Z" fill="#DB3F54"/>
</svg>
