<svg width="232" height="351" viewBox="0 0 232 351" fill="none" xmlns="http://www.w3.org/2000/svg">
<rect width="230" height="350" transform="translate(1.45312 0.391113)" fill="#1FBCAB"/>
<path d="M1.05 30.83C1.14333 29.6867 1.66833 28.73 2.625 27.96C5.05167 29.5467 7.39667 30.34 9.66 30.34C11.0367 30.34 12.1217 30.0367 12.915 29.43C13.7317 28.8233 14.14 28.03 14.14 27.05C14.14 25.44 13.0783 24.18 10.955 23.27L6.825 21.485C3.62833 20.1083 2.03 18.09 2.03 15.43C2.03 14.4733 2.22833 13.5867 2.625 12.77C3.02167 11.93 3.57 11.195 4.27 10.565C4.97 9.935 5.81 9.45667 6.79 9.13C7.79333 8.80333 8.89 8.64 10.08 8.64C12.53 8.64 14.9567 9.24667 17.36 10.46C17.3367 11.58 16.8817 12.5483 15.995 13.365C13.755 12.2683 11.76 11.72 10.01 11.72C8.75 11.72 7.735 12.035 6.965 12.665C6.195 13.2717 5.81 13.995 5.81 14.835C5.81 15.6983 6.04333 16.375 6.51 16.865C7 17.3317 7.735 17.7633 8.715 18.16L12.775 19.91C14.525 20.6567 15.8317 21.5667 16.695 22.64C17.5817 23.69 18.025 24.95 18.025 26.42C18.025 28.52 17.29 30.2233 15.82 31.53C14.3733 32.8133 12.1683 33.455 9.205 33.455C6.24167 33.455 3.52333 32.58 1.05 30.83ZM34.9882 25.51H24.6982C24.7682 27.12 25.1066 28.3567 25.7132 29.22C26.3432 30.0833 27.3932 30.515 28.8632 30.515C29.5632 30.515 30.3099 30.41 31.1032 30.2C31.9199 29.99 32.7599 29.6517 33.6232 29.185C34.2066 29.7217 34.5916 30.4917 34.7782 31.495C32.9116 32.8017 30.7182 33.455 28.1982 33.455C26.8682 33.455 25.7482 33.2217 24.8382 32.755C23.9282 32.2883 23.1816 31.6467 22.5982 30.83C22.0382 30.0133 21.6299 29.045 21.3732 27.925C21.1166 26.7817 20.9882 25.5567 20.9882 24.25C20.9882 22.9667 21.1516 21.7767 21.4782 20.68C21.8049 19.56 22.2716 18.6033 22.8782 17.81C23.4849 17.0167 24.2316 16.3983 25.1182 15.955C26.0282 15.4883 27.0432 15.255 28.1632 15.255C29.2832 15.255 30.2749 15.4417 31.1382 15.815C32.0249 16.1883 32.7716 16.7133 33.3782 17.39C33.9849 18.0433 34.4399 18.8367 34.7432 19.77C35.0699 20.68 35.2332 21.6717 35.2332 22.745C35.2332 23.2117 35.2099 23.6783 35.1632 24.145C35.1399 24.5883 35.0816 25.0433 34.9882 25.51ZM28.2682 17.95C26.0516 17.95 24.8616 19.595 24.6982 22.885H31.7682V22.43C31.7682 21.1 31.4766 20.0267 30.8932 19.21C30.3332 18.37 29.4582 17.95 28.2682 17.95ZM38.6982 17.39C38.9316 16.5267 39.3749 15.885 40.0282 15.465C41.6382 15.815 42.6999 16.8533 43.2132 18.58C44.1466 16.5033 45.6749 15.465 47.7982 15.465C48.3582 15.465 48.9766 15.535 49.6532 15.675C49.6532 17.0283 49.3616 18.1717 48.7782 19.105C48.5682 19.035 48.0899 18.9767 47.3432 18.93C45.7566 18.93 44.5082 19.8167 43.5982 21.59V33C43.1549 33.0933 42.5482 33.14 41.7782 33.14C41.0316 33.14 40.4366 33.0933 39.9932 33V20.995C39.9932 19.4083 39.5616 18.2067 38.6982 17.39ZM56.9324 18.72V33C56.4891 33.0933 55.8824 33.14 55.1124 33.14C54.3658 33.14 53.7708 33.0933 53.3274 33V20.19C53.3274 19.5367 53.2108 19.07 52.9774 18.79C52.7441 18.51 52.3474 18.37 51.7874 18.37H51.4024C51.2858 17.8567 51.2274 17.425 51.2274 17.075C51.2274 16.725 51.2858 16.2817 51.4024 15.745C52.1724 15.6517 52.9074 15.605 53.6074 15.605H54.0974C54.9841 15.605 55.6724 15.885 56.1624 16.445C56.6758 17.005 56.9324 17.7633 56.9324 18.72ZM52.5574 12.455C52.3474 12.035 52.2424 11.5217 52.2424 10.915C52.2424 9.95833 52.4174 9.39833 52.7674 9.235C53.1174 9.04833 53.7008 8.94333 54.5174 8.92C55.4508 8.94333 56.0458 9.06 56.3024 9.27C56.5591 9.48 56.6991 10.0283 56.7224 10.915C56.6991 11.755 56.5591 12.2917 56.3024 12.525C56.0458 12.7583 55.4508 12.8867 54.5174 12.91C53.6074 12.91 52.9541 12.7583 52.5574 12.455ZM75.457 25.51H65.167C65.237 27.12 65.5753 28.3567 66.182 29.22C66.812 30.0833 67.862 30.515 69.332 30.515C70.032 30.515 70.7787 30.41 71.572 30.2C72.3887 29.99 73.2287 29.6517 74.092 29.185C74.6753 29.7217 75.0603 30.4917 75.247 31.495C73.3803 32.8017 71.187 33.455 68.667 33.455C67.337 33.455 66.217 33.2217 65.307 32.755C64.397 32.2883 63.6503 31.6467 63.067 30.83C62.507 30.0133 62.0987 29.045 61.842 27.925C61.5853 26.7817 61.457 25.5567 61.457 24.25C61.457 22.9667 61.6203 21.7767 61.947 20.68C62.2737 19.56 62.7403 18.6033 63.347 17.81C63.9537 17.0167 64.7003 16.3983 65.587 15.955C66.497 15.4883 67.512 15.255 68.632 15.255C69.752 15.255 70.7437 15.4417 71.607 15.815C72.4937 16.1883 73.2403 16.7133 73.847 17.39C74.4537 18.0433 74.9087 18.8367 75.212 19.77C75.5387 20.68 75.702 21.6717 75.702 22.745C75.702 23.2117 75.6787 23.6783 75.632 24.145C75.6087 24.5883 75.5503 25.0433 75.457 25.51ZM68.737 17.95C66.5203 17.95 65.3303 19.595 65.167 22.885H72.237V22.43C72.237 21.1 71.9453 20.0267 71.362 19.21C70.802 18.37 69.927 17.95 68.737 17.95ZM78.502 31.705C78.5253 31.3083 78.6537 30.865 78.887 30.375C79.1203 29.8617 79.3887 29.465 79.692 29.185C81.5587 30.2117 83.0753 30.725 84.242 30.725C85.432 30.725 86.307 30.5267 86.867 30.13C87.4503 29.7333 87.742 29.2083 87.742 28.555C87.742 27.5283 87.007 26.735 85.537 26.175L83.577 25.44C80.6137 24.32 79.132 22.6517 79.132 20.435C79.132 18.825 79.7037 17.565 80.847 16.655C82.0137 15.7217 83.5303 15.255 85.397 15.255C87.287 15.255 89.1653 15.675 91.032 16.515C91.032 16.9817 90.927 17.4717 90.717 17.985C90.5303 18.4983 90.2737 18.895 89.947 19.175C88.2903 18.405 86.7387 18.02 85.292 18.02C84.522 18.02 83.9037 18.2067 83.437 18.58C82.9937 18.9533 82.772 19.42 82.772 19.98C82.772 20.54 82.9353 20.9717 83.262 21.275C83.612 21.5783 84.172 21.8817 84.942 22.185L87.042 22.99C90.0053 24.1333 91.487 25.8833 91.487 28.24C91.487 29.85 90.8687 31.1217 89.632 32.055C88.3953 32.9883 86.7153 33.455 84.592 33.455C82.4687 33.455 80.4387 32.8717 78.502 31.705Z" transform="translate(69.2969 74.269)" fill="white"/>
<path d="M73.8199 26.0996C73.4892 26.0996 73.1622 26.1154 72.8397 26.1453V13.6568C72.8397 6.12643 66.2457 0 58.1407 0H25.477C17.3723 0 10.7787 6.12643 10.7787 13.6568V26.1453C10.4561 26.1154 10.1295 26.0996 9.79878 26.0996C4.39588 26.0996 0 30.1835 0 35.2036C0 38.3356 1.70014 41.2094 4.54809 42.8919L4.71419 42.9897C6.67597 44.1483 7.48423 44.6432 7.79682 45.2723C8.17229 46.0289 8.17033 47.5055 8.16657 50.1858L8.16592 67.0683C8.16592 69.5779 10.3637 71.6196 13.0651 71.6202V73.1382C13.0651 75.6481 15.2629 77.69 17.9644 77.69C20.6661 77.69 22.8642 75.6481 22.8642 73.1382V71.6202H60.7544V73.1382C60.7544 75.6481 62.9525 77.69 65.6543 77.69C68.3561 77.69 70.5539 75.6481 70.5539 73.1382V71.6202C73.2553 71.6196 75.4524 69.5779 75.4524 67.0683V58.0008C75.4528 57.9883 75.4531 57.9762 75.4531 57.9637L75.4521 50.1856C75.4484 47.5053 75.4464 46.0288 75.8219 45.2725C76.1345 44.6432 76.9431 44.1481 78.9048 42.9899L79.0711 42.8916C81.9189 41.2094 83.619 38.3353 83.619 35.2036C83.619 30.1835 79.2231 26.0996 73.8199 26.0996ZM14.0451 13.6568C14.0451 7.79965 19.1733 3.03477 25.477 3.03477H58.1407C64.4448 3.03477 69.5733 7.79965 69.5733 13.6568V27C66.2909 28.4735 64.0211 31.6001 64.0211 35.2179V38.9028C56.7876 37.0334 49.3266 36.0835 41.8092 36.0835C34.2921 36.0835 26.8311 37.0334 19.5976 38.9028V35.2338C19.5979 35.2238 19.5979 35.2136 19.5979 35.2036C19.5979 31.596 17.3278 28.472 14.0451 26.9994V13.6568ZM64.0211 42.0561V48.8597C64.0211 49.6964 63.2885 50.3771 62.388 50.3771H21.2311C20.3302 50.3771 19.5976 49.6964 19.5976 48.8597V42.0564C26.819 40.1075 34.2848 39.1183 41.8092 39.1183C49.3339 39.1183 56.8 40.1076 64.0211 42.0561ZM19.5979 73.1382C19.5979 73.9749 18.8652 74.6553 17.9644 74.6553C17.0638 74.6553 16.3315 73.9749 16.3315 73.1382V71.6202H19.5979V73.1382ZM67.2875 73.1382C67.2875 73.9749 66.5549 74.6553 65.6543 74.6553C64.7535 74.6553 64.0208 73.9749 64.0208 73.1382V71.6202H67.2875V73.1382ZM77.3185 40.3307L77.1529 40.4286C74.8514 41.7874 73.5836 42.536 72.8558 44.0012C72.1789 45.3644 72.1812 46.977 72.1856 50.1896L72.1866 57.9267C72.1862 57.9388 72.1859 57.9513 72.1859 57.9637V67.0683C72.1859 67.905 71.4533 68.5854 70.5527 68.5854H68.9205H62.3876H21.2311H14.6983H13.0661C12.1653 68.5854 11.4323 67.905 11.4323 67.0683L11.432 57.9637L11.4329 50.1896C11.4374 46.977 11.4396 45.3644 10.7627 44.0012C10.0351 42.536 8.76742 41.7874 6.46594 40.4286L6.30033 40.3307C4.40061 39.2084 3.26637 37.2918 3.26637 35.2036C3.26637 31.857 6.19679 29.1344 9.79878 29.1344C13.3955 29.1344 16.3225 31.8488 16.3315 35.1881C16.3315 35.1978 16.3312 35.208 16.3312 35.2177V40.9103C16.3312 40.9156 16.3312 40.9206 16.3312 40.9261V48.8597C16.3312 51.3696 18.5293 53.4119 21.2311 53.4119H62.388C65.0894 53.4119 67.2875 51.3696 67.2875 48.8597V40.9326C67.2875 40.9234 67.2875 40.914 67.2875 40.9047V35.2036C67.2875 31.857 70.2179 29.1344 73.8199 29.1344C77.4219 29.1344 80.3527 31.857 80.3527 35.2036C80.3527 37.2918 79.2184 39.2084 77.3185 40.3307Z" transform="translate(74.6445 207.989)" fill="white"/>
<path d="M1.71076 0H1.63318C0.73134 0 0 0.679333 0 1.51738C0 2.35528 0.73134 3.03477 1.63318 3.03477H1.71076C2.61277 3.03477 3.34395 2.35528 3.34395 1.51738C3.34395 0.679333 2.61293 0 1.71076 0Z" transform="translate(119.629 270.506)" fill="white"/>
<path d="M12.5758 0H1.63318C0.731177 0 0 0.679333 0 1.51738C0 2.35528 0.731177 3.03477 1.63318 3.03477H12.5758C13.4775 3.03477 14.209 2.35528 14.209 1.51738C14.209 0.679333 13.4775 0 12.5758 0Z" transform="translate(124.457 270.506)" fill="white"/>
<path d="M12.5762 0H1.63318C0.731503 0 0 0.679636 0 1.51738C0 2.35543 0.731503 3.03477 1.63318 3.03477H12.5762C13.4779 3.03477 14.2094 2.35543 14.2094 1.51738C14.2094 0.679636 13.4779 0 12.5762 0Z" transform="translate(98.4883 214.059)" fill="white"/>
<path d="M1.71076 0H1.63318C0.731503 0 0 0.679636 0 1.51738C0 2.35543 0.731503 3.03477 1.63318 3.03477H1.71076C2.61261 3.03477 3.34394 2.35543 3.34394 1.51738C3.34394 0.679636 2.61261 0 1.71076 0Z" transform="translate(114.182 214.059)" fill="white"/>
<path d="M9 0L16.7942 9.11894L1.20577 9.11894L9 0Z" transform="translate(164.055 121.278) rotate(-180)" fill="#013162"/>
<rect width="230" height="40" transform="translate(1.45312 1.23438)" fill="#262626" fill-opacity="0.14"/>
<line y1="-0.75" x2="230" y2="-0.75" transform="translate(0.851562 135.339)" stroke="#262626" stroke-opacity="0.14" stroke-width="1.5"/>
<rect width="44.6841" height="12.5814" transform="translate(93.9805 246.336)" fill="white"/>
</svg>
