<svg width="239" height="290" viewBox="0 0 239 290" fill="none" xmlns="http://www.w3.org/2000/svg">
<g filter="url(#filter0_d)">
<path d="M0.248047 1.10291H230.248V281.103H0.248047V1.10291Z" fill="white"/>
<path d="M0.748047 1.60291H229.748V280.603H0.748047V1.60291Z" stroke="#828282" stroke-opacity="0.5"/>
</g>
<path d="M0.248047 1.47325L229.288 0.903442V35.9034H0.248047V1.47325Z" fill="#4A4A4A"/>
<g filter="url(#filter1_d)">
<path d="M197.817 35.8998L198.006 0.903406L229.26 35.8998L197.817 35.8998Z" fill="white" fill-opacity="0.8"/>
</g>
<path d="M191.272 279.651L138.513 223.686C138.513 223.686 161.577 227.485 170.129 218.62C178.604 209.834 178.458 189.651 178.458 189.651L229.026 243.824V279.651H191.272Z" fill="#E0E0E0"/>
<path d="M167.028 203.205C168.239 208.356 165.076 213.542 159.977 214.765C157.594 215.337 155.209 214.934 153.215 213.827L146.661 229.15C151.817 231.619 157.805 232.404 163.788 230.969C177.755 227.618 186.389 213.465 183.072 199.357C182.88 198.541 182.648 197.745 182.386 196.966L166.569 201.798C166.752 202.25 166.913 202.716 167.028 203.205Z" fill="#1FBCAB"/>
<path d="M166.029 200.665L180.679 192.993C180.073 191.852 179.389 190.768 178.634 189.746L165.543 199.896C165.716 200.144 165.879 200.4 166.029 200.665Z" fill="#1FBCAB"/>
<path d="M159.71 213.629C164.19 212.555 166.968 208 165.904 203.475C164.84 198.95 160.33 196.144 155.851 197.219C151.372 198.294 148.593 202.849 149.657 207.373C150.721 211.897 155.231 214.704 159.71 213.629ZM156.781 201.172C159.106 200.614 161.439 202.066 161.991 204.414C162.543 206.763 161.106 209.118 158.781 209.676C156.456 210.234 154.123 208.782 153.571 206.434C153.018 204.086 154.456 201.73 156.781 201.172Z" fill="#1FBCAB"/>
<path d="M133.565 214.96C135.483 219.945 138.804 224.076 142.951 226.984L152.164 213.156C150.687 212.064 149.517 210.541 148.858 208.716L133.565 214.96Z" fill="#1FBCAB"/>
<path d="M155.584 196.084C159.038 195.255 162.505 196.458 164.761 198.919L175.796 186.502C169.636 180.531 160.698 177.738 151.773 179.879C138.029 183.176 129.458 196.933 132.348 210.814L148.51 207.515C147.38 202.407 150.527 197.297 155.584 196.084Z" fill="#1FBCAB"/>
<path d="M34.7205 100.387C34.7205 100.937 34.6372 101.462 34.4705 101.962C34.3205 102.446 34.1038 102.887 33.8205 103.287C33.5372 103.671 33.2038 104.012 32.8205 104.312C32.4538 104.596 32.0455 104.812 31.5955 104.963C32.0288 105.112 32.3872 105.371 32.6705 105.737C32.9705 106.104 33.2288 106.579 33.4455 107.162L34.3705 109.687C34.5205 110.104 34.6872 110.462 34.8705 110.762C35.0538 111.062 35.2788 111.312 35.5455 111.512C35.3288 111.812 35.0122 112.054 34.5955 112.237C34.1955 112.421 33.7372 112.513 33.2205 112.513C32.7205 112.513 32.3205 112.363 32.0205 112.062C31.7205 111.762 31.4455 111.254 31.1955 110.537L30.1455 107.562C29.9288 106.979 29.6538 106.537 29.3205 106.237C28.9872 105.921 28.4872 105.762 27.8205 105.762H26.2955V112.312C26.0622 112.346 25.8038 112.371 25.5205 112.388C25.2372 112.421 24.9288 112.438 24.5955 112.438C23.9788 112.438 23.4372 112.396 22.9705 112.312V95.3625L23.1455 95.2125C24.4955 95.1792 25.6372 95.1542 26.5705 95.1375C27.5205 95.1208 28.2788 95.1125 28.8455 95.1125C30.6455 95.1125 32.0705 95.5625 33.1205 96.4625C34.1872 97.3625 34.7205 98.6708 34.7205 100.387ZM26.2955 97.6625V103.162C27.1622 103.112 27.9288 103.087 28.5955 103.087C30.3788 103.087 31.2705 102.187 31.2705 100.387C31.2705 98.5875 30.3788 97.6875 28.5955 97.6875C28.0788 97.6875 27.6288 97.6875 27.2455 97.6875C26.8788 97.6875 26.5622 97.6792 26.2955 97.6625ZM41.4805 108.037L41.4555 109.587L43.2055 109.537H49.3305C49.3305 110.071 49.3055 110.479 49.2555 110.762C49.0721 111.829 48.3555 112.363 47.1055 112.363H40.0805C39.4805 112.363 39.0055 112.187 38.6555 111.837C38.3221 111.471 38.1555 110.979 38.1555 110.362V95.4125L38.3305 95.2375H48.7555C48.8388 95.6542 48.8805 96.1042 48.8805 96.5875C48.8805 97.0542 48.7888 97.5458 48.6055 98.0625H41.4555L41.4805 99.7875V102.362L43.1055 102.337H47.3305C47.4638 102.721 47.5305 103.179 47.5305 103.712C47.5305 104.246 47.4638 104.704 47.3305 105.087H41.4805V108.037ZM58.793 102.962L62.668 102.937C64.2013 102.937 64.968 103.646 64.968 105.062V111.612C62.9846 112.312 60.8096 112.663 58.443 112.663C57.243 112.663 56.1846 112.454 55.268 112.037C54.368 111.621 53.618 111.029 53.018 110.262C52.418 109.496 51.968 108.571 51.668 107.487C51.368 106.404 51.218 105.204 51.218 103.887C51.218 102.354 51.4346 101.021 51.868 99.8875C52.3013 98.7542 52.8763 97.8208 53.593 97.0875C54.3096 96.3375 55.1346 95.7875 56.068 95.4375C57.018 95.0708 58.0096 94.8875 59.043 94.8875C61.1763 94.8875 63.1346 95.4875 64.918 96.6875C64.868 97.1708 64.6846 97.6458 64.368 98.1125C64.068 98.5625 63.7346 98.9042 63.368 99.1375C62.0346 98.1875 60.6346 97.7125 59.168 97.7125C56.168 97.7125 54.668 99.7542 54.668 103.837C54.668 107.921 56.1596 109.962 59.143 109.962C60.0596 109.962 60.943 109.862 61.793 109.662V107.437C61.793 107.071 61.793 106.754 61.793 106.487C61.8096 106.204 61.8263 105.971 61.843 105.787H60.143C59.5596 105.787 59.143 105.671 58.893 105.437C58.6596 105.204 58.543 104.829 58.543 104.312C58.543 103.879 58.6263 103.429 58.793 102.962ZM68.5533 112.312V95.2375C68.97 95.1542 69.5117 95.1125 70.1783 95.1125C70.8617 95.1125 71.4367 95.1542 71.9033 95.2375V112.312C71.4367 112.396 70.8617 112.438 70.1783 112.438C69.5117 112.438 68.97 112.396 68.5533 112.312ZM74.5949 110.812C74.6449 110.346 74.7949 109.879 75.0449 109.412C75.3116 108.929 75.6116 108.546 75.9449 108.262C77.6616 109.362 79.3449 109.912 80.9949 109.912C81.7949 109.912 82.4283 109.729 82.8949 109.362C83.3616 108.979 83.5949 108.504 83.5949 107.937C83.5616 106.971 82.9199 106.212 81.6699 105.662L78.7199 104.412C77.5533 103.929 76.6783 103.312 76.0949 102.562C75.5116 101.796 75.2199 100.921 75.2199 99.9375C75.2199 99.1875 75.3616 98.5042 75.6449 97.8875C75.9449 97.2708 76.3616 96.7458 76.8949 96.3125C77.4449 95.8625 78.0866 95.5125 78.8199 95.2625C79.5699 95.0125 80.3949 94.8875 81.2949 94.8875C83.1283 94.8875 84.9283 95.3458 86.6949 96.2625C86.6449 97.2792 86.2533 98.1292 85.5199 98.8125C83.8366 98.0125 82.3699 97.6125 81.1199 97.6125C80.3199 97.6125 79.7033 97.7958 79.2699 98.1625C78.8533 98.5292 78.6449 98.9792 78.6449 99.5125C78.6449 100.279 79.2366 100.912 80.4199 101.412L83.3699 102.662C84.5699 103.162 85.4949 103.821 86.1449 104.637C86.7949 105.454 87.1199 106.396 87.1199 107.462C87.1199 108.212 86.9866 108.912 86.7199 109.562C86.4533 110.196 86.0449 110.746 85.4949 111.212C84.9616 111.662 84.2866 112.021 83.4699 112.287C82.6699 112.538 81.7199 112.663 80.6199 112.663C78.4866 112.663 76.4783 112.046 74.5949 110.812ZM95.8865 98.0125L95.9115 99.8625V112.312C95.4282 112.396 94.8615 112.438 94.2115 112.438C93.5782 112.438 93.0199 112.396 92.5365 112.312V99.8625L92.5615 98.0125L91.0365 98.0375H88.2615C88.1782 97.6208 88.1365 97.1542 88.1365 96.6375C88.1365 96.1208 88.1782 95.6542 88.2615 95.2375H100.212C100.328 95.6542 100.387 96.1125 100.387 96.6125C100.387 97.0958 100.245 97.4542 99.9615 97.6875C99.6782 97.9208 99.2199 98.0375 98.5865 98.0375H97.4115L95.8865 98.0125ZM114.286 100.387C114.286 100.937 114.203 101.462 114.036 101.962C113.886 102.446 113.669 102.887 113.386 103.287C113.103 103.671 112.769 104.012 112.386 104.312C112.019 104.596 111.611 104.812 111.161 104.963C111.594 105.112 111.953 105.371 112.236 105.737C112.536 106.104 112.794 106.579 113.011 107.162L113.936 109.687C114.086 110.104 114.253 110.462 114.436 110.762C114.619 111.062 114.844 111.312 115.111 111.512C114.894 111.812 114.578 112.054 114.161 112.237C113.761 112.421 113.303 112.513 112.786 112.513C112.286 112.513 111.886 112.363 111.586 112.062C111.286 111.762 111.011 111.254 110.761 110.537L109.711 107.562C109.494 106.979 109.219 106.537 108.886 106.237C108.553 105.921 108.053 105.762 107.386 105.762H105.861V112.312C105.628 112.346 105.369 112.371 105.086 112.388C104.803 112.421 104.494 112.438 104.161 112.438C103.544 112.438 103.003 112.396 102.536 112.312V95.3625L102.711 95.2125C104.061 95.1792 105.203 95.1542 106.136 95.1375C107.086 95.1208 107.844 95.1125 108.411 95.1125C110.211 95.1125 111.636 95.5625 112.686 96.4625C113.753 97.3625 114.286 98.6708 114.286 100.387ZM105.861 97.6625V103.162C106.728 103.112 107.494 103.087 108.161 103.087C109.944 103.087 110.836 102.187 110.836 100.387C110.836 98.5875 109.944 97.6875 108.161 97.6875C107.644 97.6875 107.194 97.6875 106.811 97.6875C106.444 97.6875 106.128 97.6792 105.861 97.6625ZM127.304 103.787C127.304 99.6042 126.071 97.5125 123.604 97.5125C121.137 97.5125 119.904 99.6042 119.904 103.787C119.904 107.954 121.137 110.037 123.604 110.037C126.071 110.037 127.304 107.954 127.304 103.787ZM119.054 111.137C117.271 109.604 116.379 107.154 116.379 103.787C116.379 102.371 116.537 101.112 116.854 100.012C117.187 98.9125 117.662 97.9875 118.279 97.2375C118.912 96.4708 119.671 95.8875 120.554 95.4875C121.454 95.0875 122.479 94.8875 123.629 94.8875C124.762 94.8875 125.771 95.0875 126.654 95.4875C127.554 95.8875 128.312 96.4708 128.929 97.2375C129.546 97.9875 130.012 98.9208 130.329 100.037C130.662 101.137 130.829 102.387 130.829 103.787C130.829 105.187 130.662 106.437 130.329 107.537C130.012 108.637 129.546 109.571 128.929 110.337C128.312 111.087 127.554 111.662 126.654 112.062C125.771 112.463 124.762 112.663 123.629 112.663C121.812 112.663 120.287 112.154 119.054 111.137Z" fill="#828282"/>
<path d="M73.8662 142.851C73.3662 143.284 72.6829 143.601 71.8162 143.801C70.9662 144.001 70.0912 144.101 69.1912 144.101C68.7412 144.101 68.0412 144.092 67.0912 144.076C66.1579 144.059 64.9579 144.034 63.4912 144.001L63.3162 143.851V127.026L63.4912 126.876C64.4579 126.842 65.4245 126.817 66.3912 126.801C67.3745 126.784 68.3745 126.776 69.3912 126.776C70.7912 126.776 71.9495 127.001 72.8662 127.451C73.7995 127.901 74.5412 128.526 75.0912 129.326C75.6412 130.109 76.0245 131.026 76.2412 132.076C76.4745 133.126 76.5912 134.251 76.5912 135.451C76.5912 137.117 76.3995 138.559 76.0162 139.776C75.6495 140.976 74.9329 142.001 73.8662 142.851ZM72.4912 131.426C71.9912 130.092 70.9579 129.426 69.3912 129.426C68.8079 129.426 68.2912 129.426 67.8412 129.426C67.3912 129.426 66.9995 129.417 66.6662 129.401V141.476C66.9829 141.459 67.3412 141.451 67.7412 141.451C68.1579 141.451 68.5745 141.442 68.9912 141.426C69.4079 141.409 69.7912 141.376 70.1412 141.326C70.5079 141.276 70.8079 141.192 71.0412 141.076C71.4745 140.842 71.8245 140.534 72.0912 140.151C72.3745 139.751 72.5912 139.301 72.7412 138.801C72.8912 138.284 72.9912 137.734 73.0412 137.151C73.1079 136.551 73.1412 135.934 73.1412 135.301C73.1412 134.584 73.0912 133.917 72.9912 133.301C72.9079 132.684 72.7412 132.059 72.4912 131.426ZM79.8463 143.976V126.901C80.263 126.817 80.8046 126.776 81.4713 126.776C82.1546 126.776 82.7296 126.817 83.1963 126.901V143.976C82.7296 144.059 82.1546 144.101 81.4713 144.101C80.8046 144.101 80.263 144.059 79.8463 143.976ZM85.8879 142.476C85.9379 142.009 86.0879 141.542 86.3379 141.076C86.6046 140.592 86.9046 140.209 87.2379 139.926C88.9546 141.026 90.6379 141.576 92.2879 141.576C93.0879 141.576 93.7212 141.392 94.1879 141.026C94.6546 140.642 94.8879 140.167 94.8879 139.601C94.8546 138.634 94.2129 137.876 92.9629 137.326L90.0129 136.076C88.8462 135.592 87.9712 134.976 87.3879 134.226C86.8046 133.459 86.5129 132.584 86.5129 131.601C86.5129 130.851 86.6546 130.167 86.9379 129.551C87.2379 128.934 87.6546 128.409 88.1879 127.976C88.7379 127.526 89.3796 127.176 90.1129 126.926C90.8629 126.676 91.6879 126.551 92.5879 126.551C94.4212 126.551 96.2212 127.009 97.9879 127.926C97.9379 128.942 97.5462 129.792 96.8129 130.476C95.1296 129.676 93.6629 129.276 92.4129 129.276C91.6129 129.276 90.9962 129.459 90.5629 129.826C90.1462 130.192 89.9379 130.642 89.9379 131.176C89.9379 131.942 90.5296 132.576 91.7129 133.076L94.6629 134.326C95.8629 134.826 96.7879 135.484 97.4379 136.301C98.0879 137.117 98.4129 138.059 98.4129 139.126C98.4129 139.876 98.2796 140.576 98.0129 141.226C97.7462 141.859 97.3379 142.409 96.7879 142.876C96.2546 143.326 95.5796 143.684 94.7629 143.951C93.9629 144.201 93.0129 144.326 91.9129 144.326C89.7796 144.326 87.7712 143.709 85.8879 142.476ZM110.379 133.276V133.026C110.379 132.476 110.321 131.976 110.204 131.526C110.088 131.059 109.904 130.659 109.654 130.326C109.404 129.976 109.079 129.709 108.679 129.526C108.296 129.326 107.829 129.226 107.279 129.226C106.063 129.226 105.179 129.776 104.629 130.876C104.079 131.959 103.804 133.609 103.804 135.826C103.804 137.592 104.138 138.967 104.804 139.951C105.488 140.917 106.413 141.401 107.579 141.401C108.196 141.401 108.863 141.259 109.579 140.976C110.313 140.676 111.096 140.209 111.929 139.576C112.279 139.809 112.613 140.134 112.929 140.551C113.246 140.967 113.446 141.367 113.529 141.751C113.163 142.117 112.729 142.459 112.229 142.776C111.746 143.076 111.221 143.342 110.654 143.576C110.088 143.809 109.496 143.992 108.879 144.126C108.263 144.259 107.646 144.326 107.029 144.326C105.796 144.326 104.754 144.092 103.904 143.626C103.054 143.142 102.354 142.501 101.804 141.701C101.271 140.884 100.879 139.942 100.629 138.876C100.396 137.809 100.279 136.684 100.279 135.501C100.279 134.001 100.463 132.692 100.829 131.576C101.196 130.442 101.688 129.509 102.304 128.776C102.938 128.026 103.671 127.467 104.504 127.101C105.354 126.717 106.254 126.526 107.204 126.526C108.188 126.526 109.071 126.659 109.854 126.926C110.654 127.192 111.329 127.559 111.879 128.026C112.429 128.476 112.854 129.009 113.154 129.626C113.454 130.226 113.604 130.876 113.604 131.576C113.604 132.826 112.971 133.451 111.704 133.451C111.521 133.451 111.321 133.442 111.104 133.426C110.888 133.392 110.646 133.342 110.379 133.276ZM126.219 135.451C126.219 131.267 124.986 129.176 122.519 129.176C120.052 129.176 118.819 131.267 118.819 135.451C118.819 139.617 120.052 141.701 122.519 141.701C124.986 141.701 126.219 139.617 126.219 135.451ZM117.969 142.801C116.186 141.267 115.294 138.817 115.294 135.451C115.294 134.034 115.452 132.776 115.769 131.676C116.102 130.576 116.577 129.651 117.194 128.901C117.827 128.134 118.586 127.551 119.469 127.151C120.369 126.751 121.394 126.551 122.544 126.551C123.677 126.551 124.686 126.751 125.569 127.151C126.469 127.551 127.227 128.134 127.844 128.901C128.461 129.651 128.927 130.584 129.244 131.701C129.577 132.801 129.744 134.051 129.744 135.451C129.744 136.851 129.577 138.101 129.244 139.201C128.927 140.301 128.461 141.234 127.844 142.001C127.227 142.751 126.469 143.326 125.569 143.726C124.686 144.126 123.677 144.326 122.544 144.326C120.727 144.326 119.202 143.817 117.969 142.801ZM131.347 142.476C131.397 142.009 131.547 141.542 131.797 141.076C132.064 140.592 132.364 140.209 132.697 139.926C134.414 141.026 136.097 141.576 137.747 141.576C138.547 141.576 139.18 141.392 139.647 141.026C140.114 140.642 140.347 140.167 140.347 139.601C140.314 138.634 139.672 137.876 138.422 137.326L135.472 136.076C134.305 135.592 133.43 134.976 132.847 134.226C132.264 133.459 131.972 132.584 131.972 131.601C131.972 130.851 132.114 130.167 132.397 129.551C132.697 128.934 133.114 128.409 133.647 127.976C134.197 127.526 134.839 127.176 135.572 126.926C136.322 126.676 137.147 126.551 138.047 126.551C139.88 126.551 141.68 127.009 143.447 127.926C143.397 128.942 143.005 129.792 142.272 130.476C140.589 129.676 139.122 129.276 137.872 129.276C137.072 129.276 136.455 129.459 136.022 129.826C135.605 130.192 135.397 130.642 135.397 131.176C135.397 131.942 135.989 132.576 137.172 133.076L140.122 134.326C141.322 134.826 142.247 135.484 142.897 136.301C143.547 137.117 143.872 138.059 143.872 139.126C143.872 139.876 143.739 140.576 143.472 141.226C143.205 141.859 142.797 142.409 142.247 142.876C141.714 143.326 141.039 143.684 140.222 143.951C139.422 144.201 138.472 144.326 137.372 144.326C135.239 144.326 133.23 143.709 131.347 142.476Z" fill="#828282"/>
<path d="M34.2083 128.411C33.6844 127.992 32.9684 127.685 32.0603 127.492C31.1697 127.298 30.2529 127.201 29.31 127.201C28.8385 127.201 28.1051 127.21 27.1097 127.226C26.1318 127.242 24.8745 127.266 23.3378 127.299L23.1545 127.444L23.1562 143.734L23.3396 143.879C24.3524 143.911 25.3652 143.935 26.3781 143.951C27.4084 143.967 28.4561 143.975 29.5213 143.975C30.9882 143.975 32.2018 143.757 33.1622 143.321C34.14 142.885 34.917 142.28 35.4932 141.506C36.0694 140.747 36.4709 139.86 36.6978 138.843C36.9422 137.826 37.0643 136.737 37.0642 135.575C37.064 133.962 36.8631 132.566 36.4613 131.388C36.077 130.226 35.326 129.234 34.2083 128.411ZM32.7689 139.473C32.2451 140.764 31.1625 141.409 29.521 141.409C28.9099 141.41 28.3685 141.41 27.897 141.41C27.4256 141.41 27.0152 141.418 26.6659 141.434L26.6647 129.743C26.9965 129.759 27.3719 129.767 27.791 129.767C28.2276 129.767 28.6641 129.775 29.1007 129.791C29.5373 129.807 29.9389 129.84 30.3056 129.888C30.6898 129.936 31.0041 130.017 31.2486 130.13C31.7027 130.356 32.0694 130.654 32.3489 131.025C32.6458 131.413 32.8728 131.848 33.03 132.332C33.1872 132.833 33.2921 133.365 33.3445 133.93C33.4144 134.511 33.4494 135.108 33.4495 135.721C33.4496 136.415 33.3972 137.06 33.2925 137.657C33.2053 138.254 33.0307 138.86 32.7689 139.473Z" fill="#828282"/>
<path d="M43.8533 131.46L43.8269 129.959L45.6605 130.007L52.0779 130.007C52.0779 129.49 52.0516 129.095 51.9992 128.821C51.807 127.788 51.0561 127.272 49.7464 127.272L42.386 127.273C41.7573 127.273 41.2596 127.442 40.893 127.781C40.5438 128.136 40.3692 128.612 40.3693 129.209L40.3708 143.684L40.5542 143.853L51.477 143.852C51.5642 143.448 51.6078 143.013 51.6078 142.545C51.6077 142.093 51.5116 141.617 51.3195 141.117L43.8281 141.117L43.8541 139.447L43.8538 136.954L45.5564 136.978L49.9832 136.978C50.1228 136.607 50.1926 136.163 50.1926 135.647C50.1925 135.13 50.1226 134.686 49.9829 134.315L43.8536 134.316L43.8533 131.46Z" fill="#828282"/>
<defs>
<filter id="filter0_d" x="0.248047" y="1.10291" width="238" height="288" filterUnits="userSpaceOnUse" color-interpolation-filters="sRGB">
<feFlood flood-opacity="0" result="BackgroundImageFix"/>
<feColorMatrix in="SourceAlpha" type="matrix" values="0 0 0 0 0 0 0 0 0 0 0 0 0 0 0 0 0 0 127 0"/>
<feOffset dx="4" dy="4"/>
<feGaussianBlur stdDeviation="2"/>
<feColorMatrix type="matrix" values="0 0 0 0 0 0 0 0 0 0 0 0 0 0 0 0 0 0 0.25 0"/>
<feBlend mode="normal" in2="BackgroundImageFix" result="effect1_dropShadow"/>
<feBlend mode="normal" in="SourceGraphic" in2="effect1_dropShadow" result="shape"/>
</filter>
<filter id="filter1_d" x="193.817" y="0.903442" width="39.4428" height="42.9964" filterUnits="userSpaceOnUse" color-interpolation-filters="sRGB">
<feFlood flood-opacity="0" result="BackgroundImageFix"/>
<feColorMatrix in="SourceAlpha" type="matrix" values="0 0 0 0 0 0 0 0 0 0 0 0 0 0 0 0 0 0 127 0"/>
<feOffset dy="4"/>
<feGaussianBlur stdDeviation="2"/>
<feColorMatrix type="matrix" values="0 0 0 0 0 0 0 0 0 0 0 0 0 0 0 0 0 0 0.25 0"/>
<feBlend mode="normal" in2="BackgroundImageFix" result="effect1_dropShadow"/>
<feBlend mode="normal" in="SourceGraphic" in2="effect1_dropShadow" result="shape"/>
</filter>
</defs>
</svg>
