<svg width="263" height="263" viewBox="0 0 263 263" fill="none" xmlns="http://www.w3.org/2000/svg">
<path d="M131.081 0C58.6911 0 0 58.6911 0 131.081C0 203.479 58.6911 262.162 131.081 262.162C203.479 262.162 262.162 203.487 262.162 131.081C262.162 58.6911 203.478 0 131.081 0ZM131.081 237.584C72.2586 237.584 24.578 189.903 24.578 131.081C24.578 72.2586 72.2586 24.578 131.081 24.578C189.903 24.578 237.584 72.2586 237.584 131.081C237.584 189.903 189.903 237.584 131.081 237.584ZM131.089 57.4869C121.701 57.4869 114.597 62.3863 114.597 70.3001V142.886C114.597 150.808 121.7 155.691 131.089 155.691C140.248 155.691 147.581 150.604 147.581 142.886V70.3001C147.58 62.5742 140.248 57.4869 131.089 57.4869ZM131.089 172.044C122.069 172.044 114.728 179.385 114.728 188.412C114.728 197.424 122.069 204.765 131.089 204.765C140.109 204.765 147.442 197.424 147.442 188.412C147.441 179.384 140.109 172.044 131.089 172.044Z" transform="translate(0.5 0.534668)" fill="#ff5000"/>
</svg>
