<svg width="105" height="111" viewBox="0 0 105 111" fill="none" xmlns="http://www.w3.org/2000/svg">
<path d="M20.8145 46.2368C20.6159 44.5667 20.0234 43.016 19.1302 41.6817L99.1451 14.9659L94.9451 2.38537C94.3345 0.557179 92.3569 -0.429447 90.5299 0.180345L3.49123 29.2411C1.66422 29.8509 0.67562 31.8281 1.2862 33.6563L3.34578 39.8239C1.28975 41.7329 0 44.4563 0 47.4769C0 51.3887 2.16246 54.8031 5.35372 56.593V105.873C5.35372 107.801 6.91742 109.363 8.84376 109.363H100.605C102.531 109.363 104.095 107.801 104.095 105.873V46.2368H20.8145ZM71.8136 10.5342L82.4071 6.99725L79.858 17.301L69.2644 20.838L71.8136 10.5342ZM45.6406 19.2727L56.2349 15.7358L53.6858 26.0392L43.0923 29.5765L45.6406 19.2727ZM10.4449 52.7987C7.51144 52.7987 5.1243 50.4116 5.1243 47.4773C5.1243 44.543 7.51144 42.1559 10.4449 42.1559C13.3792 42.1559 15.7663 44.543 15.7663 47.4773C15.7663 50.4116 13.3792 52.7987 10.4449 52.7987ZM19.4688 28.0112L30.0631 24.4743L27.514 34.7781L16.9197 38.3154L19.4688 28.0112ZM29.8759 58.02H18.7073L24.3881 49.054H35.5568L29.8759 58.02ZM51.9806 49.054H63.1492L57.4683 58.02H46.2997L51.9806 49.054ZM49.2391 92.3843V68.7337L68.074 80.559L49.2391 92.3843ZM85.0607 58.02H73.8921L79.573 49.054H90.7416L85.0607 58.02Z" transform="translate(0.275391 0.957031)" fill="#013162"/>
<path d="M5.67644 0.0408237L0 9.01427L11.1803 8.99137L16.8787 0L5.67644 0.0408237Z" transform="translate(19.041 50)" fill="white"/>
<path d="M5.67644 0.0408237L0 9.01427L11.1803 8.99137L16.8787 0L5.67644 0.0408237Z" transform="translate(46.6348 50.0254)" fill="white"/>
<path d="M5.67644 0.0408237L0 9.01427L11.1803 8.99137L16.8787 0L5.67644 0.0408237Z" transform="translate(74.2305 50)" fill="white"/>
<path d="M0 0L0.0257578 23.6933L19.0424 11.9797L0 0Z" transform="translate(49.543 69.6826)" fill="white"/>
<path d="M5.67644 0.0408237L0 9.01427L11.1803 8.99137L16.8787 0L5.67644 0.0408237Z" transform="translate(14.4375 30.6826) rotate(-18.0526)" fill="white"/>
<path d="M5.67644 0.0408237L0 9.01427L11.1803 8.99137L16.8787 0L5.67644 0.0408237Z" transform="translate(40.623 21.917) rotate(-18.0526)" fill="white"/>
<path d="M5.67644 0.0408237L0 9.01427L11.1803 8.99137L16.8787 0L5.67644 0.0408237Z" transform="translate(66.7812 13.1904) rotate(-18.0526)" fill="white"/>
<circle cx="5.37955" cy="5.37955" r="5.37955" transform="translate(5.43359 43.0479)" fill="white"/>
</svg>
