<?xml version="1.0" standalone="no"?>
<!DOCTYPE svg PUBLIC "-//W3C//DTD SVG 1.1//EN" "http://www.w3.org/Graphics/SVG/1.1/DTD/svg11.dtd">
<svg xmlns="http://www.w3.org/2000/svg">
<metadata>Generated by Fontastic.me</metadata>
<defs>
<font id="untitled-font-4" horiz-adv-x="512">
<font-face font-family="untitled-font-4" units-per-em="512" ascent="480" descent="-32"/>
<missing-glyph horiz-adv-x="512" />

<glyph glyph-name="aproved" unicode="&#97;" d="M256 504c-137 0-248-111-248-248 0-137 111-248 248-248 137 0 248 111 248 248 0 137-111 248-248 248z m0-48c111 0 200-89 200-200 0-111-89-200-200-200-111 0-200 89-200 200 0 111 89 200 200 200m140-130l-22 22c-5 5-13 5-17 1l-142-141-59 61c-5 4-13 4-17 0l-23-23c-5-5-5-12 0-17l91-91c4-5 12-5 17 0l172 171c5 4 5 12 0 17z"/>
<glyph glyph-name="transform-letter" unicode="&#100;" d="M207 176l-70 0-13-40-42 0 72 193 36 0 73-193-43 0z m-59 32l48 0-24 72z m213-72c-1 3-3 8-4 13-9-11-21-16-36-16-14 0-25 4-35 12-9 9-14 19-14 31 0 15 6 27 17 35 12 8 28 12 49 13l18 0 0 8c0 6-2 12-5 16-4 4-9 6-16 6-7 0-12-2-16-5-3-3-5-7-5-13l-38 0c0 9 2 16 7 23 5 7 13 13 22 17 9 4 20 6 32 6 17 0 31-5 42-13 10-9 15-22 15-38l0-62c0-14 2-24 6-31l0-2z m-31 27c5 0 10 1 15 3 5 3 9 6 11 10l0 25-14 0c-20 0-30-7-31-20l0-2c0-5 1-9 5-12 3-3 8-4 14-4z m79 57l49 0c5 0 7-5 4-8l-25-21c-2-1-5-1-7 0l-25 21c-3 3-1 8 4 8z"/>
<glyph glyph-name="underline" unicode="&#102;" d="M64 448l32 0 0-160c0-88 72-160 160-160 88 0 160 72 160 160l0 160 32 0c9 0 16 7 16 16l0 32c0 9-7 16-16 16l-144 0c-9 0-16-7-16-16l0-32c0-9 7-16 16-16l32 0 0-160c0-44-36-80-80-80-44 0-80 36-80 80l0 160 32 0c9 0 16 7 16 16l0 32c0 9-7 16-16 16l-144 0c-9 0-16-7-16-16l0-32c0-9 7-16 16-16z m400-384l-416 0c-9 0-16-7-16-16l0-32c0-9 7-16 16-16l416 0c9 0 16 7 16 16l0 32c0 9-7 16-16 16z"/>
<glyph glyph-name="color-text" unicode="&#99;" d="M3 26l523 0c0 0 1-1 1-2l0-70c0-1-1-1-1-1l-523 0c-1 0-1 0-1 1l0 70c0 1 0 2 1 2z m314 112l-123 0-24-70-74 0 127 340 65 0 127-340-74 0z m-104 57l85 0-43 127z m191-25l84 0c8 0 11-8 6-13l-42-37c-3-2-9-2-12 0l-42 37c-6 5-2 13 6 13z"/>
<glyph glyph-name="print" unicode="&#103;" d="M135 436l0-27-19 0c-25-1-23 4-23-51l0-44-18 0c-24 0-32-2-44-15-12-11-15-23-15-52l0-19 478 0 0 25-1 25-4 8c-4 8-15 21-18 21-1 0-2 0-2 1 0 0-4 2-8 4-7 2-11 2-27 2l-18 0 0 44c0 56 3 51-22 51l-18 0 0 54-241 0z m231-52l0-70-222 0 0 140 222 0z m-66-118c0-10-1-19-1-20-1-2-6-2-43-2-32 0-43 1-44 2-1 1-2 7-2 19l0 19 90 0z m100-18l0-6-22 0-1 6 0 5 24 0z m36 0l-1-6-10 0c-6 0-11 0-12 1 0 1-1 3-1 6l0 4 24 0z m-419-34c-1-1-1-19-1-46 0-52 0-56 9-65 3-3 7-5 10-6 3-1 18-1 38-1 18 0 33-1 33-1 1-1-1-6-3-11 0-1-1-4-2-6 0-1-1-5-2-7-1-2-2-7-3-9-1-3-2-6-2-7-1-1 32-1 161-1 100 0 161 0 161 1 0 1-2 9-6 20-3 10-6 19-6 19 0 1 16 2 36 2 33 0 36 0 40 3 5 3 8 6 11 11 2 4 2 8 3 52 0 27 0 49-1 51l0 2-237 0c-149 0-238 0-239-1z m364-39l0-9-124 0c-68 0-125-1-125-1-1 0-1 5-2 10l0 10 125 0 125 0z m-7-21c1-1 2-3 3-6 0-2 1-5 1-5 1-1 2-3 2-6 1-3 2-6 2-6 0-1 5-13 9-27 5-15 9-29 11-33 1-3 2-7 1-7 0-2-295-2-295-1-1 1 1 9 3 14 1 2 8 25 10 30 0 2 2 8 3 13 2 4 5 14 8 21 2 7 4 13 5 14 1 0 54 1 119 1 92 0 117-1 118-2z m-215-11c-1-3-2-6-2-7 0-1 21-1 98-1 53 0 98 0 98 1 0 0 0 3-1 6l-1 5-191 0z m-5-19c-1-3-2-5-2-6 0-3 4-3 103-3l102 0 0 4c0 2 0 4 0 6l-1 3-201 0z m-5-19c-1-1-2-4-2-6l0-3 109 0c59 0 108 0 108 0 0 4-4 11-6 11-1 0-48 1-105 1l-102 0z m-5-20c0 0-1-3-1-6l-1-4 113 0c110 0 114 0 114 2 0 1-1 4-2 6l-1 4-111 0c-88 0-111 0-111-2z"/>
<glyph glyph-name="save" unicode="&#104;" d="M25 511c-4-1-8-2-12-5-6-4-10-10-11-17-1-4-1-6-1-233 0-227 0-229 1-233 2-10 10-18 20-21l4-2 228 0c252 0 233 0 240 3 7 4 14 11 16 19l1 3 0 202 0 202-41 42-41 41-200 0c-164 0-201 0-204-1z m361-52c11-3 20-12 22-23 1-4 1-10 1-54l0-51-1-3c-3-8-9-15-16-18-7-4 2-3-148-3l-137 0-3 1c-9 3-15 9-18 16-1 2-3 6-3 7 0 2-1 19-1 53 0 54 0 52 4 59 2 5 8 11 13 14 7 3-3 3 147 3 118 0 137 0 140-1z m54-311l0-117-368 0 0 235 368 0z m-153 235l0-56 61 0 0 113-61 0z m-174-178l0-10 286 0 0 20-286 0z m0-41l0-11 286 0 0 21-286 0z m0-41l0-10 286 0 0 20-286 0z m0-41l0-10 286 0 0 20-286 0z"/>
<glyph glyph-name="copy" unicode="&#105;" d="M64 510c-16-5-26-13-33-27-3-7-4-24-4-166 0-151 1-158 5-167 6-11 15-20 27-24 8-3 21-3 68-3l57 0 0-38c0-52 6-67 29-79 9-5 11-5 117-6 79 0 111 0 118 2 14 4 27 14 32 26 5 10 5 11 5 167 0 151 0 158-4 166-6 11-15 20-26 24-8 3-19 4-68 4l-59 0 0 35c0 19-1 41-3 47-2 14-13 28-25 35-10 5-10 5-120 5-61 1-113 0-116-1z m221-24c16-7 17-9 17-55l1-42-20 0c-19 0-21 0-21 4 0 9-2 10-86 10-88 0-88 0-84-14l3-6 56-1 57-1-5-5c-3-2-8-8-11-13l-5-8-46 0c-40 0-46-1-47-4-1-2 0-5 1-7 2-4 9-4 46-5l43 0 0-51c0-29 0-52-2-52-3 0-27 17-38 26-19 17-41 51-56 86l-9 22 2-22c4-69 37-130 90-164l13-8 0-31-55 0c-61 0-65 1-74 13-5 6-5 7-5 159l0 153 5 7c10 12 11 12 121 12 81 0 103 0 109-3z m161-123c4-2 9-6 12-10 4-5 4-7 4-157 0-130 0-152-3-158-7-14-3-13-124-13l-110 0-8 7-7 8 0 123 23-7 24-7 0-17c0-15 1-16 6-18 6-1 7-1 60 34 31 21 38 27 39 32 0 5-4 9-41 36-55 40-53 40-59 37-4-2-5-6-5-18l-1-16-10 1c-6 0-16 2-23 3l-13 3 0 60c0 67 0 71 14 77 11 5 213 5 222 0z m-353 82c-2-3-2-6-1-10l3-6 80-1c85 0 87 0 87 10 0 10-1 10-86 10-69 0-80 0-83-3z"/>
<glyph glyph-name="check" unicode="&#106;" d="M442 488c-3-3-63-79-133-170-69-91-127-166-128-166-1 0-26 32-56 72-62 80-65 84-87 84-21 0-38-23-38-53 0-23 5-31 70-118 93-122 90-119 113-117 19 2 27 11 169 199 83 109 152 204 155 212 7 17 2 35-13 50-12 11-40 15-52 7z"/>
<glyph glyph-name="copy-data" unicode="&#107;" d="M48 504c-1 0-1-1-2-2 0 0-1-1-3-1-1 0-2 0-2-1 0 0-1-1-2-1-2 0-2 0-2-1 0 0-1-1-2-1-1-1-1-1-1-2 0 0-1-1-1-1-1 0-1 0-2-1 0-1 0-1-1-1-1 0-1-1-1-2 0 0-1-1-1-1-1 0-1 0-1-2 0-2-1-3-2-3-1 0-1 0-1-2 0-2 0-2-1-2-1 0-1-18-1-151 0-134 0-151 1-151 1 0 1-1 1-3 0-2 0-2 1-2 1 0 2-1 2-3 0-1 0-2 1-2 0 0 1-1 1-1 0-1 0-1 1-1 0 0 1-1 1-1 0-1 1-2 1-2 1 0 2-1 2-1 0-1 0-1 1-1 0 0 1-1 1-1 0-1 0-1 1-1 1 0 2-1 3-2 0-1 2-1 3-1 2 0 3 0 3-1 0-2 6-2 47-2l38 0 0 13c0 10 0 12-1 12 0 0-1 1-1 1 0 2-1 2-38 2-33 0-37 0-37 1 0 0-1 1-2 1-1 0-1 0-1 1 0 1-1 2-1 2-1 0-1 16-1 142 0 126 0 142 1 142 0 0 1 1 1 2 0 2 0 3 1 3 1 0 2 0 2 1 0 0 0 1 1 1 1 0 62 0 135 0 115 0 133 0 133-1 0 0 1-1 2-1 2 0 3-1 3-2 0-1 0-20 0-42l0-41 29 0 0 44c0 38 0 43-1 43 0 0-1 1-1 2 0 3-1 5-2 5 0 0-1 1-1 3 0 2 0 2-1 2 0 0-1 1-1 1 0 1 0 2-1 2-1 0-1 0-1 1-1 1-1 1-2 1 0 0-1 1-1 1 0 1 0 1-1 1 0 0-1 1-1 1 0 1-2 2-3 2-1 0-2 1-2 1 0 1-1 1-2 1-2 0-3 1-3 2-1 1-9 1-143 1-77 0-142 0-142 0z m136-139c-3 0-4 0-4-1 0-1-1-1-2-1-2 0-3 0-3-1-1-1-2-1-3-2-1 0-2 0-2-1 0-1-1-1-1-1-1 0-2 0-2-1 0-1 0-1-1-1 0 0-1-1-1-2 0 0 0-1-1-1 0 0-1 0-1-1 0-1-1-1-1-2-1 0-2-1-2-2 0-1 0-2-1-2 0 0-1-1-1-3 0-2-1-4-1-4-1-1-1-4-2-13 0-13 0-17 2-17 1 0 1 0 1-1 0 0 1-1 1-1 1 0 1 0 1-1 0-1 1-2 1-2 1 0 1 0 2-1 0-1 0-2 1-2 1 0 1 0 1-1 0 0 1-1 1-1 1 0 1 0 1-1 0 0 1-1 2-1 0 0 1-1 1-2 0 0 1-1 1-1 1 0 1 0 1-1 0 0 1-1 1-1 1 0 1 0 1-1 0 0 1-1 2-1 1-1 1-1 1-2 0 0 1-1 2-1 0 0 1 0 1-1 0 0 0-1 1-1 1 0 1 0 2-1 1-3 1 1 1 23 0 26 0 29 2 29 1 0 1 1 1 1 0 1 16 1 136 1 120 0 136 0 136-1 0 0 1-1 1-1 1 0 2 0 2-1 0-1 0-2 1-2 1 0 1-16 1-142 0-125 0-142-1-143-1 0-1-2-1-2 0-1-1-2-2-2 0 0-2 0-2-1-1-1-2-1-135-1-132 0-133 0-134 1-1 1-2 1-3 1 0 0-1 1-1 3-1 1-1 23-1 49 0 42 0 48-1 48 0 0-1 0-1 1 0 1-1 1-3 1-3 1-4 1-4 2 0 1-1 1-2 1-2 0-3 0-3 1 0 1-1 1-1 1-1 0-2 0-2 1 0 1-1 1-2 1-1 1-2 1-2 2 0 1-1 1-2 1-2 0-3 0-3 1 0 1 0 2-1 2-1-1-1-4-1-59 0-48 0-58 1-58 0-1 1-2 1-4 0-2 1-4 1-4 1 0 1-1 1-2 1-1 1-2 2-2 1 0 1-1 1-2 0 0 1-1 1-1 1 0 1 0 1-1 0-1 1-1 1-1 1 0 1-1 1-1 0-1 1-2 2-2 0 0 1 0 1-1 0 0 1-1 3-1 1 0 2-1 2-1 0-1 1-1 3-1 1 0 2-1 2-1 0-1 1-2 2-2 2 0 280 0 283 0 1 0 2 1 2 2 0 0 1 1 2 1 2 0 3 0 3 1 0 0 0 1 2 1 1 0 2 0 2 1 1 1 1 1 2 1 0 0 1 1 1 2 0 0 0 1 1 1 1 0 2 0 2 1 0 1 0 1 1 1 0 0 1 1 1 1 0 1 0 2 1 2 0 0 1 1 1 2 1 1 1 2 2 2 0 0 1 1 1 3 0 2 0 2 1 2 1 0 1 18 1 151 0 134 0 151-1 151-1 0-1 1-1 3 0 1-1 2-1 2-1 0-1 1-2 2 0 2-1 3-1 3-1 0-1 0-1 1 0 1-1 1-1 1-1 0-1 1-1 1 0 1-1 1-1 2-1 0-1 0-1 1 0 1-1 1-2 1-1 0-1 0-1 1 0 1-1 1-1 1-1 0-2 1-2 1 0 1-2 2-4 2-2 0-3 1-3 1 0 1-2 1-4 1-4 1-273 1-279 0z m-90-15c-1 0-2 0-2-1 0 0-1-1-2-1-2 0-3 0-3-1 0-1 0-1-1-1 0 0-1-1-1-2 0-2-1-3-2-3 0 0 0-2 0-7 0-7 0-8 1-8 0 0 1-1 1-3 0-7 0-12 1-12 1 0 1-1 1-6 0-4 1-6 2-6 0 0 1 0 1-2 0-5 0-8 1-8 1 0 1-1 1-3 0-3 1-4 1-4 1 0 2 0 2-3 0-2 0-4 1-5 1 0 1-2 1-4 0-2 1-2 1-2 1 0 1-1 1-4 0-2 1-3 2-3 1-1 1-1 1-3 0-2 1-2 1-2 1 0 1-1 1-3 0-2 1-2 1-2 1 0 2-1 2-3 0-1 1-2 1-2 1 0 1-1 1-2 0-2 1-3 1-3 1 0 2-1 2-2 0-2 1-2 1-2 1 0 1-1 1-2 0-1 1-1 1-1 1 0 1-1 1-3 0-1 1-2 2-2 1 0 1-1 1-1 0-1 1-1 1-1 1 0 1-1 1-3 0-2 1-2 2-2 1 0 1-1 1-2 0-1 1-1 1-1 1 0 1-1 1-2 0-2 1-2 2-2 0 0 1-1 1-1 0-1 1-2 1-2 1 0 1-1 1-1 0-1 1-1 1-1 1 0 1-1 1-1 0-1 1-2 2-2 1 0 1-1 1-1 0-1 1-1 1-1 1 0 1-1 1-1 0-1 1-2 2-2 1 0 1-1 1-1 0-1 1-1 1-1 1 0 1-1 1-1 0-1 1-1 2-2 0 0 1 0 1-1 0-1 1-1 1-1 1 0 1-1 1-1 0-1 1-1 1-1 1 0 4-3 4-4 0-1 1-1 2-1 2 0 2-1 2-1 0-1 1-2 2-2 1 0 1-1 1-1 0-1 1-1 2-1 0 0 1-1 1-1 0-1 1-1 2-1 2 0 2-1 2-2 0-1 1-1 3-1 1 0 2 0 2-1 0-1 1-1 2-1 1 0 1-1 1-2 0-1 1-1 3-1 1 0 2 0 2-1 0-1 1-1 2-1 1 0 2-1 2-2 1-1 1-1 3-1 1 0 2 0 2-1 0-1 1-1 3-1 1 0 2-1 3-1 0-1 2-2 3-2 2 0 3-1 3-1 0-1 1-1 3-1 2 0 3 0 3-1 0-1 1-1 3-1 2-1 4-1 4-2 0 0 2-1 5-1 3 0 5-1 5-1 0-1 1-1 4-1 3-1 5-1 6-2 0 0 2-1 7-1 5 0 7 0 7-1 0-1 2-1 13-1 7 0 13 0 14-1l2 0 0-22c0-13 0-23 0-24 0-1 1-2 2-2 0 0 1 0 1-1 0-1 0-2 1-2 0 0 1 0 1-1 0 0 0-1 1-1 1 0 2 0 2-1 0-1 1-1 6-1 4 0 6 0 6 1 0 1 0 1 2 1 2 0 2 1 2 2 0 0 1 1 2 1 0 0 1 1 1 1 0 1 0 1 1 1 1 0 1 1 1 2 0 0 1 1 1 1 1 0 2 0 2 1 0 1 0 1 1 1 0 0 1 1 1 1 0 1 0 1 1 1 1 0 2 1 2 2 0 0 0 1 1 1 0 0 1 1 1 1 0 1 0 1 1 1 1 0 1 1 1 2 0 0 1 1 2 1 0 0 1 0 1 1 0 1 0 1 1 1 1 0 1 1 1 2 0 0 1 1 1 1 1 0 2 0 2 1 0 1 0 1 1 1 1 0 1 1 1 1 0 1 1 2 1 2 1 0 1 0 1 1 0 1 1 1 2 1 1 0 1 1 1 1 0 1 1 1 1 1 1 0 1 1 1 2 0 0 1 1 1 1 1 0 2 0 2 1 0 1 0 1 1 1 1 0 1 1 1 1 0 1 1 2 1 2 1 0 1 0 1 1 0 1 1 1 2 1 1 0 1 1 1 1 0 1 1 2 1 2 1 0 1 0 1 1 0 0 1 1 2 1 1 0 1 0 1 1 0 1 1 1 1 1 1 0 1 1 1 1 0 1 1 2 2 2 1 0 1 0 1 1 0 1 1 1 1 1 1 0 1 1 1 1 0 1 1 2 1 2 1 0 1 0 1 1 0 0 1 1 2 1 1 0 1 0 1 1 0 1 1 2 1 2 1 0 1 0 1 1 0 0 1 1 2 1 1 0 1 0 1 1 0 1 1 1 1 1 1 0 1 1 1 1 0 1 1 2 2 2 0 0 1 0 1 1 0 0 1 1 1 1 1 0 1 1 1 1 0 1 1 2 2 2 0 0 1 0 1 1 0 0 1 1 1 1 1 0 1 1 1 1 0 1 1 2 2 2 0 0 1 0 1 1 0 0 1 1 1 1 1 0 1 1 1 2 0 2 0 3 1 3 1 0 1 1 1 5 0 4 0 5-1 5-1 0-1 0-1 2 0 1 0 2-1 2-1 0-1 1-1 1-1 1-1 2-2 2 0 0-1 0-1 1 0 0 0 1-1 1-1 0-1 1-1 1-1 1-1 2-2 2 0 0-1 0-1 1 0 0 0 1-1 1 0 0-1 0-1 1 0 1-1 2-2 2 0 0-1 0-1 1 0 0 0 1-1 1 0 0-1 0-1 1 0 1 0 2-1 2-1 0-2 0-2 1 0 0 0 1-1 1 0 0-1 0-1 1 0 0 0 1-1 1-1 0-1 0-1 1-1 1-1 2-2 2 0 0-1 0-1 1 0 0 0 1-1 1-1 0-2 1-2 1 0 1 0 2-1 2 0 0-1 0-1 1 0 0 0 1-1 1-1 0-1 1-1 1 0 1-1 2-2 2 0 0-1 0-1 1 0 0 0 1-1 1 0 0-1 0-1 1 0 0 0 1-1 1-1 0-2 1-2 1 0 1 0 2-1 2 0 0-1 0-1 1 0 0 0 1-1 1-1 0-1 1-1 1 0 1-1 2-2 2 0 0-1 0-1 1 0 0 0 1-1 1-1 0-1 1-1 1 0 1-1 2-1 2-1 0-2 0-2 1 0 0 0 1 0 1-1 0-4 3-4 4 0 0-1 1-3 1-1 0-2 1-2 1 0 1 0 1-1 1-1 0-2 1-2 2 0 1 0 1-1 1 0 0-1 1-1 1 0 1 0 1-1 1 0 0-1 1-1 1 0 1 0 2-1 2-1 0-2 1-2 1 0 1 0 1-1 1 0 0-1 1-1 1 0 1 0 1-1 1-1 0-2 1-2 2 0 1 0 1-1 1 0 0-1 1-1 1 0 1 0 1-1 1-1 0-2 1-2 2 0 1 0 1-1 1 0 0-1 1-1 1 0 1 0 1-1 1-1 0-1 1-1 1 0 1-2 1-6 1-5 0-6 0-6-1 0 0-1-1-2-1-1 0-1 0-1-1 0 0-1-1-1-1-1 0-1 0-1-1 0-1-1-2-1-2-2 0-2-3-2-26l0-22-12 0c-10 0-12 0-12 1 0 0-2 1-7 1-5 0-7 1-8 2 0 0-1 1-5 1-3 0-4 0-4 1 0 0-1 1-4 1-1 0-3 1-3 1-1 1-2 2-5 2-2 0-3 0-3 1 0 0-1 1-2 1-2 0-3 0-3 1 0 1-1 1-3 1-1 0-2 1-2 2 0 0-1 1-2 1-2 0-3 0-3 1 0 0-1 1-2 1-2 0-3 1-3 2 0 0-1 1-2 1-1 0-2 0-2 1-1 1-1 1-2 1 0 0-1 1-1 1 0 1-1 1-2 1-2 0-3 1-3 2 0 0 0 1-1 1 0 0-1 0-2 1-1 1-2 1-3 1 0 0-1 1-1 1 0 1-1 2-1 2-1 0-2 0-2 1 0 1 0 1-1 1 0 0-1 1-1 1 0 1-1 1-2 1-2 0-2 1-3 2 0 1 0 1-1 1-1 0-1 1-1 1 0 1-1 1-1 1-1 0-2 1-2 2 0 1 0 1-1 1 0 0-1 1-1 1 0 1-1 1-1 1-1 0-2 1-2 1 0 1 0 1-1 1 0 0-1 1-1 2 0 1 0 1-1 1 0 0-1 1-1 1 0 1-1 1-1 1-1 0-2 1-2 2 0 1 0 1-1 1 0 0-1 1-1 1 0 1-1 1-1 1-1 0-2 1-2 2 0 1 0 1-1 1 0 0-1 1-1 2 0 2-1 2-2 2 0 0-1 1-1 2 0 1 0 1-1 1 0 0-1 1-1 1 0 1-3 4-4 4 0 0-1 1-1 3 0 1 0 2-1 2 0 0-1 1-1 1 0 1-1 1-1 1-1 0-2 1-2 3 0 1 0 2-1 2 0 0-1 1-1 1 0 1 0 2-1 2-1 1-2 2-2 3 0 1 0 2-1 2 0 0-1 1-1 2 0 2 0 2-1 2-1 0-2 1-2 3 0 1 0 2-1 2 0 0-1 1-1 2 0 0 0 1-1 1 0 0-1 1-1 2 0 2-1 3-2 3 0 0-1 1-1 2 0 1 0 2-1 3 0 0-1 0-1 1 0 1 0 1-1 1-1 0-2 0-2 1 0 1-1 1-2 1-1 1-3 1-3 1 0 1-3 2-5 1z"/>
<glyph glyph-name="ticket" unicode="&#108;" d="M253 495l-243-243-5-5c-1-2-3-8-4-12-2-7 0-20 0-22 1-4 5-11 8-14 52-56 162-163 165-165 3-2 20-25 33-29 12-3 18-3 29 0 9 3 20 14 27 20 76 76 219 218 229 228 10 9 18 35 15 39 1 59 1 174 1 179-1 6-1 13-11 25-8 10-23 15-28 16-56 0-163-2-173-2-12 0-17 1-28-4-12-6-14-9-15-11z m164-105c0-26-22-47-48-47-26 0-47 21-47 47 0 26 21 47 47 47 26 0 48-21 48-47z"/>
<glyph glyph-name="edit" unicode="&#111;" d="M401 267l-138 138-260-260 0-140 138 3z m-351-148l24 25 75-76-24-25-29 0 0 49-46 0z m227 213c4-4 4-11 0-15l-146-144c-5-4-11-4-16 1-4 4-4 11 1 15l146 143c4 4 11 4 15 0z m86 171c5 5 13 5 18 0l118-121c5-5 5-13 0-18l-69-68-136 140z"/>
<glyph glyph-name="tv" unicode="&#109;" d="M184 429l42 0-67 78c-6 6-16 7-23 1-6-5-7-15-1-22z m141 24c7 6 7 16 0 23-6 6-16 6-22 0l-45-46 44 0z m119-41l-408 0c-20 0-36-16-36-35l0-256c0-20 16-36 36-36l408 0c19 0 36 16 36 36l0 256c0 19-17 35-36 35z m-105-252c0-14-11-25-25-25l-236 0c-14 0-25 11-25 25l0 177c0 14 11 25 25 25l236 0c14 0 25-11 25-25z m101 55c0-3-2-5-5-5l-51 0c-3 0-6 2-6 5l0 39c0 3 3 5 6 5l51 0c3 0 5-2 5-5z m0 83c0-3-2-5-5-5l-51 0c-3 0-6 2-6 5l0 39c0 3 3 5 6 5l51 0c3 0 5-2 5-5z m-404-245c0-10 8-18 18-18l18 0c11 0 19 8 19 18l0 15-55 0z m353 0c0-10 8-18 18-18l18 0c11 0 19 8 19 18l0 15-55 0z"/>
<glyph glyph-name="clock" unicode="&#112;" d="M34 256c0 122 100 222 222 222 122 0 222-100 222-222 0-122-100-222-222-222-122 0-222 100-222 222z m222 256c-141 0-256-115-256-256 0-141 115-256 256-256 141 0 256 115 256 256 0 141-115 256-256 256z m11-156l0-86c14-4 25-17 25-33 0-19-15-34-34-34-16 0-29 11-33 25l-61 0c-5 0-8 4-8 9 0 5 3 9 8 9l61 0c3 11 13 21 25 24l0 86c0 5 3 9 8 9 5 0 9-4 9-9z m-26-119c0-9 8-17 17-17 9 0 17 8 17 17 0 9-8 17-17 17-9 0-17-8-17-17z m15 191c5 0 9 3 9 8l0 9c0 4-4 8-9 8-5 0-9-4-9-8l0-9c0-5 4-8 9-8z m0-342c-5 0-9-3-9-8l0-9c0-4 4-8 9-8 5 0 9 4 9 8l0 9c0 5-4 8-9 8z m188 180l-9 0c-5 0-8-4-8-9 0-5 3-8 8-8l9 0c4 0 8 3 8 8 0 5-4 9-8 9z m-367 0l-9 0c-4 0-8-4-8-9 0-5 4-8 8-8l9 0c4 0 8 3 8 8 0 5-4 9-8 9z m306 130l-6-6c-4-4-4-9 0-12 1-2 4-3 6-3 2 0 4 1 6 3l6 6c3 3 3 8 0 12-4 3-9 3-12 0z m-260-260l-6-6c-3-3-3-8 0-12 2-1 4-2 6-2 2 0 5 1 6 2l6 6c4 4 4 9 0 12-3 4-8 4-12 0z m266 0c-4 4-9 4-12 0-4-3-4-8 0-12l6-6c1-1 4-2 6-2 2 0 4 1 6 2 3 4 3 9 0 12z m-260 260c-3 3-8 3-12 0-3-4-3-9 0-12l6-6c2-2 4-3 6-3 2 0 5 1 6 3 4 3 4 8 0 12z"/>
<glyph glyph-name="bold-solid" unicode="&#98;" d="M397 274c16 19 25 41 27 65 8 77-52 141-127 141l-199 0c-9 0-16-7-16-16l0-48c0-9 7-16 16-16l32 0 0-288-32 0c-9 0-16-7-16-16l0-48c0-9 7-16 16-16l209 0c71 0 134 52 141 122 5 49-16 92-51 120z m-187 126l87 0c27 0 48-21 48-48 0-27-21-48-48-48l-87 0z m87-288l-87 0 0 112 87 0c31 0 56-25 56-56 0-31-25-56-56-56z"/>
<glyph glyph-name="italic-solid" unicode="&#101;" d="M416 464l0-32c0-9-7-16-16-16l-63 0-80-320 47 0c9 0 16-7 16-16l0-32c0-9-7-16-16-16l-192 0c-9 0-16 7-16 16l0 32c0 9 7 16 16 16l63 0 80 320-47 0c-9 0-16 7-16 16l0 32c0 9 7 16 16 16l192 0c9 0 16-7 16-16z"/>
<glyph glyph-name="artist" unicode="&#113;" d="M324 248c0 42-29 76-65 76-36 0-65-34-65-76 0-41 29-75 65-75 36 0 65 34 65 75z m-165-141l0-62 97 52 97-52 0 57c0 5 0 14-9 31-7 14-32 29-44 34l-44-31-43 30c-2 0-4 0-10-4-8-4-16-8-26-20-11-12-18-29-18-35z m-115 403l13-25c1 0 1-1 2-1l27-4-20-20c0-1 0-1 0-2l4-28-25 13c0 1-1 1-2 0l-25-13 4 28c0 1 0 1-1 2l-19 19 28 5c0 0 1 1 1 1z"/>
</font></defs></svg>
