<svg width="282" height="46" viewBox="0 0 282 46" fill="none" xmlns="http://www.w3.org/2000/svg">
<path d="M18.8 8.64L13.52 27.48C13.48 27.6 13.5 27.72 13.58 27.84C13.66 27.96 13.76 28.02 13.88 28.02H23.84C23.96 28.02 24.06 27.96 24.14 27.84C24.22 27.72 24.24 27.6 24.2 27.48L18.92 8.64C18.92 8.6 18.9 8.58 18.86 8.58C18.82 8.58 18.8 8.6 18.8 8.64ZM3.26 45C2.42 45 1.76 44.66 1.28 43.98C0.8 43.3 0.7 42.56 0.98 41.76L13.4 4.44C13.76 3.48 14.34 2.7 15.14 2.1C15.98 1.5 16.9 1.2 17.9 1.2H20.06C21.1 1.2 22.02 1.5 22.82 2.1C23.66 2.7 24.24 3.48 24.56 4.44L36.98 41.76C37.26 42.56 37.16 43.3 36.68 43.98C36.2 44.66 35.54 45 34.7 45H32.54C31.58 45 30.68 44.7 29.84 44.1C29.04 43.46 28.5 42.66 28.22 41.7L26.3 34.92C26.26 34.6 26.04 34.44 25.64 34.44H12.08C11.72 34.44 11.5 34.6 11.42 34.92L9.5 41.7C9.26 42.66 8.72 43.46 7.88 44.1C7.08 44.7 6.18 45 5.18 45H3.26ZM54.7733 19.2C50.1733 19.2 47.8733 22.6 47.8733 29.4C47.8733 32.8 48.4933 35.36 49.7333 37.08C50.9733 38.76 52.6533 39.6 54.7733 39.6C56.6533 39.6 58.2733 38.98 59.6333 37.74C60.9933 36.5 61.6733 35.08 61.6733 33.48V25.32C61.6733 23.72 60.9933 22.3 59.6333 21.06C58.2733 19.82 56.6533 19.2 54.7733 19.2ZM52.3733 45.6C48.8133 45.6 45.8533 44.16 43.4933 41.28C41.1333 38.36 39.9533 34.4 39.9533 29.4C39.9533 24.24 41.0733 20.26 43.3133 17.46C45.5933 14.62 48.6133 13.2 52.3733 13.2C55.7733 13.2 58.7733 14.44 61.3733 16.92C61.4133 16.96 61.4533 16.98 61.4933 16.98C61.5333 16.98 61.5533 16.96 61.5533 16.92V3.42C61.5533 2.5 61.8933 1.7 62.5733 1.02C63.2533 0.339997 64.0533 -3.57628e-06 64.9733 -3.57628e-06H66.1733C67.0933 -3.57628e-06 67.8933 0.339997 68.5733 1.02C69.2533 1.7 69.5933 2.5 69.5933 3.42V41.58C69.5933 42.5 69.2533 43.3 68.5733 43.98C67.8933 44.66 67.0933 45 66.1733 45H65.5133C64.5533 45 63.7333 44.68 63.0533 44.04C62.4133 43.36 62.0733 42.54 62.0333 41.58L61.9733 41.16C61.9733 41.12 61.9533 41.1 61.9133 41.1C61.8733 41.1 61.8333 41.12 61.7933 41.16C59.1533 44.12 56.0133 45.6 52.3733 45.6ZM96.5586 21.54C95.3986 19.86 93.6386 19.02 91.2786 19.02C88.9186 19.02 87.1386 19.86 85.9386 21.54C84.7786 23.18 84.1986 25.8 84.1986 29.4C84.1986 33 84.7786 35.64 85.9386 37.32C87.1386 38.96 88.9186 39.78 91.2786 39.78C93.6386 39.78 95.3986 38.96 96.5586 37.32C97.7586 35.64 98.3586 33 98.3586 29.4C98.3586 25.8 97.7586 23.18 96.5586 21.54ZM102.439 41.4C99.7986 44.2 96.0786 45.6 91.2786 45.6C86.4786 45.6 82.7386 44.2 80.0586 41.4C77.4186 38.56 76.0986 34.56 76.0986 29.4C76.0986 24.24 77.4186 20.26 80.0586 17.46C82.7386 14.62 86.4786 13.2 91.2786 13.2C96.0786 13.2 99.7986 14.62 102.439 17.46C105.119 20.26 106.459 24.24 106.459 29.4C106.459 34.56 105.119 38.56 102.439 41.4ZM131.598 21.54C130.438 19.86 128.678 19.02 126.318 19.02C123.958 19.02 122.178 19.86 120.978 21.54C119.818 23.18 119.238 25.8 119.238 29.4C119.238 33 119.818 35.64 120.978 37.32C122.178 38.96 123.958 39.78 126.318 39.78C128.678 39.78 130.438 38.96 131.598 37.32C132.798 35.64 133.398 33 133.398 29.4C133.398 25.8 132.798 23.18 131.598 21.54ZM137.478 41.4C134.838 44.2 131.118 45.6 126.318 45.6C121.518 45.6 117.778 44.2 115.098 41.4C112.458 38.56 111.138 34.56 111.138 29.4C111.138 24.24 112.458 20.26 115.098 17.46C117.778 14.62 121.518 13.2 126.318 13.2C131.118 13.2 134.838 14.62 137.478 17.46C140.158 20.26 141.498 24.24 141.498 29.4C141.498 34.56 140.158 38.56 137.478 41.4ZM151.111 45C150.191 45 149.391 44.66 148.711 43.98C148.031 43.3 147.691 42.5 147.691 41.58V17.22C147.691 16.3 148.031 15.5 148.711 14.82C149.391 14.14 150.191 13.8 151.111 13.8H152.311C153.231 13.8 154.031 14.14 154.711 14.82C155.391 15.5 155.731 16.3 155.731 17.22V19.74C155.731 19.78 155.751 19.8 155.791 19.8C155.871 19.8 155.911 19.78 155.911 19.74C157.071 18.14 158.591 16.84 160.471 15.84C162.351 14.8 164.411 14.16 166.651 13.92C167.491 13.84 168.211 14.12 168.811 14.76C169.411 15.36 169.711 16.08 169.711 16.92C169.711 17.76 169.411 18.48 168.811 19.08C168.211 19.68 167.491 20.02 166.651 20.1C159.571 20.66 156.031 24.26 156.031 30.9V41.58C156.031 42.5 155.691 43.3 155.011 43.98C154.331 44.66 153.531 45 152.611 45H151.111ZM188.053 29.0918H173.756V24.668H188.053V29.0918ZM211.154 24.54V20.16C209.994 19.56 208.254 19.26 205.934 19.26C200.014 19.26 197.054 23.72 197.054 32.64C197.054 39.16 199.034 42.42 202.994 42.42C204.674 42.42 206.074 41.86 207.194 40.74C208.354 39.58 209.214 38.02 209.774 36.06C210.694 32.66 211.154 28.82 211.154 24.54ZM202.574 45.72C199.094 45.72 196.554 44.52 194.954 42.12C193.354 39.72 192.554 36.32 192.554 31.92C192.554 27.48 193.674 23.74 195.914 20.7C198.194 17.62 201.534 16.08 205.934 16.08C207.494 16.08 209.034 16.24 210.554 16.56C212.114 16.88 213.654 17.34 215.174 17.94V33.18C215.174 37.26 215.534 39.84 216.254 40.92C216.934 42 218.074 42.54 219.674 42.54L219.794 45.24C219.154 45.4 218.354 45.48 217.394 45.48C215.274 45.48 213.754 44.74 212.834 43.26C212.154 42.18 211.814 40.9 211.814 39.42C211.814 38.94 211.854 38.42 211.934 37.86H211.574C210.894 40.26 209.794 42.18 208.274 43.62C206.794 45.02 204.894 45.72 202.574 45.72ZM231.569 45.48C229.729 45.48 228.449 45.04 227.729 44.16C227.009 43.28 226.649 41.84 226.649 39.84V16.8H230.969V37.38C230.969 39.5 231.129 40.88 231.449 41.52C231.769 42.12 232.689 42.42 234.209 42.42L234.329 45.06C233.409 45.34 232.489 45.48 231.569 45.48ZM226.229 7.38C226.229 5.5 227.149 4.56 228.989 4.56C230.669 4.56 231.509 5.48 231.509 7.32C231.509 9.12 230.629 10.02 228.869 10.02C227.109 10.02 226.229 9.14 226.229 7.38ZM246.609 18C246.609 20.12 246.449 21.9 246.129 23.34H246.489C247.089 21.06 248.089 19.28 249.489 18C250.889 16.72 252.629 16.08 254.709 16.08C259.629 16.08 262.089 18.5 262.089 23.34H262.449C263.689 18.5 266.449 16.08 270.729 16.08C273.929 16.08 276.049 16.84 277.089 18.36C278.129 19.84 278.649 22.2 278.649 25.44C278.649 25.6 278.609 27.62 278.529 31.5C278.489 35.34 278.469 37.86 278.469 39.06C278.469 40.26 278.589 41.12 278.829 41.64C279.109 42.16 279.969 42.42 281.409 42.42L281.529 45.12C280.969 45.36 280.149 45.48 279.069 45.48C277.149 45.48 275.829 45.04 275.109 44.16C274.429 43.28 274.089 41.88 274.089 39.96C274.089 39.88 274.129 37.68 274.209 33.36C274.289 29 274.329 26.64 274.329 26.28C274.329 24.04 274.089 22.36 273.609 21.24C273.129 20.08 271.989 19.5 270.189 19.5C265.149 19.5 262.629 25.06 262.629 36.18V45H258.489V27.36C258.489 23.8 258.189 21.64 257.589 20.88C256.789 19.96 255.649 19.5 254.169 19.5C249.049 19.5 246.489 25.22 246.489 36.66V45H242.349V16.8L246.609 16.26V18Z" fill="white"/>
</svg>
