e2c21f14c1db183d5ef0441d9080f9159bdda5cf24bd51e1205f3176ca97d14f  tor-browser-linux32-6.5.2_ar.tar.xz
fbcf5042bcb84b16cc6af804450897f1fa8dbe7be7bfb6d3ab609cadd1966dbf  tor-browser-linux32-6.5.2_de.tar.xz
48be7b06a9709efb4ee85783d9120b867656c03f5adbc4333b1cb13ad5155ef4  tor-browser-linux32-6.5.2_en-US.tar.xz
9ee117e55334d9a9b24fb9145d2f4f1bfd38c6d86a70781deb6f1e0f63968a96  tor-browser-linux32-6.5.2_es-ES.tar.xz
b8993fbabdec50fe5c6e905c613680328dcef14ae86f583f176cedd1f0ff4d8d  tor-browser-linux32-6.5.2_fa.tar.xz
81cbd25908b5037a56be8b789e987d86aa8a4067092d357ca91ba7af8502f702  tor-browser-linux32-6.5.2_fr.tar.xz
7b9a52b44a13b7726e768e20ccc27d91b027f90442780bd4d1bad502844096a1  tor-browser-linux32-6.5.2_it.tar.xz
74fa492cda33efe9304364d0a62d84e7d1de0b335aff802c9bc299f295bf36ee  tor-browser-linux32-6.5.2_ja.tar.xz
a26486edda8951ffcec8fa5d5d183ab2d04843ad75e49ac1422cf49985ef034a  tor-browser-linux32-6.5.2_ko.tar.xz
bf2f61f7200979ce59e40c4266c12b871ee42e239dc15292de74335cb9e2cedd  tor-browser-linux32-6.5.2_nl.tar.xz
ac2647e29d4a903524fa4b46f0674918a2284cd2152255f8a47ddb981c2347bb  tor-browser-linux32-6.5.2_pl.tar.xz
27059068ea938e79be4f006ffe8dcf67b37ef11da8d8d969460745d84939c515  tor-browser-linux32-6.5.2_pt-BR.tar.xz
5d82e37cd2a8e90c36c865e5604c31ccc0c8b89fee71630af45b98bb43c3b348  tor-browser-linux32-6.5.2_ru.tar.xz
6e716eae5a9364248cf2da1dbb3abafef9a31c9b00991999f1a557d1985f4e63  tor-browser-linux32-6.5.2_tr.tar.xz
3d87410395460a65cce222bd7445656e3fc57c718265189d97e0413e5a41a518  tor-browser-linux32-6.5.2_vi.tar.xz
c854a68af9c59db502b312a0879f78d34c1e285dd22199c56759b4189a3f5e8d  tor-browser-linux32-6.5.2_zh-CN.tar.xz
