<?xml version="1.0" encoding="UTF-8" standalone="no"?>
<!-- Created with Inkscape (http://www.inkscape.org/) -->

<svg
   xmlns:dc="http://purl.org/dc/elements/1.1/"
   xmlns:cc="http://creativecommons.org/ns#"
   xmlns:rdf="http://www.w3.org/1999/02/22-rdf-syntax-ns#"
   xmlns:svg="http://www.w3.org/2000/svg"
   xmlns="http://www.w3.org/2000/svg"
   xmlns:xlink="http://www.w3.org/1999/xlink"
   xmlns:sodipodi="http://sodipodi.sourceforge.net/DTD/sodipodi-0.dtd"
   xmlns:inkscape="http://www.inkscape.org/namespaces/inkscape"
   width="281.24243"
   height="278.90475"
   id="svg2"
   sodipodi:version="0.32"
   inkscape:version="0.91 r13725"
   version="1.0"
   sodipodi:docname="inkscape-web-i18n.svg"
   inkscape:output_extension="org.inkscape.output.svg.inkscape"
   style="enable-background:new"
   inkscape:export-filename="/home/doctormo/Desktop/inkscape-web-i18n.png"
   inkscape:export-xdpi="204.81"
   inkscape:export-ydpi="204.81">
  <defs
     id="defs4">
    <linearGradient
       id="linearGradient5733">
      <stop
         style="stop-color:#ffffff;stop-opacity:1;"
         offset="0"
         id="stop5735" />
      <stop
         style="stop-color:#ffffff;stop-opacity:0"
         offset="1"
         id="stop5737" />
    </linearGradient>
    <clipPath
       id="clipoutline1">
      <path
         id="outline1"
         d="M 54.1,12.5 12.9,54.7 C -2.7,70.3 23,69 32.3,74.9 36.6,77.7 18.5,81.3 22.2,85 c 3.6,3.7 21.7,7.1 25.3,10.7 3.6,3.7 -7.3,7.6 -3.7,11.3 3.5,3.7 11.9,0.2 13.4,8.6 1.1,6.2 15.4,3.1 21.8,-2.2 4,-3.4 -6.9,-3.4 -3.3,-7.1 9,-9.1 17,-4.1 20.3,-12.5 1.8,-4.5 -13.6,-7.7 -9.5,-10.6 9.8,-6.9 45.8,-10.4 29.2,-27 L 73,12.5 c -5.3,-5 -14,-5 -18.9,0 z m -9.9,64.7 c 0.9,0 30.8,4 19.3,7.1 -4.4,1.2 -24.6,-7.1 -19.3,-7.1 z m 57.2,16.6 c 0,2.1 16.3,3.3 15.4,-0.5 -1.3,-6.4 -13.6,-5.9 -15.4,0.5 z m -69.5,11.1 c 3.7,3.2 9.3,-0.7 11.1,-5.2 -3.6,-4.7 -16.9,0.3 -11.1,5.2 z m 67.5,-6.7 c -4.6,4.2 0.8,8.6 5.3,5.7 1.2,-0.8 -0.1,-4.7 -5.3,-5.7 z"
         inkscape:connector-curvature="0" />
    </clipPath>
    <linearGradient
       gradientUnits="userSpaceOnUse"
       id="linearGradient5785">
      <stop
         offset="0"
         style="stop-color:#c0cdf9;stop-opacity:1"
         id="stop5787" />
      <stop
         offset="1"
         style="stop-color:#07092d;stop-opacity:0.28804347"
         id="stop5789" />
    </linearGradient>
    <linearGradient
       id="linearGradient10981-3-9">
      <stop
         offset="0"
         style="stop-color:#729fcf;stop-opacity:1"
         id="stop10983-2-0" />
      <stop
         offset="1"
         style="stop-color:#729fcf;stop-opacity:0"
         id="stop10985-3-7" />
    </linearGradient>
    <linearGradient
       gradientUnits="userSpaceOnUse"
       xlink:href="#linearGradient5785"
       id="linearGradient20622"
       y2="40"
       x2="60"
       y1="20"
       x1="82.118591" />
    <filter
       style="color-interpolation-filters:sRGB"
       id="filter6017-3-0-8">
      <feGaussianBlur
         inkscape:collect="always"
         stdDeviation="0.80546496"
         id="feGaussianBlur6019-9-8-2" />
    </filter>
    <filter
       style="color-interpolation-filters:sRGB"
       id="filter6031-0-9-2">
      <feGaussianBlur
         inkscape:collect="always"
         stdDeviation="3.4903482"
         id="feGaussianBlur6033-8-8-3" />
    </filter>
    <clipPath
       id="clipPath9086-1-0-9">
      <use
         xlink:href="#outline1"
         height="300"
         width="400"
         y="0"
         x="0"
         style="opacity:0.25;fill:#ffffff;fill-opacity:1"
         id="use9088-0-7-3"
         transform="translate(1.0095461e-6,0)" />
    </clipPath>
    <filter
       style="color-interpolation-filters:sRGB"
       id="filter8490-0-2-5">
      <feGaussianBlur
         inkscape:collect="always"
         stdDeviation="2.4163949"
         id="feGaussianBlur8492-5-5-9" />
    </filter>
    <linearGradient
       gradientTransform="matrix(1.7576296,2.8325319e-8,-2.837214e-8,1.754729,134.14696,311.50758)"
       gradientUnits="userSpaceOnUse"
       xlink:href="#linearGradient5733"
       id="shinySpecular-0-8-9"
       y2="60"
       x2="58"
       y1="35"
       x1="33" />
    <linearGradient
       gradientUnits="userSpaceOnUse"
       xlink:href="#linearGradient5733"
       id="IcecapTip-0-7-8"
       y2="50"
       x2="90"
       y1="20"
       x1="60"
       gradientTransform="matrix(1.7416344,2.8067547e-8,-2.8113942e-8,1.7387602,134.82458,312.17386)" />
    <radialGradient
       gradientTransform="matrix(1.4483002,2.3340279e-8,-1.5648879e-8,0.9678347,44.763324,267.71859)"
       gradientUnits="userSpaceOnUse"
       xlink:href="#linearGradient5733"
       id="radialGradient9177-1-8-3"
       fy="250.89737"
       fx="116.31038"
       r="30.599579"
       cy="250.89737"
       cx="116.31038" />
    <radialGradient
       gradientTransform="matrix(2.0032532,0,0,1.340898,-132.8752,-95.166065)"
       gradientUnits="userSpaceOnUse"
       xlink:href="#linearGradient5733"
       id="radialGradient8574-0-5-5"
       fy="251.99396"
       fx="132.44434"
       r="30.599579"
       cy="251.99396"
       cx="132.44434" />
    <filter
       style="color-interpolation-filters:sRGB"
       id="filter8732-3-6-1"
       x="-0.078079157"
       width="1.1561583"
       y="-0.11422065"
       height="1.2284414">
      <feGaussianBlur
         inkscape:collect="always"
         stdDeviation="1.9579068"
         id="feGaussianBlur8734-5-7-4" />
    </filter>
    <radialGradient
       gradientTransform="matrix(0.92245387,1.4865931e-8,0,0.38988347,114.40869,377.54902)"
       gradientUnits="userSpaceOnUse"
       xlink:href="#linearGradient5733"
       id="radialGradient8744-9-0-2"
       fy="168.5"
       fx="210.25"
       r="34.25"
       cy="168.5"
       cx="210.25" />
    <radialGradient
       gradientTransform="matrix(1,0,0,0.4233577,0,97.164234)"
       gradientUnits="userSpaceOnUse"
       xlink:href="#linearGradient5733"
       id="radialGradient8768-6-9-4"
       fy="182.08189"
       fx="217.5"
       r="34.25"
       cy="182.08189"
       cx="217.5" />
    <filter
       style="color-interpolation-filters:sRGB"
       id="filter8764-9-5-2"
       x="-0.074262142"
       width="1.1485243"
       y="-0.1754123"
       height="1.3508246">
      <feGaussianBlur
         inkscape:collect="always"
         stdDeviation="2.1195652"
         id="feGaussianBlur8766-2-0-5" />
    </filter>
    <linearGradient
       gradientUnits="userSpaceOnUse"
       xlink:href="#linearGradient5733"
       id="linearGradient8912-9-6-6"
       y2="201.5"
       x2="231.75"
       y1="195.1875"
       x1="231.625"
       gradientTransform="matrix(0.92245387,1.4865931e-8,-1.4890504e-8,0.92093156,113.25563,286.45578)" />
    <linearGradient
       gradientUnits="userSpaceOnUse"
       xlink:href="#linearGradient5733"
       id="linearGradient8910-3-3-0"
       y2="200.07138"
       x2="231.37646"
       y1="195.62132"
       x1="231.37646" />
    <filter
       style="color-interpolation-filters:sRGB"
       id="filter8906-3-7-0"
       x="-0.085441329"
       width="1.1708827"
       y="-0.27823201"
       height="1.556464">
      <feGaussianBlur
         inkscape:collect="always"
         stdDeviation="0.56515877"
         id="feGaussianBlur8908-7-7-3" />
    </filter>
    <radialGradient
       gradientTransform="matrix(1,0,0,0.1477455,0,174.56924)"
       gradientUnits="userSpaceOnUse"
       xlink:href="#linearGradient5733"
       id="radialGradient8922-9-9-1"
       fy="204.83229"
       fx="228.21875"
       r="14.09375"
       cy="204.83229"
       cx="228.21875" />
    <filter
       style="color-interpolation-filters:sRGB"
       id="filter8980-1-3-2"
       x="-0.069862768"
       width="1.1397254"
       y="-0.47285891"
       height="1.9457178">
      <feGaussianBlur
         inkscape:collect="always"
         stdDeviation="0.82052366"
         id="feGaussianBlur8982-9-3-6" />
    </filter>
    <linearGradient
       gradientUnits="userSpaceOnUse"
       xlink:href="#linearGradient5733"
       id="linearGradient8990-4-2-0"
       y2="201.5"
       x2="231.75"
       y1="195.1875"
       x1="231.625"
       gradientTransform="matrix(0.35573162,-0.18006687,0.41715068,0.82138546,144.84733,364.83492)" />
    <linearGradient
       gradientUnits="userSpaceOnUse"
       xlink:href="#linearGradient5733"
       id="linearGradient8992-2-5-2"
       y2="200.07138"
       x2="231.37646"
       y1="195.62132"
       x1="231.37646" />
    <radialGradient
       gradientTransform="matrix(1,0,0,0.1477455,0,174.56924)"
       gradientUnits="userSpaceOnUse"
       xlink:href="#linearGradient5733"
       id="radialGradient8994-0-1-1"
       fy="204.83229"
       fx="228.21875"
       r="14.09375"
       cy="204.83229"
       cx="228.21875" />
    <radialGradient
       gradientTransform="matrix(0.92245387,1.4865931e-8,0,0.37489687,114.40869,394.67458)"
       gradientUnits="userSpaceOnUse"
       xlink:href="#linearGradient5733"
       id="radialGradient9004-6-2-3"
       fy="187.86935"
       fx="89.875"
       r="22.75"
       cy="187.86935"
       cx="89.875" />
    <linearGradient
       gradientUnits="userSpaceOnUse"
       xlink:href="#linearGradient5733"
       id="linearGradient9023-6-3-6"
       y2="201.5"
       x2="231.75"
       y1="195.1875"
       x1="231.625" />
    <linearGradient
       gradientUnits="userSpaceOnUse"
       xlink:href="#linearGradient5733"
       id="linearGradient9025-1-0-8"
       y2="200.07138"
       x2="231.37646"
       y1="195.62132"
       x1="231.37646" />
    <radialGradient
       gradientTransform="matrix(1.1850746,-0.3283582,0.1228557,0.4433973,-45.068314,152.92161)"
       gradientUnits="userSpaceOnUse"
       xlink:href="#linearGradient5733"
       id="radialGradient9046-1-8-3"
       fy="230.83626"
       fx="90.28125"
       r="10.46875"
       cy="230.83626"
       cx="90.28125" />
    <filter
       style="color-interpolation-filters:sRGB"
       id="filter9068-2-5-3"
       x="-0.076179281"
       width="1.1523587"
       y="-0.1655701"
       height="1.3311402">
      <feGaussianBlur
         inkscape:collect="always"
         stdDeviation="0.66458488"
         id="feGaussianBlur9070-7-1-7" />
    </filter>
    <radialGradient
       gradientTransform="matrix(1.7221535,0,0,1.6949765,-49.39526,-14.078057)"
       gradientUnits="userSpaceOnUse"
       xlink:href="#linearGradient5733"
       id="radialGradient11553-3-7-6"
       fy="21.225746"
       fx="68.39994"
       r="54.783398"
       cy="21.225746"
       cx="68.39994" />
    <filter
       style="color-interpolation-filters:sRGB"
       id="filter9298-4-7-0">
      <feGaussianBlur
         inkscape:collect="always"
         stdDeviation="0.32610678"
         id="feGaussianBlur9300-4-6-8" />
    </filter>
    <linearGradient
       gradientUnits="userSpaceOnUse"
       xlink:href="#linearGradient5733"
       id="linearGradient5905-4-8-5"
       y2="223.5"
       x2="153.5"
       y1="208.16444"
       x1="95.5" />
    <filter
       style="color-interpolation-filters:sRGB"
       id="filter5983-8-2-7"
       x="-0.082508981"
       width="1.165018"
       y="-0.12233575"
       height="1.2446715">
      <feGaussianBlur
         inkscape:collect="always"
         stdDeviation="3.6868363"
         id="feGaussianBlur5985-3-9-7" />
    </filter>
    <radialGradient
       gradientTransform="matrix(1.3515234,0,0,1.7175707,-63.705646,-153.95568)"
       gradientUnits="userSpaceOnUse"
       xlink:href="#linearGradient5733"
       id="radialGradient5811-3-3-7"
       fy="214.55121"
       fx="181.22731"
       r="22.466398"
       cy="214.55121"
       cx="181.22731" />
    <filter
       style="color-interpolation-filters:sRGB"
       id="filter5845-5-0-8">
      <feGaussianBlur
         inkscape:collect="always"
         stdDeviation="1.2409356"
         id="feGaussianBlur5847-5-8-6" />
    </filter>
    <linearGradient
       gradientTransform="matrix(0.85826228,1.3831443e-8,-1.3854306e-8,0.8568459,124.3741,295.26873)"
       gradientUnits="userSpaceOnUse"
       xlink:href="#linearGradient5733"
       id="linearGradient5822-7-2-3"
       y2="187.65974"
       x2="82.754066"
       y1="180.47572"
       x1="73.712105" />
    <linearGradient
       gradientTransform="translate(-130.16572,-83.352786)"
       gradientUnits="userSpaceOnUse"
       xlink:href="#linearGradient10981-3-9"
       id="linearGradient1539-7-2"
       y2="144.5"
       x2="153.70045"
       y1="217.5"
       x1="180.81293" />
    <filter
       style="color-interpolation-filters:sRGB"
       id="filter10997-7-2-1-4">
      <feGaussianBlur
         inkscape:collect="always"
         stdDeviation="2.7696726"
         id="feGaussianBlur10999-0-7-7-6" />
    </filter>
    <linearGradient
       gradientTransform="translate(-7.5,-7.5)"
       gradientUnits="userSpaceOnUse"
       y2="17"
       x2="13.5"
       y1="10"
       x1="13.5"
       id="Glass">
      <stop
         id="stop7"
         offset="0"
         style="stop-color:#f8f8f8" />
      <stop
         id="stop9"
         offset="1"
         style="stop-color:#c0c0c0" />
    </linearGradient>
    <linearGradient
       gradientUnits="userSpaceOnUse"
       y2="29"
       x2="15"
       y1="1"
       x1="15"
       id="Background">
      <stop
         id="stop12"
         offset="0"
         style="stop-color:#f8f8f8" />
      <stop
         id="stop14"
         offset="1"
         style="stop-color:#b4b4b4" />
    </linearGradient>
  </defs>
  <sodipodi:namedview
     id="base"
     pagecolor="#ffffff"
     bordercolor="#666666"
     borderopacity="1.0"
     gridtolerance="10000"
     guidetolerance="10"
     objecttolerance="10"
     inkscape:pageopacity="0.0"
     inkscape:pageshadow="2"
     inkscape:zoom="2.643364"
     inkscape:cx="41.209817"
     inkscape:cy="195.90056"
     inkscape:document-units="px"
     inkscape:current-layer="layer7"
     showgrid="false"
     inkscape:window-width="1855"
     inkscape:window-height="1056"
     inkscape:window-x="65"
     inkscape:window-y="24"
     showguides="true"
     inkscape:guide-bbox="true"
     inkscape:window-maximized="1"
     fit-margin-top="0"
     fit-margin-left="0"
     fit-margin-right="0"
     fit-margin-bottom="0" />
  <metadata
     id="metadata7">
    <rdf:RDF>
      <cc:Work
         rdf:about="">
        <dc:format>image/svg+xml</dc:format>
        <dc:type
           rdf:resource="http://purl.org/dc/dcmitype/StillImage" />
        <dc:title></dc:title>
      </cc:Work>
    </rdf:RDF>
  </metadata>
  <g
     inkscape:groupmode="layer"
     id="layer6"
     inkscape:label="bgr"
     style="display:inline"
     transform="translate(-120.53881,-271.27597)" />
  <g
     inkscape:label="logo"
     inkscape:groupmode="layer"
     id="layer1"
     style="display:inline"
     transform="translate(-120.53881,-271.27597)" />
  <g
     inkscape:groupmode="layer"
     id="layer5"
     inkscape:label="draw"
     style="display:inline"
     transform="translate(-120.53881,-271.27597)" />
  <g
     inkscape:groupmode="layer"
     id="layer7"
     inkscape:label="draw2"
     style="display:inline"
     transform="translate(-120.53881,-271.27597)">
    <g
       id="g23537"
       transform="matrix(0.93459471,0,0,0.93459471,32.749832,27.347388)">
      <path
         style="fill:#000000;fill-opacity:1"
         id="use7631"
         d="m 226.25204,354.08737 -75.51569,77.22094 c -28.59332,28.54613 18.51234,26.16728 35.55835,36.96357 7.88149,5.12368 -25.29409,11.71123 -18.51234,18.48181 6.59846,6.77054 39.77405,12.99214 46.3725,19.57971 6.59847,6.77056 -13.38021,13.90709 -6.78175,20.67763 6.41516,6.77058 21.81156,0.36599 24.56092,15.73698 2.0162,11.34525 28.22674,5.67263 39.95734,-4.02573 7.33161,-6.2216 -12.64704,-6.2216 -6.04859,-12.99216 16.49614,-16.65191 31.15939,-7.5025 37.20797,-22.8735 3.29923,-8.23445 -24.92751,-14.09007 -17.4126,-19.39673 17.96247,-12.62616 83.94706,-19.03074 53.52084,-49.40676 l -78.26506,-79.96576 c -9.71439,-9.14942 -25.66066,-9.14942 -34.64189,0 z m 86.69641,148.76925 c 0,3.84276 29.87634,6.03861 28.22674,-0.91493 -2.38279,-11.71124 -24.92752,-10.7963 -28.22674,0.91493 z M 185.56154,523.1683 c 6.78175,5.85562 17.04601,-1.28093 20.34525,-9.51538 -6.59847,-8.60044 -30.97609,0.54896 -20.34525,9.51538 z m 123.7211,-12.2602 c -8.43137,7.6855 1.46631,15.73696 9.71438,10.43031 2.1995,-1.46389 -0.18328,-8.60044 -9.71438,-10.43031 z"
         inkscape:connector-curvature="0" />
      <path
         style="fill:none"
         id="use7639"
         d="m 226.25204,354.08737 -75.51569,77.22094 c -28.59332,28.54613 18.51234,26.16728 35.55835,36.96357 7.88149,5.12368 -25.29409,11.71123 -18.51234,18.48181 6.59846,6.77054 39.77405,12.99214 46.3725,19.57971 6.59847,6.77056 -13.38021,13.90709 -6.78175,20.67763 6.41516,6.77058 21.81156,0.36599 24.56092,15.73698 2.0162,11.34525 28.22674,5.67263 39.95734,-4.02573 7.33161,-6.2216 -12.64704,-6.2216 -6.04859,-12.99216 16.49614,-16.65191 31.15939,-7.5025 37.20797,-22.8735 3.29923,-8.23445 -24.92751,-14.09007 -17.4126,-19.39673 17.96247,-12.62616 83.94706,-19.03074 53.52084,-49.40676 l -78.26506,-79.96576 c -9.71439,-9.14942 -25.66066,-9.14942 -34.64189,0 z m 86.69641,148.76925 c 0,3.84276 29.87634,6.03861 28.22674,-0.91493 -2.38279,-11.71124 -24.92752,-10.7963 -28.22674,0.91493 z M 185.56154,523.1683 c 6.78175,5.85562 17.04601,-1.28093 20.34525,-9.51538 -6.59847,-8.60044 -30.97609,0.54896 -20.34525,9.51538 z m 123.7211,-12.2602 c -8.43137,7.6855 1.46631,15.73696 9.71438,10.43031 2.1995,-1.46389 -0.18328,-8.60044 -9.71438,-10.43031 z"
         inkscape:connector-curvature="0" />
      <path
         style="fill:#ffffff;fill-opacity:1"
         id="icecap"
         d="m 256.31167,359.57701 29.87636,30.376 c 2.74936,2.74483 2.74936,8.41746 1.09974,10.06435 l -14.84652,-12.07721 -2.93266,17.74984 -12.28046,-6.58757 -19.97866,12.62617 -6.59846,-26.53326 -10.63086,23.05649 -26.57712,-0.18299 c -5.13213,0 -4.39896,-5.30666 0.91646,-10.61331 10.44756,-11.52824 30.79281,-31.10795 37.20798,-37.87852 6.59845,-6.77055 18.14575,-6.58756 24.7442,10e-6 z"
         inkscape:connector-curvature="0" />
      <path
         d="m 274.2199,283.30112 c -18.78939,6.65647 -33.40597,-12.39094 -61.13166,6.66662 l 6.86889,57.09542 c 27.72572,-19.05698 42.3695,0.21981 61.1589,-6.43979 15.69732,-5.82571 16.8064,-12.65194 28.388,-11.90247 -6.61652,-22.70939 -7.58099,-44.65335 -6.89607,-57.32187 -12.01758,-0.24535 -21.30234,9.1801 -28.38806,11.90209 z"
         id="path3028"
         style="color:#000000;display:inline;overflow:visible;visibility:visible;fill:#000000;fill-opacity:1;fill-rule:nonzero;stroke:none;stroke-width:4.09800005;marker:none;enable-background:accumulate"
         inkscape:connector-curvature="0" />
      <path
         d="m 203.0816,284.66967 1.93331,-0.23258 c 1.58762,-0.19101 3.01947,0.93333 3.21048,2.52096 l 11.66181,96.93545 c 0.191,1.58768 -0.93334,3.01942 -2.52097,3.21042 l -1.93331,0.23258 c -1.58757,0.191 -3.01941,-0.93322 -3.21042,-2.52091 l -11.6618,-96.93544 c -0.19101,-1.58763 0.93333,-3.01948 2.5209,-3.21048 z"
         id="rect3030"
         style="color:#000000;display:inline;overflow:visible;visibility:visible;fill:#010209;fill-opacity:1;fill-rule:nonzero;stroke:none;stroke-width:4.09800005;marker:none;enable-background:accumulate"
         inkscape:connector-curvature="0" />
      <path
         d="m 210.43347,281.07408 c 0.44561,3.70397 -2.19583,7.06785 -5.89978,7.51347 -3.70397,0.44559 -7.06785,-2.19583 -7.51347,-5.89979 -0.44559,-3.70396 2.19583,-7.06786 5.89979,-7.51345 3.70396,-0.44562 7.06786,2.19582 7.51346,5.89977 z"
         id="path3032"
         style="color:#000000;display:inline;overflow:visible;visibility:visible;fill:#000000;fill-opacity:1;fill-rule:nonzero;stroke:none;stroke-width:4.09800005;marker:none;enable-background:accumulate"
         inkscape:connector-curvature="0" />
      <rect
         transform="matrix(0,1,-1,0,0,0)"
         y="-287.83096"
         x="283.7663"
         height="57.00457"
         width="57.00457"
         id="rect4782"
         style="color:#000000;display:inline;overflow:visible;visibility:visible;fill:none;stroke:none;stroke-width:6.58203125;marker:none;enable-background:accumulate" />
      <path
         id="path4157"
         d="m 273.81525,327.63771 c 0.009,0.0133 0.024,0.021 0.0336,0.0336 0.0119,0.0146 0.0182,0.0337 0.0301,0.0487 z"
         style="font-style:normal;font-variant:normal;font-weight:normal;font-stretch:normal;font-size:15px;line-height:125%;font-family:Ubuntu;-inkscape-font-specification:Ubuntu;text-align:center;letter-spacing:0px;word-spacing:0px;writing-mode:lr-tb;text-anchor:middle;display:inline;fill:#808080;fill-opacity:1;stroke:none;stroke-width:1.64550781"
         inkscape:connector-curvature="0" />
      <path
         id="path4344"
         d="m 244.81659,327.64582 -0.0639,0.0823 c 0.012,-0.0146 0.0182,-0.0337 0.0301,-0.0487 0.009,-0.0133 0.024,-0.021 0.0336,-0.0336 z"
         style="font-style:normal;font-variant:normal;font-weight:normal;font-stretch:normal;font-size:15px;line-height:125%;font-family:Ubuntu;-inkscape-font-specification:Ubuntu;text-align:center;letter-spacing:0px;word-spacing:0px;writing-mode:lr-tb;text-anchor:middle;display:inline;fill:#808080;fill-opacity:1;stroke:none;stroke-width:1.64550781"
         inkscape:connector-curvature="0" />
      <ellipse
         cy="312.25217"
         cx="259.39844"
         id="path2878"
         style="color:#000000;clip-rule:nonzero;display:inline;overflow:visible;visibility:visible;opacity:1;isolation:auto;mix-blend-mode:normal;color-interpolation:sRGB;color-interpolation-filters:linearRGB;solid-color:#000000;solid-opacity:1;fill:#ffffff;fill-opacity:1;fill-rule:nonzero;stroke:#ffffff;stroke-width:3;stroke-linecap:round;stroke-linejoin:miter;stroke-miterlimit:4;stroke-dasharray:none;stroke-dashoffset:0;stroke-opacity:1;marker:none;paint-order:normal;color-rendering:auto;image-rendering:auto;shape-rendering:auto;text-rendering:auto;enable-background:accumulate"
         rx="23.561882"
         ry="23.647989" />
      <path
         inkscape:connector-curvature="0"
         id="path4176-0"
         d="m 248.3656,291.11161 2.00751,2.21881 4.75461,-1.69053 1.58487,2.95844 -5.81119,3.59236 -4.01498,4.96592 -2.32449,-1.37355 -2.43014,1.26789 1.37357,2.32448 1.58487,-0.7396 2.74709,4.12066 2.32447,-1.37355 5.59988,2.64143 5.17724,4.86027 -2.21882,4.86027 -5.17724,7.18474 0.84527,3.90936 -3.06408,-1.90185 -1.69053,-10.5658 -2.85278,-3.90935 -0.10566,-4.75461 -4.43765,-3.27539 -3.38104,-0.95092 -0.63394,-2.64144 3.69802,-6.86777 z"
         style="color:#000000;display:inline;overflow:visible;visibility:visible;opacity:1;fill:#000000;fill-opacity:1;fill-rule:nonzero;stroke:none;stroke-width:6.58333397;stroke-linecap:butt;stroke-linejoin:miter;stroke-miterlimit:4;stroke-dasharray:none;stroke-dashoffset:0;stroke-opacity:1;marker:none;enable-background:accumulate" />
      <path
         inkscape:connector-curvature="0"
         id="path4178"
         d="m 259.24839,289.10411 -0.10566,3.2754 2.85276,0.42263 3.2754,-3.16974 z"
         style="color:#000000;display:inline;overflow:visible;visibility:visible;opacity:1;fill:#000000;fill-opacity:1;fill-rule:nonzero;stroke:none;stroke-width:6.58333397;stroke-linecap:butt;stroke-linejoin:miter;stroke-miterlimit:4;stroke-dasharray:none;stroke-dashoffset:0;stroke-opacity:1;marker:none;enable-background:accumulate" />
      <path
         inkscape:connector-curvature="0"
         id="path4180"
         d="m 270.02549,291.74555 -1.37355,2.21883 1.90185,1.69053 -1.90185,1.58485 0.73961,1.90185 4.22631,-2.00751 2.64146,2.00751 0.84525,-2.64146 -5.28289,-4.01499 z"
         style="color:#000000;display:inline;overflow:visible;visibility:visible;opacity:1;fill:#000000;fill-opacity:1;fill-rule:nonzero;stroke:none;stroke-width:6.58333397;stroke-linecap:butt;stroke-linejoin:miter;stroke-miterlimit:4;stroke-dasharray:none;stroke-dashoffset:0;stroke-opacity:1;marker:none;enable-background:accumulate" />
      <path
         inkscape:connector-curvature="0"
         id="path4182"
         d="m 279.42906,300.72648 -4.12067,0.7396 -1.58487,-1.69053 -4.86026,0.31698 -2.95843,4.64895 2.0075,4.96592 6.5508,2.0075 1.26789,7.71305 1.58487,4.015 3.69804,-2.11317 2.7471,-7.71303 -1.58487,-7.5017 z"
         style="color:#000000;display:inline;overflow:visible;visibility:visible;opacity:1;fill:#000000;fill-opacity:1;fill-rule:nonzero;stroke:none;stroke-width:6.58333397;stroke-linecap:butt;stroke-linejoin:miter;stroke-miterlimit:4;stroke-dasharray:none;stroke-dashoffset:0;stroke-opacity:1;marker:none;enable-background:accumulate" />
    </g>
  </g>
  <g
     inkscape:groupmode="layer"
     id="layer3"
     inkscape:label="zobrati"
     style="display:inline;opacity:1"
     transform="translate(-120.53881,-271.27597)" />
  <g
     inkscape:groupmode="layer"
     id="layer2"
     inkscape:label="texts"
     style="display:inline"
     transform="translate(-120.53881,-271.27597)" />
  <style
     id="style26"
     type="text/css" />
</svg>
