<?xml version="1.0" encoding="UTF-8" standalone="no"?>
<!-- Generator: Adobe Illustrator 14.0.0, SVG Export Plug-In  -->

<svg
   xmlns:sketch="http://www.bohemiancoding.com/sketch/ns"
   xmlns:dc="http://purl.org/dc/elements/1.1/"
   xmlns:cc="http://creativecommons.org/ns#"
   xmlns:rdf="http://www.w3.org/1999/02/22-rdf-syntax-ns#"
   xmlns:svg="http://www.w3.org/2000/svg"
   xmlns="http://www.w3.org/2000/svg"
   xmlns:sodipodi="http://sodipodi.sourceforge.net/DTD/sodipodi-0.dtd"
   xmlns:inkscape="http://www.inkscape.org/namespaces/inkscape"
   version="1.1"
   x="0px"
   y="0px"
   width="1307.549"
   height="380.608"
   viewBox="-0.835 -0.92 1307.549 380.608"
   enable-background="new -0.835 -0.92 761 101"
   xml:space="preserve"
   id="svg3051"
   inkscape:version="0.91 r13725"
   sodipodi:docname="Inkscape-sponsor-logos2.svg"><sodipodi:namedview
     pagecolor="#ffffff"
     bordercolor="#666666"
     borderopacity="1"
     objecttolerance="10"
     gridtolerance="10"
     guidetolerance="10"
     inkscape:pageopacity="0"
     inkscape:pageshadow="2"
     inkscape:window-width="1855"
     inkscape:window-height="1056"
     id="namedview3075"
     showgrid="false"
     inkscape:zoom="0.5024044"
     inkscape:cx="688.36318"
     inkscape:cy="-97.529617"
     inkscape:window-x="65"
     inkscape:window-y="24"
     inkscape:window-maximized="1"
     inkscape:current-layer="g4722"
     fit-margin-top="0"
     fit-margin-left="0"
     fit-margin-right="0"
     fit-margin-bottom="0"
     inkscape:snap-center="true"
     showguides="true"
     inkscape:guide-bbox="true"
     inkscape:snap-bbox="true"
     inkscape:object-paths="true"
     inkscape:object-nodes="true"
     inkscape:snap-midpoints="true"
     inkscape:snap-object-midpoints="true"
     inkscape:snap-page="true"
     inkscape:snap-global="false" /><metadata
     id="metadata3077"><rdf:RDF><cc:Work
         rdf:about=""><dc:format>image/svg+xml</dc:format><dc:type
           rdf:resource="http://purl.org/dc/dcmitype/StillImage" /><dc:title></dc:title></cc:Work></rdf:RDF></metadata><defs
     id="defs3053"><filter
       inkscape:collect="always"
       id="filter8110"
       x="-0.074351885"
       width="1.1487038"
       y="-0.13543208"
       height="1.2708642"><feGaussianBlur
         inkscape:collect="always"
         stdDeviation="12.0725"
         id="feGaussianBlur8112" /></filter><filter
       inkscape:collect="always"
       style="color-interpolation-filters:sRGB"
       id="filter4678"
       x="-0.031691014"
       width="1.063382"
       y="-0.074127013"
       height="1.148254"><feGaussianBlur
         inkscape:collect="always"
         stdDeviation="9.7164636"
         id="feGaussianBlur4680" /></filter><filter
       inkscape:collect="always"
       style="color-interpolation-filters:sRGB"
       id="filter4698"
       x="-0.031691014"
       width="1.063382"
       y="-0.074127013"
       height="1.148254"><feGaussianBlur
         inkscape:collect="always"
         stdDeviation="9.7164636"
         id="feGaussianBlur4700" /></filter><filter
       inkscape:collect="always"
       style="color-interpolation-filters:sRGB"
       id="filter4718"
       x="-0.031691014"
       width="1.063382"
       y="-0.074127013"
       height="1.148254"><feGaussianBlur
         inkscape:collect="always"
         stdDeviation="9.7164636"
         id="feGaussianBlur4720" /></filter><filter
       inkscape:collect="always"
       style="color-interpolation-filters:sRGB"
       id="filter4738"
       x="-0.031691014"
       width="1.063382"
       y="-0.074127013"
       height="1.148254"><feGaussianBlur
         inkscape:collect="always"
         stdDeviation="9.7164636"
         id="feGaussianBlur4740" /></filter><filter
       inkscape:collect="always"
       style="color-interpolation-filters:sRGB"
       id="filter4758"
       x="-0.031691014"
       width="1.063382"
       y="-0.074127013"
       height="1.148254"><feGaussianBlur
         inkscape:collect="always"
         stdDeviation="9.7164636"
         id="feGaussianBlur4760" /></filter><filter
       inkscape:collect="always"
       style="color-interpolation-filters:sRGB"
       id="filter4778"
       x="-0.031691014"
       width="1.063382"
       y="-0.074127013"
       height="1.148254"><feGaussianBlur
         inkscape:collect="always"
         stdDeviation="9.7164636"
         id="feGaussianBlur4780" /></filter></defs><text
     xml:space="preserve"
     style="font-size:64px;font-style:normal;font-variant:normal;font-weight:600;font-stretch:normal;text-indent:0;text-align:start;text-decoration:none;line-height:125%;letter-spacing:normal;word-spacing:normal;text-transform:none;direction:ltr;block-progression:tb;writing-mode:tb-rl;text-anchor:start;baseline-shift:baseline;color:#000000;fill:#c50000;fill-opacity:1;fill-rule:nonzero;stroke:none;stroke-width:3.6924777;marker:none;visibility:visible;display:inline;overflow:visible;enable-background:accumulate;font-family:FreeSans;-inkscape-font-specification:FreeSans Semi-Bold"
     x="-2.7550001"
     y="45.736"
     id="text4844"
     sodipodi:linespacing="125%"><tspan
       sodipodi:role="line"
       id="tspan4846"
       x="-2.7550001"
       y="45.736">This file is not to be shared publicly !</tspan><tspan
       sodipodi:role="line"
       x="-2.7550001"
       y="125.736"
       id="tspan4848">It contains the logos of Inkscape sponsors</tspan><tspan
       sodipodi:role="line"
       x="-2.7550001"
       y="205.73599"
       id="tspan4850">in vector format. Usage of the logos must </tspan><tspan
       sodipodi:role="line"
       x="-2.7550001"
       y="285.73599"
       id="tspan4852">comply to the respective owner's logo</tspan><tspan
       sodipodi:role="line"
       x="-2.7550001"
       y="365.73599"
       id="tspan4854">usage guidelines!</tspan></text>
<g
     id="g9115"
     transform="matrix(0.98015582,0,0,0.98015582,41.126623,-86.88676)"><g
       inkscape:export-ydpi="19.552074"
       inkscape:export-xdpi="19.552074"
       inkscape:export-filename="/media/sicher/maren/www/sponsor_sfc_170x78.png"
       transform="matrix(0.29090519,0,0,0.29090519,802.41621,1053.0611)"
       id="g4331"><rect
         ry="65"
         style="opacity:0.51194536;color:#000000;fill:#000000;fill-opacity:1;fill-rule:nonzero;stroke:none;stroke-width:3.6924777;marker:none;visibility:visible;display:inline;overflow:visible;enable-background:accumulate;filter:url(#filter4718)"
         id="rect4239"
         width="735.8399"
         height="314.58859"
         x="-28.870909"
         y="-1848.2073" /><g
         id="g4257"><rect
           ry="65"
           style="color:#000000;fill:#ffffff;fill-opacity:1;fill-rule:nonzero;stroke:#b6b6b6;stroke-width:3.6924777;stroke-opacity:1;marker:none;visibility:visible;display:inline;overflow:visible;enable-background:accumulate"
           id="rect4214"
           width="735.8399"
           height="314.58859"
           x="-28.870909"
           y="-1848.2073" /><g
           id="g3114"
           transform="matrix(1.8917618,0,0,1.8917618,-1220.8975,-2782.5795)"><g
             id="g4365"
             transform="matrix(0.38392529,0,0,0.38392529,621.68182,395.0987)"><path
               style="fill:#afe478;fill-opacity:1;fill-rule:evenodd;stroke:none"
               d="m 294.8728,344.65416 c -17.99591,0.20347 -32.91812,12.38231 -34.16415,28.45216 -0.13622,1.75558 -0.0824,3.47227 0.1076,5.17312 -5.89428,-1.88791 -12.25439,-3.14371 -18.9681,-3.66429 -29.235,-2.26687 -54.66561,10.5136 -60.46085,29.31434 -19.33453,6.26155 -34.68239,18.44021 -42.24714,34.05638 -17.1699,-0.89371 -32.07025,12.14704 -33.40974,29.42212 -1.36074,17.54933 11.69211,32.91384 29.20658,34.27192 5.54251,0.42975 10.89952,-0.64981 15.62713,-2.80211 13.6788,14.40097 34.76181,24.52877 58.95201,26.40447 21.79146,1.68968 42.02271,-3.65691 57.33542,-13.57944 6.04955,10.00137 17.2846,17.40024 30.7154,19.3992 l 0,0.32315 c 0.40102,-0.0393 0.78811,-0.16657 1.18551,-0.21555 0.40533,0.05 0.77641,0.1752 1.1855,0.21555 l 0,-0.32315 c 13.45167,-1.98865 24.65882,-9.38618 30.7154,-19.3992 15.31272,9.92253 35.65177,15.26916 57.44319,13.57944 24.1902,-1.87567 45.16545,-12.0035 58.84425,-26.40447 4.72765,2.1523 10.08465,3.23189 15.62714,2.80211 17.51446,-1.35805 30.67508,-16.72263 29.31434,-34.27192 -1.33949,-17.27508 -16.23983,-30.31583 -33.40973,-29.42212 -7.56476,-15.61617 -23.02039,-27.79483 -42.35493,-34.05638 -5.79524,-18.80074 -31.11807,-31.58121 -60.35307,-29.31434 -6.71371,0.52058 -13.07382,1.77638 -18.96811,3.66429 0.19003,-1.70085 0.24418,-3.41754 0.1076,-5.17312 -1.24603,-16.06985 -16.27601,-28.24858 -34.27192,-28.45216 -1.19975,-0.0138 -2.44085,0.0138 -3.66429,0.1076 -0.0724,0.007 -0.14381,-0.007 -0.21555,0 -0.0717,-0.007 -0.14312,0.007 -0.21554,0 -1.22345,-0.0948 -2.46455,-0.12174 -3.6643,-0.1076 z m 3.44874,21.55467 0.53887,0 c 3.05373,0 5.82187,0.85901 7.86746,2.37101 2.04558,1.512 3.34097,3.66581 3.34097,6.03531 0,0.6994 -0.21658,1.38874 -0.43109,2.04769 l 9.05296,6.68195 c 1.88349,-1.05553 4.06897,-1.72438 6.57417,-1.72438 3.0528,0 5.82159,0.86702 7.86745,2.37102 2.04587,1.504 3.44875,3.66591 3.44875,6.0353 0,1.55932 -0.75038,2.95413 -1.72437,4.20316 l 12.71725,9.26851 c 1.61046,-0.67375 3.41978,-1.07773 5.38867,-1.07773 3.05372,0 5.92967,0.85898 7.97522,2.37101 2.04556,1.51203 3.34098,3.66581 3.34098,6.03531 0,1.33808 -0.56249,2.55383 -1.29328,3.66429 l 12.07061,8.72964 c 1.62936,-0.69337 3.49886,-1.18551 5.49644,-1.18551 3.05373,0 5.8219,0.85898 7.86746,2.37102 2.04555,1.51203 3.34097,3.66591 3.34097,6.03531 0,2.36949 -1.29542,4.5233 -3.34097,6.0353 -2.04556,1.512 -4.81373,2.37102 -7.86746,2.37102 -3.05372,0 -5.82186,-0.85902 -7.86745,-2.37102 -2.04559,-1.512 -3.44875,-3.66581 -3.44875,-6.0353 0,-1.82915 0.96593,-3.48283 2.26324,-4.84981 l -11.3162,-8.29854 c -1.96037,1.23744 -4.48534,2.04769 -7.22081,2.04769 -2.494,0 -4.69747,-0.67813 -6.57418,-1.72437 l -9.05296,6.57417 c 0.78087,0.95272 1.4531,1.98296 1.72438,3.12543 0.0904,0.38081 0.1076,0.78066 0.1076,1.1855 0,2.3694 -1.29542,4.52328 -3.34098,6.03531 -1.02276,0.756 -2.22706,1.4284 -3.55652,1.83215 -0.66471,0.20175 -1.3268,0.32694 -2.04769,0.43109 -0.72089,0.10415 -1.49983,0.1076 -2.26324,0.1076 -2.40153,0 -4.63011,-0.5329 -6.4664,-1.50882 l -12.71725,9.37628 c 1.31083,1.10508 2.28555,2.56007 2.69433,4.09538 0.13623,0.51176 0.21555,0.96755 0.21555,1.50883 0,2.36939 -1.29542,4.4155 -3.34098,5.92753 -0.51138,0.37802 -1.02172,0.77449 -1.6166,1.07774 -1.18978,0.60653 -2.54579,1.06476 -3.98761,1.29328 -0.72089,0.11415 -1.49983,0.1076 -2.26324,0.1076 -3.05373,0 -5.8219,-0.96675 -7.86745,-2.47879 -1.02276,-0.75603 -1.89923,-1.58987 -2.47879,-2.58656 -0.28969,-0.49834 -0.49324,-1.06794 -0.64664,-1.6166 -0.15347,-0.54866 -0.21555,-1.13202 -0.21555,-1.72437 0,-2.36939 1.29542,-4.52331 3.34098,-6.03531 2.04555,-1.512 4.81372,-2.47879 7.86745,-2.47879 1.52445,0 2.98303,0.33729 4.31093,0.75442 l 13.68722,-9.91515 c -0.48897,-0.62305 -0.87667,-1.24051 -1.18551,-1.93992 -0.30901,-0.69941 -0.53887,-1.48068 -0.53887,-2.26324 0,-2.3695 1.29511,-4.53134 3.34098,-6.03531 0.51145,-0.37598 1.02162,-0.67719 1.6166,-0.96996 1.78493,-0.87832 3.96126,-1.40105 6.25085,-1.40105 2.29569,0 4.35028,0.60977 6.14308,1.50883 l 9.26851,-6.68195 c -0.4521,-0.60405 -0.89437,-1.25462 -1.18551,-1.93992 -0.29107,-0.6853 -0.43109,-1.40533 -0.43109,-2.15547 0,-1.85332 1.04193,-3.47037 2.37101,-4.8498 l -12.50171,-9.16073 c -1.82535,0.95168 -3.99116,1.6166 -6.35862,1.6166 -2.6873,0 -5.06063,-0.74203 -7.00527,-1.93992 l -10.45401,7.65191 c 0.93402,1.00872 1.62556,2.1785 1.93992,3.44874 0.10484,0.42341 0.21554,0.84567 0.21554,1.29328 0,2.36946 -1.29542,4.52328 -3.34097,6.03531 -0.51138,0.37802 -1.11939,0.78459 -1.72437,1.07773 -1.21,0.58632 -2.52559,0.97721 -3.98762,1.18551 -0.73099,0.10415 -1.49982,0.1076 -2.26324,0.1076 -3.05372,0 -5.82189,-0.85898 -7.86745,-2.37101 -2.04555,-1.51204 -3.34097,-3.66585 -3.34097,-6.03531 0,-2.3695 1.29511,-4.53134 3.34097,-6.03531 2.04587,-1.50396 4.81466,-2.37101 7.86745,-2.37101 2.10463,0 4.12867,0.4214 5.81976,1.18551 l 10.88511,-7.97523 c -0.73538,-1.11546 -1.29328,-2.32311 -1.29328,-3.66429 0,-0.36526 0.0345,-0.72717 0.1076,-1.07774 0.22313,-1.05169 0.75704,-2.029 1.40105,-2.90988 l -8.19077,-6.0353 c -2.0807,1.86639 -5.07473,3.12542 -8.51409,3.12542 -2.86333,0 -5.43564,-1.02534 -7.43636,-2.37101 l -8.083,5.60421 c 0.7142,1.10319 1.18551,2.34581 1.18551,3.6643 0,2.36949 -1.29542,4.41553 -3.34098,5.92753 -2.04555,1.512 -4.81376,2.47879 -7.86745,2.47879 -2.03866,0 -3.94916,-0.46465 -5.60422,-1.18551 l -12.71725,8.62187 c 1.41637,1.40302 2.58656,3.03669 2.58656,4.95757 0,0.38629 -0.0207,0.81611 -0.1076,1.18551 -0.26038,1.10822 -0.89788,2.08576 -1.6166,3.01765 l 9.26851,6.68195 c 1.36953,-0.45024 2.83104,-0.75442 4.4187,-0.75442 3.0537,0 5.82187,0.96683 7.86746,2.47879 2.04559,1.51197 3.34097,3.55804 3.34097,5.92753 0,2.3695 -1.29538,4.52331 -3.34097,6.03531 -2.04559,1.512 -4.81373,2.47879 -7.86746,2.47879 -3.05369,0 -5.82955,-0.96634 -7.86745,-2.47879 -2.0379,-1.51245 -3.34097,-3.66705 -3.34097,-6.03531 0,-1.0858 0.24693,-2.09973 0.75441,-3.01765 0.25383,-0.45896 0.61467,-0.87836 0.96996,-1.29328 0.35529,-0.41492 0.74565,-0.81604 1.18551,-1.18551 l -8.5141,-6.25085 c -1.83083,0.96448 -3.97337,1.72437 -6.35862,1.72437 -2.95613,0 -5.63088,-1.05386 -7.65191,-2.47878 l -11.85507,8.19077 c 1.43175,1.12157 2.55573,2.5966 3.01766,4.20316 0.15381,0.53552 0.21554,1.04725 0.21554,1.6166 0,1.02966 -0.41388,1.90002 -0.86218,2.80211 l 10.45401,7.54413 c 1.40633,-0.47644 2.89084,-0.75441 4.52648,-0.75441 3.05369,0 5.92967,0.85901 7.97523,2.37101 2.04555,1.512 3.34097,3.66592 3.34097,6.03531 0,2.36949 -1.29511,4.53134 -3.34097,6.03531 -2.04587,1.50396 -4.92247,2.37101 -7.97523,2.37101 -1.52638,0 -2.98141,-0.13416 -4.31093,-0.53887 -0.66478,-0.20244 -1.34495,-0.46165 -1.93992,-0.75441 -0.59498,-0.2928 -1.10515,-0.70175 -1.6166,-1.07773 -2.04587,-1.50397 -3.34098,-3.66582 -3.34098,-6.03531 0,-2.11177 1.34074,-3.92095 3.01766,-5.38867 l -9.48406,-6.78972 c -2.04141,1.50652 -4.71109,2.58656 -7.75968,2.58656 -3.48785,0 -6.54434,-1.21427 -8.62187,-3.12543 l -11.20842,7.75968 c 0.54266,0.64482 1.05173,1.41916 1.40105,2.15547 0.17451,0.36816 0.33384,0.68654 0.43109,1.07774 0.0973,0.39119 0.1076,0.7712 0.1076,1.1855 0,2.36957 -1.2951,4.53131 -3.34097,6.03531 -0.51145,0.37598 -1.02162,0.78493 -1.6166,1.07773 -1.18995,0.58556 -2.54593,0.97593 -3.98761,1.18551 -0.72082,0.10484 -1.50007,0.1076 -2.26324,0.1076 -3.0528,0 -5.92936,-0.86702 -7.97523,-2.37101 -2.04586,-1.504 -3.34097,-3.66575 -3.34097,-6.03531 0,-2.36939 1.29542,-4.52331 3.34097,-6.03531 2.04556,-1.512 4.9215,-2.37101 7.97523,-2.37101 2.12794,0 4.00527,0.51238 5.71198,1.29328 l 12.60949,-8.62187 c -0.17899,-0.5718 -0.4311,-1.0906 -0.4311,-1.72437 0,-2.36939 1.29542,-4.52327 3.34098,-6.03531 2.04555,-1.51203 4.81376,-2.47879 7.86745,-2.47879 1.30211,0 2.60235,0.22969 3.77207,0.53887 l 1.72437,-1.29328 0.21555,-0.1076 11.42397,-7.75968 c -0.45327,-0.91357 -0.86219,-1.87557 -0.86219,-2.90988 0,-2.36939 1.29542,-4.52327 3.34098,-6.03531 2.04555,-1.51203 4.9215,-2.37101 7.97522,-2.37101 1.7331,0 3.26976,0.33073 4.74203,0.86219 l 1.50883,-0.96996 11.42397,-7.86746 c -1.10108,-1.29669 -2.04769,-2.74806 -2.04769,-4.4187 0,-2.3695 1.40288,-4.53135 3.44874,-6.03531 2.04587,-1.50396 4.81466,-2.37101 7.86746,-2.37101 2.61925,0 4.96937,0.68699 6.89749,1.83214 l 8.29855,-5.60421 c -0.54221,-0.98531 -0.96996,-2.09511 -0.96996,-3.2332 0,-2.36939 1.29542,-4.52327 3.34097,-6.03531 1.91102,-1.41257 4.61842,-2.1515 7.43636,-2.26324 l 0,-0.1076 z m 0.53887,3.55652 c -2.08904,0 -4.01627,0.6785 -5.28089,1.6166 -0.95272,0.70661 -1.58425,1.50965 -1.83215,2.37101 -0.0828,0.28728 -0.1076,0.5549 -0.1076,0.86219 0,0.92216 0.3535,1.80255 1.07774,2.58656 0.24141,0.26141 0.54462,0.51883 0.86218,0.75441 0.94847,0.70347 2.28945,1.274 3.77207,1.50883 0.4942,0.0783 0.98658,0.1076 1.50882,0.1076 2.08925,0 3.89857,-0.67599 5.17312,-1.6166 1.28032,-0.94499 1.93992,-2.12046 1.93992,-3.34098 0,-1.22013 -0.65967,-2.28841 -1.93992,-3.2332 -1.27455,-0.94075 -3.08387,-1.6166 -5.17312,-1.6166 z m -25.54228,15.41158 c -2.09014,0 -4.01537,0.5766 -5.28089,1.50883 -0.95365,0.70265 -1.5071,1.58587 -1.72437,2.47879 -0.0724,0.29762 -0.1076,0.55487 -0.1076,0.86218 0,0.92189 0.27589,1.80253 0.96996,2.58656 0.23141,0.26142 0.54462,0.51887 0.86218,0.75442 1.26462,0.93809 3.19182,1.50882 5.2809,1.50882 2.08918,0 3.89853,-0.56807 5.17312,-1.50882 1.28024,-0.94482 1.93992,-2.12071 1.93992,-3.34098 0,-1.22016 -0.6584,-2.40153 -1.93992,-3.34097 -1.27549,-0.93489 -3.08287,-1.50883 -5.17312,-1.50883 z m 51.94675,0 c -2.09008,0 -3.9076,0.5766 -5.17312,1.50883 -0.95365,0.70265 -1.58456,1.58587 -1.83215,2.47879 -0.0824,0.29762 -0.1076,0.55487 -0.1076,0.86218 0,0.92189 0.3535,1.80253 1.07773,2.58656 0.24142,0.26142 0.54463,0.51887 0.86219,0.75442 1.26462,0.93809 3.08408,1.50882 5.17312,1.50882 2.08925,0 4.00631,-0.56807 5.2809,-1.50882 1.28024,-0.94482 1.93992,-2.12071 1.93992,-3.34098 0,-1.22016 -0.6584,-2.40153 -1.93992,-3.34097 -1.27549,-0.93489 -3.19061,-1.50883 -5.2809,-1.50883 z m -26.62002,18.86034 c -2.09025,0 -3.8976,0.68161 -5.17311,1.6166 -0.9611,0.70444 -1.58691,1.51024 -1.83215,2.37101 -0.0817,0.28694 -0.1076,0.55715 -0.1076,0.86219 0,0.91536 0.35208,1.80011 1.07773,2.58656 0.24176,0.2621 0.54215,0.51821 0.86219,0.75441 0.95596,0.70558 2.2143,1.27466 3.66429,1.50883 0.48334,0.0779 0.98651,0.1076 1.50883,0.1076 2.08904,0 4.0163,-0.67847 5.28089,-1.6166 1.27028,-0.94213 1.93992,-2.11163 1.93992,-3.34097 0,-1.22903 -0.6684,-2.29653 -1.93992,-3.23321 -1.26552,-0.93236 -3.19078,-1.6166 -5.28089,-1.6166 z m -52.27006,1.93992 c -2.09011,0 -4.01545,0.68423 -5.28089,1.6166 -0.95365,0.70247 -1.58457,1.5858 -1.83215,2.47878 -0.0824,0.29763 -0.1076,0.55487 -0.1076,0.86219 0,0.92199 0.35349,1.83287 1.07773,2.58656 0.24141,0.25141 0.54463,0.41109 0.86219,0.64664 0.94847,0.70348 2.28945,1.274 3.77206,1.50883 0.49421,0.0783 0.98655,0.1076 1.50883,0.1076 2.08922,0 3.89853,-0.67589 5.17312,-1.6166 1.28031,-0.94499 1.93992,-2.01286 1.93992,-3.2332 0,-1.22017 -0.6584,-2.40154 -1.93992,-3.34097 -1.27552,-0.93489 -3.08287,-1.61661 -5.17312,-1.61661 z m 106.58783,0 c -2.09025,0 -3.8976,0.68171 -5.17312,1.6166 -0.96113,0.70458 -1.58691,1.58773 -1.83215,2.47878 -0.0817,0.29694 -0.1076,0.55715 -0.1076,0.86219 0,0.91523 0.35208,1.83035 1.07773,2.58656 0.24176,0.2521 0.54211,0.4104 0.86219,0.64664 0.95596,0.70555 2.2143,1.27462 3.66429,1.50883 0.48334,0.0779 0.98652,0.1076 1.50883,0.1076 2.08904,0 4.01624,-0.67865 5.28089,-1.6166 1.27028,-0.94216 1.93992,-2.00386 1.93992,-3.2332 0,-1.2292 -0.66843,-2.40433 -1.93992,-3.34097 -1.26548,-0.93241 -3.19078,-1.61661 -5.28089,-1.61661 z m -25.00342,17.67482 c -2.09014,0 -4.01541,0.68424 -5.28089,1.6166 -0.95365,0.70262 -1.5071,1.50838 -1.72437,2.37102 -0.0724,0.28762 -0.10761,0.5549 -0.10761,0.86218 0,0.92199 0.2759,1.80253 0.96996,2.58657 0.23142,0.26141 0.54463,0.51882 0.86219,0.75441 0.94848,0.70347 2.28945,1.274 3.77207,1.50883 0.4942,0.0783 0.98655,0.1076 1.50883,0.1076 2.08925,0 4.0063,-0.67603 5.28089,-1.6166 1.28031,-0.945 1.83215,-2.12064 1.83215,-3.34098 0,-1.22016 -0.55063,-2.29376 -1.83215,-3.2332 -1.27549,-0.93488 -3.19061,-1.6166 -5.28089,-1.6166 z m -58.41314,0.86219 c -2.08905,0 -3.90854,0.67865 -5.17312,1.6166 -0.95272,0.70679 -1.58429,1.58711 -1.83215,2.47879 -0.0828,0.29728 -0.1076,0.55483 -0.1076,0.86219 0,1.22916 0.66964,2.39881 1.93992,3.34097 0.94847,0.70358 2.21199,1.19658 3.66429,1.40105 0.4841,0.0683 0.98658,0.1076 1.50883,0.1076 2.08925,0 4.0063,-0.56807 5.28089,-1.50882 1.28025,-0.94482 1.93992,-2.12067 1.93992,-3.34098 0,-1.2203 -0.65964,-2.39601 -1.93992,-3.34097 -1.27459,-0.94075 -3.19164,-1.6166 -5.28089,-1.6166 z m 111.00653,1.07773 c -2.09011,0 -4.01541,0.68441 -5.28089,1.6166 -0.95365,0.70265 -1.5071,1.50842 -1.72438,2.37102 -0.0724,0.28762 -0.1076,0.55494 -0.1076,0.86219 0,0.92216 0.2759,1.80252 0.96996,2.58656 0.23141,0.26141 0.5446,0.51876 0.86219,0.75441 0.94844,0.70347 2.28942,1.274 3.77207,1.50883 0.4942,0.0783 0.98655,0.1076 1.50883,0.1076 2.08904,0 3.90849,-0.67861 5.17312,-1.6166 1.27041,-0.94258 1.93992,-2.11143 1.93992,-3.34098 0,-1.22896 -0.66841,-2.29635 -1.93992,-3.2332 -1.26552,-0.93223 -3.08301,-1.6166 -5.17312,-1.6166 z m -161.76778,0.32315 c -2.08904,0 -3.90849,0.67847 -5.17312,1.6166 -0.95271,0.70662 -1.58425,1.58712 -1.83214,2.47879 -0.0828,0.29728 -0.1076,0.55487 -0.1076,0.86219 0,0.92188 0.35332,1.83359 1.07773,2.58656 0.24141,0.25106 0.54432,0.41247 0.86219,0.64664 0.94909,0.6993 2.21202,1.27269 3.66429,1.50882 0.4841,0.0786 0.98631,0.1076 1.50883,0.1076 2.09014,0 4.01541,-0.68419 5.28089,-1.6166 1.27152,-0.93668 1.93992,-2.00403 1.93992,-3.2332 0,-1.2292 -0.66964,-2.39881 -1.93992,-3.34097 -1.26462,-0.93813 -3.19181,-1.6166 -5.28089,-1.6166 z m -29.0988,17.56706 c -2.08908,0 -4.01624,0.67861 -5.28089,1.6166 -0.95268,0.70658 -1.58425,1.58708 -1.83215,2.47878 -0.0828,0.29729 -0.1076,0.55487 -0.1076,0.86219 0,0.92161 0.35333,1.83349 1.07774,2.58656 0.24141,0.25107 0.54431,0.41244 0.86218,0.64664 0.94917,0.69916 2.28952,1.27266 3.77207,1.50883 0.49417,0.0786 0.98631,0.1076 1.50883,0.1076 2.09004,0 3.90756,-0.68437 5.17312,-1.6166 1.27151,-0.93685 1.93992,-2.00438 1.93992,-3.2332 0,-1.22934 -0.66968,-2.39885 -1.93992,-3.34098 -1.26466,-0.93799 -3.08408,-1.6166 -5.17312,-1.6166 z m 54.53331,0.53886 c -2.08908,0 -3.9085,0.67848 -5.17312,1.6166 -0.95271,0.70662 -1.58425,1.50966 -1.83215,2.37102 -0.0828,0.28728 -0.1076,0.55487 -0.1076,0.86218 0,0.61467 0.21279,1.26766 0.53887,1.83215 0.16313,0.28211 0.29728,0.49334 0.53887,0.75441 0.24141,0.26107 0.54431,0.52025 0.86218,0.75442 0.94913,0.69926 2.21203,1.27269 3.6643,1.50882 0.4841,0.0786 0.9863,0.1076 1.50882,0.1076 2.09022,0 4.00541,-0.68161 5.2809,-1.6166 1.28152,-0.9393 1.93992,-2.12066 1.93992,-3.34097 0,-1.22013 -0.65971,-2.28845 -1.93992,-3.2332 -1.27459,-0.94078 -3.19168,-1.6166 -5.2809,-1.6166 z m 56.25768,1.50883 c -2.09025,0 -3.8976,0.57394 -5.17312,1.50883 -0.9611,0.7044 -1.5869,1.5877 -1.83214,2.47878 -0.0817,0.29694 -0.1076,0.55718 -0.1076,0.86219 0,0.91537 0.35208,1.80007 1.07773,2.58656 0.24175,0.2621 0.54211,0.51817 0.86218,0.75441 1.27459,0.94072 3.08391,1.50883 5.17312,1.50883 2.08908,0 4.01631,-0.57087 5.2809,-1.50883 1.27027,-0.94216 1.83214,-2.11163 1.83214,-3.34097 0,-1.22882 -0.56059,-2.40416 -1.83214,-3.34097 -1.26549,-0.93227 -3.19082,-1.50883 -5.2809,-1.50883 z"
               id="path4367"
               inkscape:connector-curvature="0" /><path
               style="fill:#577632;fill-opacity:1;stroke:none"
               d="M 242.96875,155.625 272.625,178.84375 245.8125,179 230.9375,167.59375 216.28125,167.5 l 26.375,20.6875 0.3125,-0.21875 0,0.0625 41.09375,-0.21875 0.8125,0.625 -15.0625,82.59375 57.96875,0.4375 L 311.75,189.25 l 1.78125,-1.40625 41.125,0.21875 0,-0.0625 0.28125,0.21875 26.375,-20.6875 -14.65625,0.0937 -14.875,11.40625 -26.8125,-0.15625 29.6875,-23.21875 -15.90625,0.1875 -29.09375,22.6875 -2.09375,-10.8125 -18.875,-0.1875 -1.84375,10.09375 -27.96875,-21.8125 -15.90625,-0.1875 z"
               id="path4369"
               transform="translate(0,308.2677)"
               inkscape:connector-curvature="0" /></g><g
             id="g3443"><path
               id="flowRoot3023-5-6-2-5-9-7-4-5"
               transform="translate(0,308.2677)"
               d="m 790.28125,287.1875 c -2.67365,2e-5 -4.62784,0.93059 -5.90625,2.8125 -1.27842,1.88195 -1.9375,4.71548 -1.9375,8.53125 0,3.64706 0.68145,6.43057 2.03125,8.3125 1.3498,1.88193 3.32345,2.8125 5.90625,2.8125 1.6483,0 3.13721,-0.40637 4.5,-1.25 l 0,-4.5625 c -1.41471,0.90852 -2.76463,1.34375 -4.0625,1.34375 -1.09023,0 -1.86354,-0.54655 -2.34375,-1.65625 -0.48022,-1.10968 -0.71876,-2.7859 -0.71875,-5.03125 -10e-6,-2.29724 0.23204,-4.00761 0.71875,-5.15625 0.4867,-1.14861 1.27179,-1.71873 2.375,-1.71875 0.83064,2e-5 1.79774,0.30155 2.875,0.9375 l 1.46875,-4.03125 c -0.70087,-0.44126 -1.49245,-0.76636 -2.375,-1 -0.88257,-0.2336 -1.72657,-0.34373 -2.53125,-0.34375 z m 15.40625,0 c -2.64769,2e-5 -4.72619,0.9895 -6.21875,2.96875 -1.49257,1.97929 -2.21875,4.7015 -2.21875,8.21875 0,2.28429 0.34337,4.29329 1.03125,6 0.68788,1.70672 1.66557,3.02898 2.9375,3.9375 1.27192,0.90852 2.74495,1.34375 4.40625,1.34375 2.62171,0 4.68194,-0.98948 6.1875,-2.96875 1.50553,-1.97927 2.24998,-4.75629 2.25,-8.3125 -2e-5,-3.43938 -0.76923,-6.16927 -2.28125,-8.1875 -1.51205,-2.01819 -3.53693,-2.99998 -6.09375,-3 z m 22.125,0 c -1.16811,2e-5 -2.16168,0.27919 -3.03125,0.84375 -0.82163,0.53346 -1.47507,1.26593 -1.9375,2.1875 l 0,-2.65625 -5.125,0 0,0.0312 -0.0312,0 0,21.6875 5.1875,0 0,-10.4375 c -10e-6,-2.63469 0.26209,-4.48404 0.78125,-5.59375 0.51915,-1.10967 1.35256,-1.68748 2.46875,-1.6875 0.84361,2e-5 1.4361,0.41408 1.8125,1.21875 0.37637,0.8047 0.56249,1.99207 0.5625,3.5625 l 0,12.9375 5.21875,0 0,-14.15625 c -2e-5,-2.59575 -0.48886,-4.58768 -1.46875,-5.9375 -0.97992,-1.34978 -2.46473,-1.99998 -4.4375,-2 z m 15.4375,0 c -1.82769,0.11784 -3.299,0.65118 -4.40625,1.59375 -1.26544,1.07726 -1.90625,2.53202 -1.90625,4.375 0,1.44067 0.34986,2.69224 1.03125,3.75 0.68139,1.05779 1.80456,2.06553 3.375,3 1.18107,0.71385 1.99621,1.31931 2.4375,1.8125 0.44127,0.4932 0.65624,1.05684 0.65625,1.71875 -10e-6,0.64895 -0.23445,1.1979 -0.65625,1.59375 -0.42182,0.39586 -1.00782,0.59375 -1.8125,0.59375 -0.72682,0 -1.57731,-0.17552 -2.53125,-0.5 -0.95395,-0.32447 -1.78617,-0.72555 -2.5,-1.21875 l 0,4.5 c 1.40171,0.84363 3.17099,1.25 5.3125,1.25 2.41406,0 4.22926,-0.59369 5.46875,-1.78125 1.23947,-1.18756 1.87499,-2.82194 1.875,-4.9375 -10e-6,-0.97341 -0.17025,-1.83568 -0.46875,-2.5625 -0.29853,-0.72681 -0.7049,-1.36642 -1.25,-1.9375 -0.54512,-0.57106 -1.49396,-1.27607 -2.84375,-2.09375 -1.11619,-0.67489 -1.87242,-1.23323 -2.28125,-1.6875 -0.40884,-0.45424 -0.62501,-0.97844 -0.625,-1.5625 -10e-6,-0.50616 0.16903,-0.9308 0.5,-1.28125 0.33095,-0.35041 0.83807,-0.53123 1.5,-0.53125 1.05128,2e-5 2.2675,0.37224 3.65625,1.125 l 1.6875,-3.71875 c -1.70024,-1.01233 -3.51664,-1.49998 -5.4375,-1.5 -0.2758,0 -0.52015,-0.0168 -0.78125,0 z m 16.9375,0 c -2.53088,2e-5 -4.52281,0.9883 -5.9375,3 -1.4147,2.01174 -2.125,4.8241 -2.125,8.40625 0,3.53025 0.81105,6.26015 2.375,8.1875 1.56395,1.92736 3.69366,2.875 6.40625,2.875 2.3232,0 4.30744,-0.50063 5.96875,-1.5 l 0,-4.25 c -1.76514,1.05129 -3.50026,1.5625 -5.1875,1.5625 -1.32385,0 -2.34099,-0.46528 -3.09375,-1.40625 -0.75278,-0.94096 -1.14857,-2.37864 -1.1875,-4.3125 l 10.40625,0 0,-2.75 c -2e-5,-3.10193 -0.66849,-5.53028 -2.03125,-7.25 -1.36279,-1.71968 -3.23161,-2.56248 -5.59375,-2.5625 z m 20.34375,0 c -0.89555,2e-5 -1.70011,0.29097 -2.375,0.875 -0.67491,0.58407 -1.27269,1.54349 -1.84375,2.90625 l -0.1875,0 -0.59375,-3.375 -4.25,0 0,21.6875 5.1875,0 0,-11.15625 c -10e-6,-1.8949 0.32509,-3.35085 1,-4.34375 0.67489,-0.99287 1.64729,-1.49998 2.90625,-1.5 0.58404,2e-5 1.04283,0.089 1.40625,0.21875 l 0.625,-5.03125 c -0.61002,-0.19466 -1.23905,-0.28123 -1.875,-0.28125 z m -20.40625,3.96875 c 0.7917,2e-5 1.42073,0.43235 1.875,1.25 0.45425,0.81768 0.69278,2.01035 0.71875,3.59375 l -5.25,0 c 0.0779,-1.6483 0.36353,-2.87101 0.84375,-3.65625 0.48021,-0.7852 1.0727,-1.18748 1.8125,-1.1875 z M 805.25,291.625 c 0.12695,-0.0175 0.26997,0 0.40625,0 1.07723,2e-5 1.84405,0.56485 2.34375,1.6875 0.49967,1.12269 0.74999,2.79121 0.75,5.0625 -10e-6,4.56856 -1.01715,6.875 -3.09375,6.875 -1.09023,0 -1.88181,-0.59488 -2.375,-1.75 -0.4932,-1.15511 -0.75001,-2.86667 -0.75,-5.125 -10e-6,-2.27129 0.2568,-3.93981 0.75,-5.0625 0.43154,-0.98232 1.0801,-1.5647 1.96875,-1.6875 z"
               style="font-size:48px;font-style:normal;font-variant:normal;font-weight:bold;font-stretch:normal;text-align:start;line-height:125%;letter-spacing:0px;word-spacing:0px;writing-mode:lr-tb;text-anchor:start;fill:#577632;fill-opacity:1;stroke:none;font-family:Open Sans Condensed;-inkscape-font-specification:'Open Sans Condensed, Bold'"
               inkscape:connector-curvature="0" /><path
               id="flowRoot3023-5-6-2-5-9-7-1-4-1"
               transform="translate(0,308.2677)"
               d="m 912.25,287.1875 c -2.53088,2e-5 -4.87677,0.66849 -7.03125,2.03125 L 907,292.8125 c 1.68724,-1.01233 3.17086,-1.53123 4.46875,-1.53125 1.75213,2e-5 2.65624,1.00657 2.65625,3.03125 l 0,1.5625 -2.90625,0.125 c -2.49194,0.11682 -4.3413,0.73407 -5.59375,1.84375 -1.25246,1.1097 -1.875,2.80948 -1.875,5.09375 0,2.12854 0.42874,3.7747 1.34375,4.96875 0.91501,1.19405 2.18485,1.78125 3.78125,1.78125 1.24596,0 2.27607,-0.23853 3.09375,-0.71875 0.81766,-0.48022 1.60924,-1.35307 2.375,-2.625 l 0.125,0 1.03125,2.96875 3.78125,0 0,-14.5625 c -2e-5,-2.41405 -0.58072,-4.27638 -1.78125,-5.59375 -1.20056,-1.31733 -2.95276,-1.96873 -5.25,-1.96875 z m 21.34375,0.0312 c -1.16811,2e-5 -2.19293,0.27919 -3.0625,0.84375 -0.85122,0.55267 -1.50307,1.31201 -1.96875,2.28125 l 0,-2.78125 -5.125,0 0,11.65625 0.0312,0 0,10.09375 5.1875,0 0,-10.40625 c -10e-6,-2.63469 0.26209,-4.51529 0.78125,-5.625 0.51915,-1.10967 1.32131,-1.65623 2.4375,-1.65625 0.84361,2e-5 1.46735,0.38283 1.84375,1.1875 0.37637,0.8047 0.56249,1.99207 0.5625,3.5625 l 0,12.9375 5.21875,0 0,-14.15625 c -2e-5,-2.59575 -0.48886,-4.55643 -1.46875,-5.90625 -0.97992,-1.34978 -2.46473,-2.03123 -4.4375,-2.03125 z m 17.21875,0 c -2.67365,2e-5 -4.65909,0.93059 -5.9375,2.8125 -1.27842,1.88195 -1.90625,4.74673 -1.90625,8.5625 0,3.64706 0.68145,6.39932 2.03125,8.28125 1.3498,1.88193 3.2922,2.8125 5.875,2.8125 1.6483,0 3.16846,-0.40637 4.53125,-1.25 l 0,-4.5625 c -1.41471,0.90852 -2.76463,1.375 -4.0625,1.375 -1.09023,0 -1.89479,-0.5778 -2.375,-1.6875 -0.48022,-1.10968 -0.71876,-2.7859 -0.71875,-5.03125 -10e-6,-2.29724 0.26329,-4.00761 0.75,-5.15625 0.4867,-1.14861 1.27179,-1.71873 2.375,-1.71875 0.83064,2e-5 1.79774,0.30155 2.875,0.9375 l 1.46875,-4.03125 c -0.70087,-0.44126 -1.49245,-0.76636 -2.375,-1 -0.88257,-0.2336 -1.72657,-0.34373 -2.53125,-0.34375 z m -65.90625,0.40625 5.65625,21.6875 6.4375,0 5.6875,-21.6875 -5.375,0 c -1.89492,8.63095 -2.89618,13.23375 -3,13.84375 -0.10384,0.61001 -0.21517,1.30444 -0.3125,2.03125 -0.0974,0.72682 -0.14328,1.26689 -0.15625,1.65625 l -0.0625,0 c -0.0389,-0.49319 -0.15027,-1.28357 -0.3125,-2.40625 -0.16224,-1.12266 -0.3207,-1.97844 -0.4375,-2.5625 l -2.75,-12.5625 -5.375,0 z m 29.21875,11.53125 0,1.8125 c -10e-6,1.4147 -0.31043,2.55614 -0.875,3.40625 -0.56459,0.85012 -1.30255,1.28125 -2.25,1.28125 -1.27193,0 -1.90626,-0.89641 -1.90625,-2.6875 -10e-6,-1.20703 0.26089,-2.10874 0.8125,-2.71875 0.55159,-0.61 1.41267,-0.96635 2.59375,-1.03125 l 1.625,-0.0625 z"
               style="font-size:48px;font-style:normal;font-variant:normal;font-weight:bold;font-stretch:normal;text-align:start;line-height:125%;letter-spacing:0px;word-spacing:0px;writing-mode:lr-tb;text-anchor:start;fill:#577632;fill-opacity:1;stroke:none;font-family:Open Sans Condensed;-inkscape-font-specification:'Open Sans Condensed, Bold'"
               inkscape:connector-curvature="0" /><g
               transform="matrix(0.8306463,0,0,0.8306463,1795.7434,-128.90577)"
               style="font-size:48px;font-style:normal;font-variant:normal;font-weight:bold;font-stretch:normal;text-align:start;line-height:125%;letter-spacing:0px;word-spacing:0px;writing-mode:lr-tb;text-anchor:start;fill:#577632;fill-opacity:1;stroke:none;font-family:Open Sans Condensed;-inkscape-font-specification:'Open Sans Condensed, Bold'"
               id="flowRoot3023-5-6-2-5-9-7-1-5-1-3"><path
                 d="m -1008.5625,872.02908 6.4688,0 3.60933,14.74219 c 0.35936,1.31251 0.64842,3.14845 0.86718,5.50781 l 0.14063,0 c 0.0156,-0.37499 0.0859,-1.04296 0.21094,-2.0039 0.12498,-0.96093 0.22655,-1.71484 0.30468,-2.26172 0.0781,-0.54687 1.15624,-5.87499 3.23438,-15.98438 l 6.5625,0 -7.47656,27.98438 c -0.90627,3.43749 -2.10939,5.90624 -3.60938,7.40625 -1.50001,1.49999 -3.5,2.24999 -6,2.25 -1.2344,-10e-6 -2.3359,-0.13283 -3.3047,-0.39844 l 0,-5.22656 c 0.6406,0.18749 1.3594,0.28124 2.1563,0.28125 2.0937,-10e-6 3.4687,-1.37501 4.125,-4.125 l 0.4453,-1.64063 z"
                 id="path3407"
                 inkscape:connector-curvature="0" /></g></g><g
             transform="matrix(0.57050433,0,0,0.57050433,1417.5478,155.19829)"
             style="font-size:48px;font-style:normal;font-variant:normal;font-weight:300;font-stretch:normal;text-align:start;line-height:125%;letter-spacing:0px;word-spacing:0px;writing-mode:lr-tb;text-anchor:start;fill:#577632;fill-opacity:1;stroke:none;font-family:Open Sans Condensed Light;-inkscape-font-specification:'Open Sans Condensed Light, Light'"
             id="flowRoot3013-0-3-7-9-7-8-1-7"><path
               d="m -1032.3359,754.60721 c -10e-5,2.14063 -0.5626,3.81641 -1.6875,5.02734 -1.125,1.21094 -2.75,1.81641 -4.875,1.81641 -1.1563,0 -2.1719,-0.14844 -3.0469,-0.44531 -0.875,-0.29688 -1.5547,-0.625 -2.0391,-0.98438 l 0,-2.60156 c 0.5781,0.57813 1.3438,1.04297 2.2969,1.39453 0.9531,0.35156 1.9297,0.52734 2.9297,0.52734 1.3125,0 2.3437,-0.42968 3.0937,-1.28906 0.75,-0.85937 1.125,-2.00781 1.125,-3.44531 0,-1.12499 -0.2695,-2.07421 -0.8086,-2.84766 -0.539,-0.77343 -1.5664,-1.65233 -3.082,-2.63672 -1.7344,-1.09373 -2.918,-1.96873 -3.5508,-2.625 -0.6328,-0.65623 -1.125,-1.39061 -1.4765,-2.20312 -0.3516,-0.81248 -0.5274,-1.78123 -0.5274,-2.90625 0,-1.82811 0.6172,-3.33982 1.8516,-4.53516 1.2344,-1.19529 2.8047,-1.79294 4.7109,-1.79297 2.0469,3e-5 3.7578,0.4844 5.1328,1.45313 l -1.1484,1.94531 c -1.2813,-0.85935 -2.6406,-1.28904 -4.0781,-1.28906 -1.3125,2e-5 -2.3594,0.38674 -3.1407,1.16015 -0.7812,0.77346 -1.1718,1.79299 -1.1718,3.0586 0,1.12502 0.2656,2.06642 0.7968,2.82422 0.5313,0.75783 1.6563,1.67579 3.375,2.7539 1.6875,1.10939 2.8438,1.99611 3.4688,2.66016 0.625,0.66407 1.0898,1.39845 1.3945,2.20312 0.3047,0.8047 0.457,1.73048 0.4571,2.77735 z"
               id="path3376"
               inkscape:connector-curvature="0" /><path
               d="m -1012.9062,748.20877 c -10e-5,4.28126 -0.6758,7.5586 -2.0274,9.83203 -1.3516,2.27344 -3.2852,3.41016 -5.8008,3.41016 -2.4844,0 -4.3867,-1.13672 -5.707,-3.41016 -1.3203,-2.27343 -1.9805,-5.55077 -1.9805,-9.83203 0,-8.7656 2.5938,-13.14841 7.7813,-13.14844 2.4375,3e-5 4.3359,1.14847 5.6953,3.44532 1.3593,2.29689 2.039,5.53126 2.0391,9.70312 z m -13.1954,0 c 0,3.67188 0.4375,6.44532 1.3125,8.32031 0.875,1.87501 2.2422,2.8125 4.1016,2.8125 3.6406,0 5.4609,-3.71093 5.4609,-11.13281 0,-7.35935 -1.8203,-11.03904 -5.4609,-11.03906 -1.9063,2e-5 -3.2852,0.9219 -4.1367,2.76562 -0.8516,1.84377 -1.2774,4.60158 -1.2774,8.27344 z"
               id="path3378"
               inkscape:connector-curvature="0" /><path
               d="m -1000.7656,737.52127 -3.9844,0 0,23.46094 -2.2031,0 0,-23.46094 -3.2344,0 0,-1.26562 3.2344,-0.96094 0,-1.92188 c 0,-3.23434 0.3828,-5.56246 1.1484,-6.98437 0.7656,-1.42184 2.0938,-2.13278 3.9844,-2.13281 1.0937,3e-5 2.08591,0.19534 2.97655,0.58593 l -0.77344,2.0625 c -0.82811,-0.39059 -1.57811,-0.5859 -2.25001,-0.58593 -0.7656,3e-5 -1.3437,0.22659 -1.7344,0.67968 -0.3906,0.45316 -0.6797,1.18754 -0.8671,2.20313 -0.1876,1.01565 -0.2813,2.4219 -0.2813,4.21875 l 0,2.13281 3.9844,0 z"
               id="path3380"
               inkscape:connector-curvature="0" /><path
               d="m -992,759.38846 c 0.68749,0 1.29687,-0.0937 1.82813,-0.28125 l 0,1.875 c -0.68751,0.3125 -1.57033,0.46875 -2.64844,0.46875 -2.62501,0 -3.93751,-1.96094 -3.9375,-5.88281 l 0,-18.04688 -2.29688,0 0,-1.3125 2.25,-0.65625 0.72657,-6.04687 1.54687,0 0,6.04687 4.03125,0 0,1.96875 -4.03125,0 0,17.41406 c -10e-6,1.71876 0.18749,2.89063 0.5625,3.51563 0.37499,0.625 1.03124,0.9375 1.96875,0.9375 z"
               id="path3382"
               inkscape:connector-curvature="0" /><path
               d="m -972.03125,760.98221 -3.51562,-17.22656 c -0.0313,-0.12499 -0.0586,-0.2578 -0.082,-0.39844 -0.0235,-0.14061 -0.26954,-1.64061 -0.73828,-4.5 l -0.0469,0 -0.32813,1.99219 -0.53906,2.90625 -3.63281,17.22656 -2.64844,0 -5.53125,-25.42969 2.22656,0 3.16407,14.8125 1.47656,7.73438 0.14062,0 c 0.28124,-2.23437 0.73437,-4.82812 1.35938,-7.78125 l 3.16406,-14.76563 2.34375,0 3.1875,14.8125 c 0.24998,1.10939 0.69529,3.68751 1.33594,7.73438 l 0.14062,0 c 0.0469,-0.51563 0.27733,-1.8125 0.69141,-3.89063 0.41404,-2.07812 1.73826,-8.29686 3.97266,-18.65625 l 2.20312,0 -5.71875,25.42969 z"
               id="path3384"
               inkscape:connector-curvature="0" /><path
               d="m -949.97656,760.98221 -0.28125,-3.5625 -0.0937,0 c -1.21876,2.6875 -3.06251,4.03125 -5.53125,4.03125 -1.65626,0 -2.98829,-0.66016 -3.9961,-1.98047 -1.00781,-1.32031 -1.51172,-3.08984 -1.51171,-5.30859 -10e-6,-2.42187 0.72655,-4.33984 2.17968,-5.75391 1.45312,-1.41405 3.49218,-2.18358 6.11719,-2.30859 l 2.74219,-0.14063 0,-2.10937 c -2e-5,-2.37498 -0.29689,-4.10545 -0.89063,-5.19141 -0.59376,-1.08591 -1.57813,-1.62888 -2.95312,-1.62891 -1.45314,3e-5 -2.93751,0.47659 -4.45313,1.42969 l -0.96093,-1.75781 c 1.76561,-1.09373 3.61718,-1.6406 5.55468,-1.64063 2.09374,3e-5 3.60155,0.66018 4.52344,1.98047 0.92186,1.32034 1.3828,3.52737 1.38281,6.6211 l 0,17.32031 z m -5.41406,-1.42969 c 1.59374,0 2.83202,-0.78515 3.71484,-2.35547 0.8828,-1.57031 1.3242,-3.79296 1.32422,-6.66797 l 0,-2.64843 -2.64844,0.14062 c -2.04688,0.10939 -3.56641,0.67579 -4.55859,1.69922 -0.9922,1.02345 -1.48829,2.51954 -1.48828,4.48828 -10e-6,1.84376 0.32812,3.19532 0.98437,4.05469 0.65624,0.85937 1.54687,1.28906 2.67188,1.28906 z"
               id="path3386"
               inkscape:connector-curvature="0" /><path
               d="m -934.39062,735.06033 c 0.79686,3e-5 1.53905,0.1094 2.22656,0.32813 l -0.53906,2.22656 c -0.56252,-0.23435 -1.14064,-0.35154 -1.73438,-0.35156 -0.85938,2e-5 -1.66016,0.44143 -2.40234,1.32422 -0.7422,0.88283 -1.32423,2.1133 -1.7461,3.6914 -0.42188,1.57815 -0.63282,3.32033 -0.63281,5.22657 l 0,13.47656 -2.22656,0 0,-25.42969 1.82812,0 0.23438,4.45313 0.16406,0 c 1.18749,-3.29686 2.79687,-4.94529 4.82813,-4.94532 z"
               id="path3388"
               inkscape:connector-curvature="0" /><path
               d="m -921.10156,761.45096 c -2.68751,0 -4.75391,-1.14453 -6.19922,-3.4336 -1.44532,-2.28905 -2.16797,-5.48046 -2.16797,-9.57421 0,-4.34374 0.64453,-7.66014 1.93359,-9.94922 1.28906,-2.28904 3.14453,-3.43357 5.56641,-3.4336 2.10936,3e-5 3.77342,1.00393 4.99219,3.01172 1.21873,2.00784 1.82811,4.71486 1.82812,8.1211 l 0,2.0625 -12.04687,0 c 0.0312,3.70313 0.55468,6.47656 1.57031,8.32031 1.01562,1.84375 2.55468,2.76562 4.61719,2.76562 1.59374,0 3.27342,-0.52343 5.03906,-1.57031 l 0,2.15625 c -1.62501,1.01563 -3.33595,1.52344 -5.13281,1.52344 z m -1.00781,-24.375 c -3.06251,2e-5 -4.7422,3.05471 -5.03907,9.16406 l 9.77344,0 c -10e-6,-2.79686 -0.4258,-5.02342 -1.27734,-6.67969 -0.85158,-1.65622 -2.00392,-2.48435 -3.45703,-2.48437 z"
               id="path3390"
               inkscape:connector-curvature="0" /><path
               d="m -893.98437,737.52127 -3.98438,0 0,23.46094 -2.20312,0 0,-23.46094 -3.23438,0 0,-1.26562 3.23438,-0.96094 0,-1.92188 c -10e-6,-3.23434 0.3828,-5.56246 1.14843,-6.98437 0.76562,-1.42184 2.09375,-2.13278 3.98438,-2.13281 1.09374,3e-5 2.08592,0.19534 2.97656,0.58593 l -0.77344,2.0625 c -0.82813,-0.39059 -1.57813,-0.5859 -2.25,-0.58593 -0.76563,3e-5 -1.34375,0.22659 -1.73437,0.67968 -0.39063,0.45316 -0.6797,1.18754 -0.86719,2.20313 -0.18751,1.01565 -0.28126,2.4219 -0.28125,4.21875 l 0,2.13281 3.98438,0 z"
               id="path3392"
               inkscape:connector-curvature="0" /><path
               d="m -882.82812,735.06033 c 0.79686,3e-5 1.53905,0.1094 2.22656,0.32813 l -0.53906,2.22656 c -0.56252,-0.23435 -1.14064,-0.35154 -1.73438,-0.35156 -0.85938,2e-5 -1.66016,0.44143 -2.40234,1.32422 -0.7422,0.88283 -1.32423,2.1133 -1.7461,3.6914 -0.42188,1.57815 -0.63282,3.32033 -0.63281,5.22657 l 0,13.47656 -2.22656,0 0,-25.42969 1.82812,0 0.23438,4.45313 0.16406,0 c 1.18749,-3.29686 2.79687,-4.94529 4.82813,-4.94532 z"
               id="path3394"
               inkscape:connector-curvature="0" /><path
               d="m -869.53906,761.45096 c -2.68751,0 -4.75391,-1.14453 -6.19922,-3.4336 -1.44532,-2.28905 -2.16797,-5.48046 -2.16797,-9.57421 0,-4.34374 0.64453,-7.66014 1.93359,-9.94922 1.28906,-2.28904 3.14453,-3.43357 5.56641,-3.4336 2.10936,3e-5 3.77342,1.00393 4.99219,3.01172 1.21873,2.00784 1.82811,4.71486 1.82812,8.1211 l 0,2.0625 -12.04687,0 c 0.0312,3.70313 0.55468,6.47656 1.57031,8.32031 1.01562,1.84375 2.55468,2.76562 4.61719,2.76562 1.59374,0 3.27342,-0.52343 5.03906,-1.57031 l 0,2.15625 c -1.62501,1.01563 -3.33595,1.52344 -5.13281,1.52344 z m -1.00781,-24.375 c -3.06251,2e-5 -4.7422,3.05471 -5.03907,9.16406 l 9.77344,0 c -10e-6,-2.79686 -0.4258,-5.02342 -1.27734,-6.67969 -0.85158,-1.65622 -2.00392,-2.48435 -3.45703,-2.48437 z"
               id="path3396"
               inkscape:connector-curvature="0" /><path
               d="m -850.69531,761.45096 c -2.68751,0 -4.75391,-1.14453 -6.19922,-3.4336 -1.44532,-2.28905 -2.16797,-5.48046 -2.16797,-9.57421 0,-4.34374 0.64453,-7.66014 1.93359,-9.94922 1.28906,-2.28904 3.14453,-3.43357 5.56641,-3.4336 2.10936,3e-5 3.77342,1.00393 4.99219,3.01172 1.21873,2.00784 1.82811,4.71486 1.82812,8.1211 l 0,2.0625 -12.04687,0 c 0.0312,3.70313 0.55468,6.47656 1.57031,8.32031 1.01562,1.84375 2.55468,2.76562 4.61719,2.76562 1.59374,0 3.27342,-0.52343 5.03906,-1.57031 l 0,2.15625 c -1.62501,1.01563 -3.33595,1.52344 -5.13281,1.52344 z m -1.00781,-24.375 c -3.06251,2e-5 -4.7422,3.05471 -5.03907,9.16406 l 9.77344,0 c -10e-6,-2.79686 -0.4258,-5.02342 -1.27734,-6.67969 -0.85158,-1.65622 -2.00392,-2.48435 -3.45703,-2.48437 z"
               id="path3398"
               inkscape:connector-curvature="0" /><path
               d="m -832.85937,761.45096 c -4.93751,0 -7.40626,-4.38281 -7.40625,-13.14844 -10e-6,-4.31248 0.61718,-7.59764 1.85156,-9.85547 1.23437,-2.25779 3.05468,-3.38669 5.46094,-3.38672 1.14061,3e-5 2.22264,0.32815 3.24609,0.98438 1.02342,0.65627 1.83983,1.56252 2.44922,2.71875 l 0.1875,0 -0.0937,-2.83594 0,-11.41406 2.22656,0 0,36.46875 -1.82812,0 -0.1875,-3.5625 -0.21094,0 c -0.60939,1.29688 -1.39845,2.29297 -2.36719,2.98828 -0.96876,0.69531 -2.07814,1.04297 -3.32812,1.04297 z m 0.14062,-1.94531 c 1.78124,0 3.15233,-0.82422 4.11328,-2.47266 0.96092,-1.64843 1.44139,-4.07421 1.44141,-7.27734 l 0,-1.45313 c -2e-5,-3.84373 -0.46486,-6.66014 -1.39453,-8.44922 -0.9297,-1.78904 -2.34767,-2.68357 -4.25391,-2.68359 -1.82813,2e-5 -3.14063,0.95705 -3.9375,2.87109 -0.79688,1.91408 -1.19532,4.68361 -1.19531,8.3086 -1e-5,3.65625 0.41406,6.42969 1.24219,8.32031 0.82811,1.89063 2.15624,2.83594 3.98437,2.83594 z"
               id="path3400"
               inkscape:connector-curvature="0" /><path
               d="m -803.84375,748.20877 c -2e-5,4.28126 -0.6758,7.5586 -2.02734,9.83203 -1.35158,2.27344 -3.28517,3.41016 -5.80078,3.41016 -2.48439,0 -4.38673,-1.13672 -5.70704,-3.41016 -1.32031,-2.27343 -1.98047,-5.55077 -1.98046,-9.83203 -10e-6,-8.7656 2.59374,-13.14841 7.78125,-13.14844 2.43748,3e-5 4.33592,1.14847 5.69531,3.44532 1.35936,2.29689 2.03904,5.53126 2.03906,9.70312 z m -13.19531,0 c -1e-5,3.67188 0.43749,6.44532 1.3125,8.32031 0.87499,1.87501 2.24218,2.8125 4.10156,2.8125 3.64061,0 5.46092,-3.71093 5.46094,-11.13281 -2e-5,-7.35935 -1.82033,-11.03904 -5.46094,-11.03906 -1.90626,2e-5 -3.28516,0.9219 -4.13672,2.76562 -0.85157,1.84377 -1.27735,4.60158 -1.27734,8.27344 z"
               id="path3402"
               inkscape:connector-curvature="0" /><path
               d="m -776.58594,760.98221 0,-17.32031 c -2e-5,-4.26561 -1.25002,-6.39842 -3.75,-6.39844 -1.71877,2e-5 -2.95705,0.74611 -3.71484,2.23828 -0.75783,1.49221 -1.13674,3.69142 -1.13672,6.59766 l 0,14.88281 -2.20312,0 0,-17.32031 c -2e-5,-2.15623 -0.30471,-3.7617 -0.91407,-4.81641 -0.60939,-1.05467 -1.5547,-1.58201 -2.83593,-1.58203 -1.68751,2e-5 -2.91408,0.76565 -3.67969,2.29687 -0.76563,1.53127 -1.14845,4.01565 -1.14844,7.45313 l 0,13.96875 -2.22656,0 0,-25.42969 1.875,0 0.1875,3.53906 0.21094,0 c 1.01561,-2.68747 2.74217,-4.03122 5.17968,-4.03125 1.40624,3e-5 2.51561,0.37503 3.32813,1.125 0.81248,0.75003 1.39842,1.84378 1.75781,3.28125 0.60936,-1.56247 1.35936,-2.68747 2.25,-3.375 0.89061,-0.68747 2.04685,-1.03122 3.46875,-1.03125 1.92185,3e-5 3.3281,0.73831 4.21875,2.21485 0.8906,1.47658 1.33591,3.83986 1.33594,7.08984 l 0,16.61719 z"
               id="path3404"
               inkscape:connector-curvature="0" /></g></g></g></g><g
       inkscape:export-ydpi="19.552074"
       inkscape:export-xdpi="19.552074"
       inkscape:export-filename="/media/sicher/maren/www/sponsor_canonical_170x78.png"
       transform="matrix(0.29090519,0,0,0.29090519,218.49178,750.95318)"
       id="g4722"><rect
         y="-809.69727"
         x="-876.63416"
         height="314.58859"
         width="735.8399"
         id="rect4480"
         style="opacity:0.51194536;color:#000000;fill:#000000;fill-opacity:1;fill-rule:nonzero;stroke:none;stroke-width:3.6924777;marker:none;visibility:visible;display:inline;overflow:visible;enable-background:accumulate;filter:url(#filter4778)"
         ry="65" /><rect
         ry="65"
         style="color:#000000;fill:#ffffff;fill-opacity:1;fill-rule:nonzero;stroke:#b6b6b6;stroke-width:3.6924777;stroke-opacity:1;marker:none;visibility:visible;display:inline;overflow:visible;enable-background:accumulate"
         id="rect4484"
         width="735.8399"
         height="314.58859"
         x="-876.63416"
         y="-809.69727" /><g
         id="g4200"
         transform="matrix(0.74590048,0,0,0.74590048,-771.48294,-273.62795)"><rect
           style="color:#000000;fill:#ffffff;fill-opacity:1;fill-rule:nonzero;stroke:none;stroke-width:3.64684176;marker:none;visibility:visible;display:inline;overflow:visible;enable-background:accumulate"
           id="rect4198"
           width="934.69977"
           height="241.57513"
           x="-115.06597"
           y="-628.59662" /><g
           transform="translate(-27.710087,-557.41555)"
           id="g3277"><path
             style="fill:#772953"
             inkscape:connector-curvature="0"
             d="m 44.674,99.213 c -6.67,0 -12.744,-1.096 -18.226,-3.288 C 20.967,93.732 16.26,90.512 12.334,86.264 8.404,82.016 5.366,76.832 3.221,70.71 1.073,64.591 0,57.555 0,49.606 0,41.658 1.187,34.601 3.563,28.434 5.937,22.268 9.181,17.084 13.292,12.881 17.403,8.68 22.152,5.481 27.544,3.287 32.934,1.097 38.645,0 44.674,0 c 4.111,0 7.788,0.273 11.031,0.822 3.242,0.548 6.051,1.188 8.428,1.918 2.374,0.732 4.293,1.463 5.755,2.193 1.461,0.732 2.467,1.279 3.016,1.644 l -3.975,10.964 c -0.822,-0.549 -2.01,-1.142 -3.562,-1.782 -1.555,-0.638 -3.357,-1.278 -5.413,-1.919 -2.056,-0.637 -4.316,-1.164 -6.783,-1.576 -2.466,-0.41 -5.07,-0.616 -7.811,-0.616 -4.659,0 -8.907,0.87 -12.744,2.604 -3.838,1.737 -7.126,4.248 -9.867,7.537 -2.74,3.29 -4.864,7.287 -6.372,11.991 -1.507,4.706 -2.261,9.982 -2.261,15.827 0,5.666 0.662,10.827 1.987,15.486 1.322,4.659 3.333,8.656 6.029,11.99 2.693,3.336 6.029,5.916 10.003,7.743 3.975,1.828 8.655,2.74 14.047,2.74 6.029,0 11.031,-0.639 15.005,-1.919 3.975,-1.278 6.965,-2.419 8.976,-3.426 l 3.426,10.963 c -0.64,0.458 -1.781,1.028 -3.426,1.713 -1.645,0.685 -3.7,1.35 -6.167,1.986 -2.466,0.639 -5.344,1.187 -8.633,1.646 -3.289,0.456 -6.852,0.684 -10.689,0.684 z"
             id="path3055" /><path
             style="fill:#772953"
             inkscape:connector-curvature="0"
             d="m 129.086,2.193 c 3.289,6.852 6.441,13.771 9.456,20.761 3.015,6.988 6.051,14.319 9.112,21.993 3.06,7.674 6.188,15.784 9.388,24.324 3.196,8.544 6.622,17.839 10.277,27.887 h -14.526 c -1.555,-4.11 -3.015,-8.175 -4.385,-12.195 -1.371,-4.02 -2.788,-8.085 -4.248,-12.196 H 101.131 L 92.498,97.159 H 78.657 c 3.653,-10.048 7.079,-19.343 10.277,-27.887 3.197,-8.54 6.325,-16.649 9.388,-24.324 3.06,-7.674 6.098,-15.005 9.112,-21.993 3.015,-6.99 6.167,-13.909 9.455,-20.761 h 12.197 z m -6.44,15.21 c -3.199,6.852 -6.234,13.978 -9.113,21.378 -2.877,7.399 -5.733,15.122 -8.564,23.159 h 35.355 C 137.399,53.993 134.5,46.296 131.622,38.849 128.743,31.404 125.75,24.255 122.646,17.403 z"
             id="path3057" /><path
             style="fill:#772953"
             inkscape:connector-curvature="0"
             d="m 245.839,97.158 c -2.011,-3.379 -4.316,-7.171 -6.92,-11.374 -2.604,-4.201 -5.413,-8.564 -8.429,-13.087 -3.015,-4.521 -6.144,-9.112 -9.387,-13.771 -3.243,-4.66 -6.463,-9.16 -9.661,-13.499 -3.198,-4.339 -6.303,-8.429 -9.317,-12.266 -3.014,-3.837 -5.804,-7.216 -8.359,-10.141 V 97.156 H 180.748 V 2.193 h 10.551 c 4.294,4.568 8.884,9.889 13.772,15.964 4.886,6.076 9.729,12.333 14.525,18.773 4.796,6.44 9.318,12.768 13.566,18.98 4.248,6.214 7.833,11.74 10.758,16.581 V 2.193 h 13.018 v 94.964 h -11.099 z"
             id="path3059" /><path
             style="fill:#772953"
             inkscape:connector-curvature="0"
             d="m 453.309,97.158 c -2.012,-3.379 -4.316,-7.171 -6.92,-11.374 -2.604,-4.201 -5.414,-8.564 -8.428,-13.087 -3.016,-4.521 -6.145,-9.112 -9.387,-13.771 -3.244,-4.66 -6.465,-9.16 -9.662,-13.499 -3.197,-4.339 -6.303,-8.429 -9.318,-12.266 -3.014,-3.837 -5.803,-7.216 -8.359,-10.141 V 97.156 H 388.217 V 2.193 h 10.551 c 4.295,4.568 8.885,9.889 13.773,15.964 4.887,6.076 9.729,12.333 14.525,18.773 4.796,6.44 9.318,12.768 13.566,18.98 4.248,6.214 7.832,11.74 10.758,16.581 V 2.193 h 13.018 v 94.964 h -11.099 z"
             id="path3061" /><path
             style="fill:#772953"
             inkscape:connector-curvature="0"
             d="m 488.525,2.193 h 13.293 V 97.157 H 488.525 V 2.193 z"
             id="path3063" /><path
             style="fill:#772953"
             inkscape:connector-curvature="0"
             d="m 566.771,99.213 c -6.67,0 -12.744,-1.096 -18.227,-3.288 -5.48,-2.193 -10.188,-5.413 -14.113,-9.661 -3.93,-4.248 -6.969,-9.432 -9.113,-15.554 -2.146,-6.119 -3.221,-13.155 -3.221,-21.104 0,-7.948 1.188,-15.005 3.562,-21.172 2.375,-6.166 5.619,-11.35 9.73,-15.553 4.111,-4.201 8.861,-7.4 14.252,-9.594 5.39,-2.19 11.101,-3.287 17.13,-3.287 4.111,0 7.787,0.273 11.031,0.822 3.242,0.548 6.051,1.188 8.428,1.918 2.375,0.732 4.293,1.463 5.756,2.193 1.459,0.732 2.467,1.279 3.014,1.644 l -3.973,10.964 c -0.822,-0.549 -2.012,-1.142 -3.564,-1.782 -1.555,-0.638 -3.357,-1.278 -5.412,-1.919 -2.055,-0.637 -4.316,-1.164 -6.783,-1.576 -2.467,-0.41 -5.07,-0.616 -7.811,-0.616 -4.658,0 -8.908,0.87 -12.744,2.604 -3.838,1.737 -7.125,4.248 -9.867,7.537 -2.74,3.29 -4.865,7.287 -6.371,11.991 -1.508,4.706 -2.262,9.982 -2.262,15.827 0,5.666 0.662,10.827 1.986,15.486 1.324,4.659 3.334,8.656 6.029,11.99 2.693,3.336 6.029,5.916 10.004,7.743 3.975,1.828 8.656,2.74 14.047,2.74 6.029,0 11.031,-0.639 15.006,-1.919 3.973,-1.278 6.965,-2.419 8.975,-3.426 l 3.426,10.963 c -0.641,0.458 -1.781,1.028 -3.426,1.713 -1.645,0.685 -3.699,1.35 -6.166,1.986 -2.467,0.639 -5.344,1.187 -8.633,1.646 -3.289,0.456 -6.852,0.684 -10.69,0.684 z"
             id="path3065" /><path
             style="fill:#772953"
             inkscape:connector-curvature="0"
             d="m 651.184,2.193 c 3.289,6.852 6.441,13.771 9.457,20.761 3.014,6.988 6.051,14.319 9.111,21.993 3.061,7.674 6.189,15.784 9.389,24.324 3.195,8.544 6.621,17.839 10.277,27.887 h -14.527 c -1.555,-4.11 -3.014,-8.175 -4.385,-12.195 -1.371,-4.02 -2.787,-8.085 -4.248,-12.196 H 623.23 l -8.635,24.392 h -13.84 c 3.652,-10.048 7.078,-19.343 10.277,-27.887 3.197,-8.54 6.326,-16.649 9.387,-24.324 3.061,-7.674 6.098,-15.005 9.113,-21.993 3.014,-6.99 6.166,-13.909 9.455,-20.761 h 12.197 z m -6.44,15.21 c -3.199,6.852 -6.236,13.978 -9.113,21.378 -2.877,7.399 -5.734,15.122 -8.564,23.159 h 35.355 c -2.926,-7.947 -5.824,-15.644 -8.703,-23.091 -2.877,-7.445 -5.871,-14.594 -8.975,-21.446 z"
             id="path3067" /><path
             style="fill:#772953"
             inkscape:connector-curvature="0"
             d="m 759.988,86.058 v 11.1 H 702.845 V 2.193 h 13.293 v 83.865 h 43.85 z"
             id="path3069" /><path
             style="fill:#772953"
             inkscape:connector-curvature="0"
             d="m 322.58,81.194 c -17.445,0 -31.587,-14.138 -31.587,-31.587 0,-17.446 14.142,-31.586 31.587,-31.586 17.446,0 31.587,14.14 31.587,31.586 0,17.449 -14.141,31.587 -31.587,31.587 z"
             id="path3071" /><path
             style="fill:#772953"
             inkscape:connector-curvature="0"
             d="m 372.186,49.608 c 0,27.396 -22.21,49.605 -49.606,49.605 -27.398,0 -49.606,-22.21 -49.606,-49.605 0,-27.397 22.208,-49.606 49.606,-49.606 27.396,-0.001 49.606,22.208 49.606,49.606 z m -49.607,-37.54 c -20.734,0 -37.539,16.808 -37.539,37.54 0,20.735 16.805,37.538 37.539,37.538 20.734,0 37.539,-16.803 37.539,-37.538 0,-20.733 -16.805,-37.54 -37.539,-37.54 z"
             id="path3073" /></g></g></g><g
       inkscape:export-ydpi="19.552074"
       inkscape:export-xdpi="19.552074"
       inkscape:export-filename="/media/sicher/maren/www/sponsor_fastly_170x78.png"
       transform="matrix(0.29090519,0,0,0.29090519,486.86199,854.99547)"
       id="g4739"><rect
         y="-1167.3474"
         x="-847.49231"
         height="314.58859"
         width="735.8399"
         id="rect4422"
         style="opacity:0.51194536;color:#000000;fill:#000000;fill-opacity:1;fill-rule:nonzero;stroke:none;stroke-width:3.6924777;marker:none;visibility:visible;display:inline;overflow:visible;enable-background:accumulate;filter:url(#filter4758)"
         ry="65" /><rect
         ry="65"
         style="color:#000000;fill:#ffffff;fill-opacity:1;fill-rule:nonzero;stroke:#b6b6b6;stroke-width:3.6924777;stroke-opacity:1;marker:none;visibility:visible;display:inline;overflow:visible;enable-background:accumulate"
         id="rect4426"
         width="735.8399"
         height="314.58859"
         x="-847.49231"
         y="-1167.3474" /><g
         transform="matrix(0.25158366,0,0,-0.25158366,-696.63013,-913.11448)"
         inkscape:label="ink_ext_XXXXXX"
         id="g3247"><g
           transform="scale(0.116496,0.116496)"
           id="g3249"><path
             id="path3251"
             style="fill:#e9232a;fill-opacity:1;fill-rule:nonzero;stroke:none"
             d="m 9907.19,5439.27 0,-3614.44 1085.71,0 0,552.25 -358.7,0 0,3612.76 -727.1,-0.1 0.09,-550.47"
             inkscape:connector-curvature="0" /><path
             id="path3253"
             style="fill:#e9232a;fill-opacity:1;fill-rule:nonzero;stroke:none"
             d="m 479.438,2377.08 369.07,0 0,1743.81 -369.07,0 0,479.57 369.07,60.7 0,485.45 c 0,588.03 127.988,843.21 877.882,843.21 161.96,0 353.93,-23.91 522.01,-54.19 l -99.63,-591.11 c -113.83,18.04 -170.28,21.24 -242.23,21.24 -264.2,0 -331,-26.36 -331,-284.5 l 0,-420.1 548.55,0 0,-540.27 -548.55,0 0,-1743.81 365.23,0 0,-552.16 -1461.332,-0.16 0,552.32"
             inkscape:connector-curvature="0" /><path
             id="path3255"
             style="fill:#e9232a;fill-opacity:1;fill-rule:nonzero;stroke:none"
             d="m 9537.39,2551.6 c -113.74,-23.99 -213.23,-21.11 -285.16,-22.87 -299.07,-7.36 -273.23,90.96 -273.23,372.98 l 0,1219.18 569.29,0 0,540.27 -569.29,0 0,1328.68 -727.07,0 0,-3238.88 c 0,-635.91 156.94,-926.13 840.89,-926.13 161.98,0 384.57,41.69 552.64,77.68 l -108.07,649.09"
             inkscape:connector-curvature="0" /><path
             id="path3257"
             style="fill:#e9232a;fill-opacity:1;fill-rule:nonzero;stroke:none"
             d="m 14010.7,2100.7 49.3,0 c 28.3,0 47.1,10.95 47.1,40.68 0,28.2 -18.8,39.23 -45.5,39.23 l -50.9,0 0,-79.91 z m 94,-135.56 -55.7,81.49 -38.3,0 0,-81.49 -61.9,0 0,269.54 112.8,0 c 66.6,0 108.1,-33.71 108.1,-93.3 0,-43.81 -21.9,-73.61 -56.4,-83.78 l 67.4,-92.46 -76,0 z m -50.9,-96.36 c 126.9,0 230.3,104.18 230.3,231.08 0,126.98 -103.4,228.01 -230.3,228.01 -126.9,0 -229.7,-101.03 -229.7,-228.01 0,-126.9 102.8,-231.08 229.7,-231.08 m 0,505.34 c 152.8,0 276.5,-121.45 276.5,-274.26 0,-152.76 -123.7,-274.18 -276.5,-274.18 -152.8,0 -275.8,121.42 -275.8,274.18 0,152.81 123,274.26 275.8,274.26"
             inkscape:connector-curvature="0" /><path
             id="path3259"
             style="fill:#e9232a;fill-opacity:1;fill-rule:nonzero;stroke:none"
             d="m 7344.38,4121.88 0,96.72 c -219.95,40.11 -438.36,40.7 -556.84,40.7 -338.34,0 -379.58,-179.42 -379.58,-276.68 0,-137.6 46.94,-211.99 413.48,-292.13 535.77,-120.28 1073.86,-245.78 1073.86,-910.13 0,-630.03 -324.25,-955.53 -1006.78,-955.53 -456.72,0 -899.88,98.05 -1238,183.85 l 0,542.92 550.55,0 -0.32,-96.45 c 236.92,-45.76 485.33,-41.19 615.02,-41.19 360.88,0 419.27,194.04 419.27,297.19 0,143.17 -103.49,211.92 -441.78,280.52 -637.33,108.89 -1143.13,326.49 -1143.13,973.88 0,612.78 409.84,853.16 1092.38,853.16 462.39,0 813.98,-71.71 1152.29,-157.55 l 0,-539.28 -550.42,0"
             inkscape:connector-curvature="0" /><path
             id="path3261"
             style="fill:#e9232a;fill-opacity:1;fill-rule:nonzero;stroke:none"
             d="M 3999.43,3644.66 3944.1,3700 3663.13,3455.13 c -14.18,5.09 -29.35,8 -45.2,8 -75.82,0 -137.2,-63.18 -137.2,-141.05 0,-77.95 61.38,-141.12 137.2,-141.12 75.78,0 137.31,63.17 137.31,141.12 0,14.78 -2.24,29.03 -6.36,42.43 l 250.55,280.15"
             inkscape:connector-curvature="0" /><path
             id="path3263"
             style="fill:#e9232a;fill-opacity:1;fill-rule:nonzero;stroke:none"
             d="m 3661.4,2553.25 0,85.46 -87.1,0 0,-85.22 c -390.2,22.75 -702.31,336.24 -722.67,727.07 l 86.58,0 0,87.1 -86.13,0 c 23.14,388.12 333.96,698.64 722.22,721.28 l 0,-85.67 87.1,0 0,85.91 c 382.71,-20.46 690.98,-320.66 724.3,-699.82 l 0,-24.98 -87.27,0 0,-87.1 87.29,0 0.02,-23.85 c -33.15,-379.34 -341.51,-679.72 -724.34,-700.18 z m 1451.6,-1.65 -0.47,2262.39 -727.02,0 0,-212.16 c -149.74,89.84 -316.54,154.08 -494.32,187 l 4.11,0 0,251.06 88.71,0 0,184.64 -732.04,0 0,-184.64 88.69,0 0,-251.06 5.04,0 c -695.35,-128.01 -1222.3,-736.9 -1222.3,-1469.27 0,-825.37 669.08,-1494.45 1494.44,-1494.45 281.7,0 545.12,78.04 770.02,213.52 l 130.97,-213.8 767.94,0 0,726.77 -173.77,0"
             inkscape:connector-curvature="0" /><path
             id="path3265"
             style="fill:#e9232a;fill-opacity:1;fill-rule:nonzero;stroke:none"
             d="m 12832.9,4661.16 1499.6,0 0,-539.75 -358.5,0 -919.6,-2262.46 c -263.5,-635.56 -696.5,-1233.735 -1355.7,-1233.735 -162.2,0 -378,17.965 -527.6,53.922 l 65.7,659.863 c 96.1,-17.96 221.9,-29.78 287.9,-29.78 305.7,0 650.5,189.45 758.4,519.28 l -931.7,2292.91 -358.5,0 0,539.75 1500.3,0 0,-539.75 -358.4,0 527.9,-1298.75 0,0 527.9,1298.75 -357.7,0 0,539.75"
             inkscape:connector-curvature="0" /></g></g></g><g
       inkscape:export-ydpi="19.552074"
       inkscape:export-xdpi="19.552074"
       inkscape:export-filename="/media/sicher/maren/www/sponsor_OSUOSL_170x78.png"
       transform="matrix(0.29090519,0,0,0.29090519,772.18722,964.43253)"
       id="g4753"><rect
         y="-1543.5424"
         x="-876.63416"
         height="314.58859"
         width="735.8399"
         id="rect4363"
         style="opacity:0.51194536;color:#000000;fill:#000000;fill-opacity:1;fill-rule:nonzero;stroke:none;stroke-width:3.6924777;marker:none;visibility:visible;display:inline;overflow:visible;enable-background:accumulate;filter:url(#filter4738)"
         ry="65" /><rect
         ry="65"
         style="color:#000000;fill:#ffffff;fill-opacity:1;fill-rule:nonzero;stroke:#b6b6b6;stroke-width:3.6924777;stroke-opacity:1;marker:none;visibility:visible;display:inline;overflow:visible;enable-background:accumulate"
         id="rect4368"
         width="735.8399"
         height="314.58859"
         x="-876.63416"
         y="-1543.5424" /><g
         transform="matrix(1.5389387,0,0,-1.5389387,-760.32314,-1318.2477)"
         inkscape:label="ink_ext_XXXXXX"
         id="g3106"><g
           transform="scale(0.1,0.1)"
           id="g3108"><path
             id="path3142"
             style="fill:#231f20;fill-opacity:1;fill-rule:nonzero;stroke:none"
             d="m 403.102,62.5 c 0,-36.6992 36.605,-62.5 100.007,-62.5 63.407,0 100.082,25.8008 100.082,62.5 0,35.832 -36.929,62.5 -100.082,62.5 -63.097,0 -100.007,-26.6484 -100.007,-62.5 l 0,0 z M 435,62.6992 c 0,24.5703 22.5,47.4298 68.109,46.9218 45.641,0.508 68.176,-22.3007 68.176,-46.9218 0,-24.0976 -20.433,-47.3086 -68.176,-47.3086 -47.679,0 -68.109,23.211 -68.109,47.3086 l 0,0"
             inkscape:connector-curvature="0" /><path
             id="path3144"
             style="fill:#231f20;fill-opacity:1;fill-rule:nonzero;stroke:none"
             d="m 628.926,1.80859 30.097,0 0,48.00001 29.161,0 c 37.48,0 73.488,9.6133 73.488,36.75 0,27.8324 -35.527,36.6134 -78.164,36.6134 l -54.582,0 0,-121.36341 z m 30.097,106.01141 25.176,0 c 18.36,0 45.621,-5.609 45.621,-21.0309 0,-16.0977 -23.101,-21.5586 -41.48,-21.5586 l -29.317,0 0,42.5895"
             inkscape:connector-curvature="0" /><path
             id="path3146"
             style="fill:#231f20;fill-opacity:1;fill-rule:nonzero;stroke:none"
             d="m 782.09,1.80859 116.797,0 0,15.40231 -86.715,0 0,39.8399 78.976,0 0,15.4101 -78.976,0 0,35.3011 86.715,0 0,15.41 -116.797,0 0,-121.36341"
             inkscape:connector-curvature="0" /><path
             id="path3148"
             style="fill:#231f20;fill-opacity:1;fill-rule:nonzero;stroke:none"
             d="m 930.844,1.80859 30.097,0 0,99.67941 0.582,0 94.087,-99.67941 38.11,0 0,121.39041 -30.1,0 0,-97.8201 -0.58,0 -91.7,97.8201 -40.465,0 -0.031,-121.39041"
             inkscape:connector-curvature="0" /><path
             id="path3150"
             style="fill:#231f20;fill-opacity:1;fill-rule:nonzero;stroke:none"
             d="m 1341.79,120.48 c -14.25,3.071 -30.59,4.52 -44.24,4.52 -37.39,0 -66.51,-11.371 -66.51,-32.8281 0,-37.5235 88.5,-30.0899 88.5,-57.0703 0,-14.1328 -23.64,-19.711 -40.48,-19.711 -15.06,0 -32.79,3.2696 -42.87,5.5196 L 1233.24,4.96094 C 1246.93,2.41016 1261.15,0 1275.7,0 c 41.6,0 75.76,10.1992 75.76,35.9688 0,39.7304 -88.49,34.3906 -88.49,57.5429 0,12.5973 19.45,16.0703 36.02,16.0703 15.33,0 23.61,-1.422 38.65,-4.672 l 4.15,15.57"
             inkscape:connector-curvature="0" /><path
             id="path3152"
             style="fill:#231f20;fill-opacity:1;fill-rule:nonzero;stroke:none"
             d="m 1366.5,62.5 c 0,-36.6992 36.58,-62.5 100.01,-62.5 63.4,0 100.05,25.8008 100.05,62.5 0,35.832 -36.93,62.5 -100.05,62.5 -63.1,0 -100.01,-26.6484 -100.01,-62.5 l 0,0 z m 31.84,0.1992 c 0,24.5703 22.52,47.4298 68.12,46.9218 45.64,0.508 68.18,-22.3007 68.18,-46.9218 0,-24.0976 -20.45,-47.3086 -68.18,-47.3086 -47.67,0 -68.12,23.211 -68.12,47.3086 l 0,0"
             inkscape:connector-curvature="0" /><path
             id="path3154"
             style="fill:#231f20;fill-opacity:1;fill-rule:nonzero;stroke:none"
             d="m 1756.1,123.199 -30.13,0 0,-68.617 c 0,-23.2109 -12.45,-39.1523 -50.89,-39.1523 -38.41,0 -50.89,15.9414 -50.89,39.1523 l 0,68.617 -30.08,0 0,-70.949 c 0,-34.0117 29.57,-52.25 80.97,-52.25 51.4,0 81.02,18.1797 81.02,52.25 l 0,70.949"
             inkscape:connector-curvature="0" /><path
             id="path3156"
             style="fill:#231f20;fill-opacity:1;fill-rule:nonzero;stroke:none"
             d="m 1822.5,107.82 28.42,0 c 27.27,0 41.46,-7.019 41.46,-18.0387 0,-11.7227 -16.59,-19.0899 -44.7,-19.0899 l -25.18,0 0,37.1286 z m -30.11,-106.01141 30.11,0 0,53.45311 17.73,0 c 15.67,0 25.45,0 34.63,-11.7109 l 31.69,-41.71096 33.72,0 -39.22,48.33986 c -6.53,7.4687 -11.01,10.0586 -20.22,12.1797 l 0,0.3398 c 24.39,2.3906 43.39,12.8399 43.39,27.6328 0,29.02 -39.7,32.867 -80.88,32.867 l -51.03,0 0.08,-121.39041"
             inkscape:connector-curvature="0" /><path
             id="path3158"
             style="fill:#231f20;fill-opacity:1;fill-rule:nonzero;stroke:none"
             d="m 2106.3,119.602 c -14.88,3.949 -30.64,5.398 -46.68,5.398 -63.25,0 -109.59,-24.738 -109.59,-61.9492 0,-38.4414 43.62,-63.0312687 109.34,-63.0312687 12.15,0 31.45,0.5312497 47.23,4.3124987 l -1.78,16.63677 c -10.35,-3.418 -30.19,-5.5391 -44.99,-5.5391 -42.91,0 -77.88,18.8008 -77.88,47.1289 0,27.0625 31.69,47.0894 79.37,47.0894 15.08,0 29.62,-2.109 42.64,-6.41 l 2.34,16.364"
             inkscape:connector-curvature="0" /><path
             id="path3160"
             style="fill:#231f20;fill-opacity:1;fill-rule:nonzero;stroke:none"
             d="m 2128.88,1.80859 116.79,0 0,15.40231 -86.71,0 0,39.8399 78.97,0 0,15.4101 -78.97,0 0,35.3011 86.71,0 0,15.41 -116.79,0 0,-121.36341"
             inkscape:connector-curvature="0" /><path
             id="path3162"
             style="fill:#231f20;fill-opacity:1;fill-rule:nonzero;stroke:none"
             d="m 2390.1,1.80859 117.06,0 0,15.40231 -86.94,0 0,105.9881 -30.11,0 -0.01,-121.39041"
             inkscape:connector-curvature="0" /><path
             id="path3164"
             style="fill:#231f20;fill-opacity:1;fill-rule:nonzero;stroke:none"
             d="m 2646.23,47.1211 -82.66,0 41.34,59.7699 41.32,-59.7699 z m -144.6,-45.31251 31.14,0 21.1,30.80081 101.48,0 21.05,-30.80081 32.39,0 -87.59,121.39041 -31.16,0 -88.41,-121.39041"
             inkscape:connector-curvature="0" /><path
             id="path3166"
             style="fill:#231f20;fill-opacity:1;fill-rule:nonzero;stroke:none"
             d="m 2753.13,108.719 30.96,0 c 17.07,0 38.09,-3.598 38.09,-17.8674 0,-17.6914 -24.18,-19.25 -52.84,-19.25 l -16.21,0 0,37.1174 z m 0,-51.6682 19.15,0 c 25.36,0 53.41,-2.6016 53.41,-21.2305 0,-16.2187 -23.91,-19.4883 -50.43,-19.4883 l -22.11,0 -0.02,40.7188 z m -30.09,-55.24221 55.33,0 c 42.28,0 79.19,6.21094 79.19,32.35161 0,17.0312 -20.05,27.8007 -48.45,29.1914 l 0,0.3281 c 26.33,3.8125 43.11,12.1601 43.11,28.8516 0,22.3907 -29.8,30.5977 -72.98,30.5977 l -56.26,0 0.06,-121.32041"
             inkscape:connector-curvature="0" /><path
             id="path3168"
             style="fill:#c33a21;fill-opacity:1;fill-rule:nonzero;stroke:none"
             d="m 2047.22,883.73 -635.06,0 c -72.6,0 -144.96,-62.742 -144.96,-151.691 l 0,-88.937 c 0,-50.043 44.96,-175.211 167.49,-175.211 l 422.56,0 c 26.52,0 63.73,-15.661 63.73,-66.672 0,-51.008 -12.81,-87.629 -58.75,-87.629 l -595.03,0 0,-125.531 655.01,0 c 31.12,0 125.01,41.472 125.01,130.761 l 0,156.899 c 0,35.25 -34.97,120.32 -159.99,120.32 l -410.07,0 c -104.97,0 -130.01,162.16 0,162.16 l 575.07,0 -4.98,125.531"
             inkscape:connector-curvature="0" /><path
             id="path3170"
             style="fill:#c33a21;fill-opacity:1;fill-rule:nonzero;stroke:none"
             d="m 2187.66,883.73 0,-553.429 c 0,-51.442 35.03,-142.242 137.53,-142.242 l 541.61,0 0,137.07 -494.11,0 c 0,0 -54.97,0 -54.97,56.871 l 0,501.691 -130.03,0"
             inkscape:connector-curvature="0" /><path
             id="path3172"
             style="fill:#c33a21;fill-opacity:1;fill-rule:nonzero;stroke:none"
             d="m 560.168,757.969 464.022,0 c 13.24,0 24.01,-11.77 24.01,-26.207 l 0,-395.942 c 0,-14.429 -10.74,-26.148 -24.01,-26.148 l -464.022,0 c -13.25,0 -23.977,11.719 -23.977,26.148 l 0,395.942 c 0,14.437 10.758,26.207 23.977,26.207 l 0,0 z M 525.629,883.73 c -30.352,0 -122.527,-21.871 -122.527,-133.929 l 0,-434.621 c 0,-25.098 17.699,-127.121 116.246,-127.121 l 545.682,0 c 98.54,0 116.24,102.023 116.24,127.121 l 0,434.621 c 0,112.058 -92.14,133.929 -122.5,133.929 l -533.141,0"
             inkscape:connector-curvature="0" /><g
             transform="scale(10,10)"
             id="g3174" /></g></g></g><g
       inkscape:export-ydpi="19.552074"
       inkscape:export-xdpi="19.552074"
       inkscape:export-filename="/media/sicher/maren/www/sponsor_donors_170x78png.png"
       transform="matrix(0.29090519,0,0,0.29090519,1327.8383,23.598847)"
       id="g8886"><g
         id="g5795"
         transform="translate(-2.6492603,74.179289)"><rect
           y="1616.4375"
           x="-880.70758"
           height="314.58859"
           width="735.8399"
           id="rect5738"
           style="opacity:0.51194536;color:#000000;fill:#000000;fill-opacity:1;fill-rule:nonzero;stroke:none;stroke-width:3.6924777;marker:none;visibility:visible;display:inline;overflow:visible;enable-background:accumulate;filter:url(#filter4678)"
           ry="65" /><rect
           ry="65"
           style="color:#000000;fill:#ffffff;fill-opacity:1;fill-rule:nonzero;stroke:#b6b6b6;stroke-width:3.6924777;stroke-opacity:1;marker:none;visibility:visible;display:inline;overflow:visible;enable-background:accumulate"
           id="rect5740"
           width="735.8399"
           height="314.58859"
           x="-880.70758"
           y="1616.4375" /></g><g
         id="g8867"><path
           inkscape:connector-curvature="0"
           id="path8016"
           transform="translate(-0.835,-0.9200081)"
           d="m -514.59375,1741.875 c -13.78736,0 -25.52457,8.7456 -29.96875,21 -5.24223,-3.7952 -11.68758,-6.0312 -18.65625,-6.0312 -14.43923,0 -26.64358,9.6134 -30.5625,22.7812 -5.13831,-3.5545 -11.3708,-5.625 -18.09375,-5.625 -16.11441,0 -29.42405,11.9413 -31.5625,27.4688 -4.9368,-3.1453 -10.77317,-5 -17.0625,-5 -17.60298,0 -31.875,14.2721 -31.875,31.875 0,11.4605 6.04436,21.5381 15.125,27.1562 -18.77478,7.0132 -32.1875,25.4543 -32.1875,47.1562 0,1.8226 0.0968,3.6338 0.28125,5.4063 l 51.25,0 c -1.88491,5.3379 -2.90625,11.0849 -2.90625,17.0937 0,1.8226 0.0968,3.6338 0.28125,5.4063 l 52.34375,0 c -2.55275,6.0835 -3.96875,12.7956 -3.96875,19.8437 0,1.8226 0.0968,3.6339 0.28125,5.4063 l 97.28125,0 97.28125,0 c 0.18441,-1.7724 0.28125,-3.5837 0.28125,-5.4063 0,-7.0438 -1.41669,-13.762 -3.96875,-19.8437 l 52.3125,0 c 0.1844,-1.7725 0.28125,-3.5837 0.28125,-5.4063 0,-6.007 -1.02067,-11.7563 -2.90625,-17.0937 l 51.28125,0 c 0.1844,-1.7725 0.28125,-3.5837 0.28125,-5.4063 0,-21.6939 -13.41724,-40.1374 -32.1875,-47.1562 9.07564,-5.6179 15.125,-15.6946 15.125,-27.1562 0,-17.6029 -14.24076,-31.8751 -31.84375,-31.875 -6.28933,0 -12.15339,1.8547 -17.09375,5 -2.1349,-15.528 -15.44771,-27.4688 -31.5625,-27.4688 -6.72941,0 -12.9487,2.0955 -18.09375,5.6562 -3.90245,-13.1858 -16.0792,-22.8125 -30.53125,-22.8124 -6.96867,0 -13.44117,2.236 -18.6875,6.0312 -4.43842,-12.2544 -16.18139,-21 -29.96875,-21 z m -3.6875,188.6875 7.375,0 c -1.89774,4.5225 -3.16151,9.4045 -3.6875,14.5 -0.52598,-5.0923 -1.79044,-9.9792 -3.6875,-14.5 z"
           style="color:#000000;fill:#000000;fill-opacity:0.49818181;fill-rule:nonzero;stroke:none;stroke-width:2.63000011;marker:none;visibility:visible;display:inline;overflow:visible;filter:url(#filter8110);enable-background:accumulate" /><g
           id="g7997"><path
             inkscape:connector-curvature="0"
             id="path5621"
             d="m -515.42606,1740.9415 c -17.60298,0 -31.87784,14.2749 -31.87784,31.8778 0,11.4606 6.04563,21.5138 15.12626,27.1319 -18.77478,7.0132 -32.18123,25.4756 -32.18123,47.1776 0,1.8227 0.0973,3.6237 0.28172,5.3961 l 97.28052,0 c 0.1844,-1.7724 0.28172,-3.5734 0.28172,-5.3961 0,-21.6939 -13.41099,-40.1588 -32.18125,-47.1776 9.07564,-5.6178 15.12627,-15.6702 15.12627,-27.1319 0,-17.6029 -14.25319,-31.8778 -31.85617,-31.8778 z"
             style="color:#000000;fill:#c6640d;fill-opacity:1;fill-rule:nonzero;stroke:none;stroke-width:2.63000011;marker:none;visibility:visible;display:inline;overflow:visible;enable-background:accumulate" /><path
             inkscape:connector-curvature="0"
             id="path5593"
             d="m -564.0663,1755.9276 c -17.60299,0 -31.87784,14.2749 -31.87784,31.8778 0,11.4606 6.04562,21.5138 15.12626,27.132 -18.77479,7.0131 -32.18123,25.4755 -32.18123,47.1775 0,1.8226 0.0973,3.6236 0.28172,5.396 l 97.2805,0 c 0.1844,-1.7724 0.28172,-3.5734 0.28172,-5.396 0,-21.694 -13.41097,-40.1587 -32.18123,-47.1775 9.07564,-5.6179 15.12626,-15.6703 15.12626,-27.132 0,-17.6029 -14.25318,-31.8778 -31.85616,-31.8778 z"
             style="color:#000000;fill:#a9c60d;fill-opacity:1;fill-rule:nonzero;stroke:none;stroke-width:2.63000011;marker:none;visibility:visible;display:inline;overflow:visible;enable-background:accumulate" /><path
             style="color:#000000;fill:#c60d18;fill-opacity:1;fill-rule:nonzero;stroke:none;stroke-width:2.63000011;marker:none;visibility:visible;display:inline;overflow:visible;enable-background:accumulate"
             d="m -466.7858,1755.9276 c -17.60298,0 -31.87784,14.2749 -31.87784,31.8778 0,11.4606 6.04562,21.5138 15.12626,27.132 -18.77479,7.0131 -32.18123,25.4755 -32.18123,47.1775 0,1.8226 0.0973,3.6236 0.28172,5.396 l 97.2805,0 c 0.18441,-1.7724 0.28172,-3.5734 0.28172,-5.396 0,-21.694 -13.41097,-40.1587 -32.18123,-47.1775 9.07564,-5.6179 15.12626,-15.6703 15.12626,-27.132 0,-17.6029 -14.25318,-31.8778 -31.85616,-31.8778 z"
             id="path5595"
             inkscape:connector-curvature="0" /><path
             style="color:#000000;fill:#6b448f;fill-opacity:1;fill-rule:nonzero;stroke:none;stroke-width:2.63000011;marker:none;visibility:visible;display:inline;overflow:visible;enable-background:accumulate"
             d="m -612.70656,1773.0656 c -17.60298,0 -31.87783,14.2749 -31.87783,31.8778 0,11.4606 6.04562,21.5138 15.12626,27.1319 -18.77479,7.0132 -32.18123,25.4755 -32.18123,47.1775 0,1.8226 0.0973,3.6236 0.28172,5.3961 l 97.2805,0 c 0.1844,-1.7725 0.28172,-3.5735 0.28172,-5.3961 0,-21.694 -13.41097,-40.1587 -32.18123,-47.1775 9.07564,-5.6178 15.12626,-15.6702 15.12626,-27.1319 0,-17.6029 -14.25319,-31.8778 -31.85617,-31.8778 z"
             id="path5545"
             inkscape:connector-curvature="0" /><path
             inkscape:connector-curvature="0"
             id="path5549"
             d="m -515.42605,1773.0656 c -17.60298,0 -31.87784,14.2749 -31.87784,31.8778 0,11.4606 6.04562,21.5138 15.12626,27.1319 -18.77479,7.0132 -32.18123,25.4755 -32.18123,47.1775 0,1.8226 0.0973,3.6236 0.28172,5.3961 l 97.2805,0 c 0.18441,-1.7725 0.28172,-3.5735 0.28172,-5.3961 0,-21.694 -13.41097,-40.1587 -32.18123,-47.1775 9.07564,-5.6178 15.12626,-15.6702 15.12626,-27.1319 0,-17.6029 -14.25318,-31.8778 -31.85616,-31.8778 z"
             style="color:#000000;fill:#9a3990;fill-opacity:1;fill-rule:nonzero;stroke:none;stroke-width:2.63000011;marker:none;visibility:visible;display:inline;overflow:visible;enable-background:accumulate" /><path
             inkscape:connector-curvature="0"
             id="path5551"
             d="m -418.14556,1773.0656 c -17.60298,0 -31.87783,14.2749 -31.87783,31.8778 0,11.4606 6.04562,21.5138 15.12626,27.1319 -18.77479,7.0132 -32.18123,25.4755 -32.18123,47.1775 0,1.8226 0.0973,3.6236 0.28172,5.3961 l 97.2805,0 c 0.1844,-1.7725 0.28172,-3.5735 0.28172,-5.3961 0,-21.694 -13.41097,-40.1587 -32.18123,-47.1775 9.07564,-5.6178 15.12626,-15.6702 15.12626,-27.1319 0,-17.6029 -14.25319,-31.8778 -31.85617,-31.8778 z"
             style="color:#000000;fill:#c5c60d;fill-opacity:1;fill-rule:nonzero;stroke:none;stroke-width:2.63000011;marker:none;visibility:visible;display:inline;overflow:visible;enable-background:accumulate" /><path
             inkscape:connector-curvature="0"
             id="path5515"
             d="m -661.3468,1795.5576 c -17.60298,0 -31.87784,14.2749 -31.87784,31.8778 0,11.4606 6.04562,21.5138 15.12626,27.1319 -18.77478,7.0132 -32.18123,25.4755 -32.18123,47.1775 0,1.8226 0.0973,3.6236 0.28172,5.3961 l 97.2805,0 c 0.18441,-1.7725 0.28172,-3.5735 0.28172,-5.3961 0,-21.694 -13.41097,-40.1587 -32.18123,-47.1775 9.07564,-5.6179 15.12627,-15.6702 15.12627,-27.1319 0,-17.6029 -14.25319,-31.8778 -31.85617,-31.8778 z"
             style="color:#000000;fill:#c6180d;fill-opacity:1;fill-rule:nonzero;stroke:none;stroke-width:2.63026023;marker:none;visibility:visible;display:inline;overflow:visible;enable-background:accumulate" /><path
             inkscape:connector-curvature="0"
             id="path5517"
             d="m -564.0663,1795.5576 c -17.60299,0 -31.87784,14.2749 -31.87784,31.8778 0,11.4606 6.04562,21.5138 15.12626,27.1319 -18.77479,7.0132 -32.18123,25.4755 -32.18123,47.1775 0,1.8226 0.0973,3.6236 0.28172,5.3961 l 97.2805,0 c 0.1844,-1.7725 0.28172,-3.5735 0.28172,-5.3961 0,-21.694 -13.41097,-40.1587 -32.18123,-47.1775 9.07564,-5.6179 15.12626,-15.6702 15.12626,-27.1319 0,-17.6029 -14.25318,-31.8778 -31.85616,-31.8778 z"
             style="color:#000000;fill:#e79d00;fill-opacity:1;fill-rule:nonzero;stroke:none;stroke-width:2.63000011;marker:none;visibility:visible;display:inline;overflow:visible;enable-background:accumulate" /><path
             style="color:#000000;fill:#70c60d;fill-opacity:1;fill-rule:nonzero;stroke:none;stroke-width:2.63000011;marker:none;visibility:visible;display:inline;overflow:visible;enable-background:accumulate"
             d="m -466.7858,1795.5576 c -17.60298,0 -31.87784,14.2749 -31.87784,31.8778 0,11.4606 6.04562,21.5138 15.12626,27.1319 -18.77479,7.0132 -32.18123,25.4755 -32.18123,47.1775 0,1.8226 0.0973,3.6236 0.28172,5.3961 l 97.2805,0 c 0.18441,-1.7725 0.28172,-3.5735 0.28172,-5.3961 0,-21.694 -13.41097,-40.1587 -32.18123,-47.1775 9.07564,-5.6179 15.12626,-15.6702 15.12626,-27.1319 0,-17.6029 -14.25318,-31.8778 -31.85616,-31.8778 z"
             id="path5521"
             inkscape:connector-curvature="0" /><path
             style="color:#000000;fill:#3f8c9d;fill-opacity:1;fill-rule:nonzero;stroke:none;stroke-width:2.63000011;marker:none;visibility:visible;display:inline;overflow:visible;enable-background:accumulate"
             d="m -369.50531,1795.5576 c -17.60298,0 -31.87783,14.2749 -31.87783,31.8778 0,11.4606 6.04562,21.5138 15.12626,27.1319 -18.77479,7.0132 -32.18123,25.4755 -32.18123,47.1775 0,1.8226 0.0973,3.6236 0.28172,5.3961 l 97.2805,0 c 0.1844,-1.7725 0.28172,-3.5735 0.28172,-5.3961 0,-21.694 -13.41097,-40.1587 -32.18123,-47.1775 9.07564,-5.6179 15.12626,-15.6702 15.12626,-27.1319 0,-17.6029 -14.25318,-31.8778 -31.85617,-31.8778 z"
             id="path5523"
             inkscape:connector-curvature="0" /><path
             inkscape:connector-curvature="0"
             id="path5489"
             d="m -612.70656,1818.0496 c -17.60298,0 -31.87783,14.2749 -31.87783,31.8778 0,11.4606 6.04562,21.5138 15.12626,27.1319 -18.77479,7.0132 -32.18123,25.4755 -32.18123,47.1775 0,1.8226 0.0973,3.6236 0.28172,5.3961 l 97.2805,0 c 0.1844,-1.7725 0.28172,-3.5735 0.28172,-5.3961 0,-21.694 -13.41097,-40.1587 -32.18123,-47.1775 9.07564,-5.6179 15.12626,-15.6702 15.12626,-27.1319 0,-17.6029 -14.25319,-31.8778 -31.85617,-31.8778 z"
             style="color:#000000;fill:#c6560d;fill-opacity:1;fill-rule:nonzero;stroke:none;stroke-width:2.63000011;marker:none;visibility:visible;display:inline;overflow:visible;enable-background:accumulate" /><path
             style="color:#000000;fill:#c0c60d;fill-opacity:1;fill-rule:nonzero;stroke:none;stroke-width:2.63000011;marker:none;visibility:visible;display:inline;overflow:visible;enable-background:accumulate"
             d="m -515.42605,1818.0496 c -17.60298,0 -31.87784,14.2749 -31.87784,31.8778 0,11.4606 6.04562,21.5138 15.12626,27.1319 -18.77479,7.0132 -32.18123,25.4755 -32.18123,47.1775 0,1.8226 0.0973,3.6236 0.28172,5.3961 l 97.2805,0 c 0.18441,-1.7725 0.28172,-3.5735 0.28172,-5.3961 0,-21.694 -13.41097,-40.1587 -32.18123,-47.1775 9.07564,-5.6179 15.12626,-15.6702 15.12626,-27.1319 0,-17.6029 -14.25318,-31.8778 -31.85616,-31.8778 z"
             id="path5493"
             inkscape:connector-curvature="0" /><path
             style="color:#000000;fill:#9d365c;fill-opacity:1;fill-rule:nonzero;stroke:none;stroke-width:2.63000011;marker:none;visibility:visible;display:inline;overflow:visible;enable-background:accumulate"
             d="m -418.14556,1818.0496 c -17.60298,0 -31.87783,14.2749 -31.87783,31.8778 0,11.4606 6.04562,21.5138 15.12626,27.1319 -18.77479,7.0132 -32.18123,25.4755 -32.18123,47.1775 0,1.8226 0.0973,3.6236 0.28172,5.3961 l 97.2805,0 c 0.1844,-1.7725 0.28172,-3.5735 0.28172,-5.3961 0,-21.694 -13.41097,-40.1587 -32.18123,-47.1775 9.07564,-5.6179 15.12626,-15.6702 15.12626,-27.1319 0,-17.6029 -14.25319,-31.8778 -31.85617,-31.8778 z"
             id="path5495"
             inkscape:connector-curvature="0" /><path
             style="color:#000000;fill:#547f77;fill-opacity:1;fill-rule:nonzero;stroke:none;stroke-width:2.63000011;marker:none;visibility:visible;display:inline;overflow:visible;enable-background:accumulate"
             d="m -564.0663,1843.2973 c -17.60299,0 -31.87784,14.2749 -31.87784,31.8778 0,11.4606 6.04562,21.5138 15.12626,27.132 -18.77479,7.0131 -32.18123,25.4755 -32.18123,47.1775 0,1.8226 0.0973,3.6236 0.28172,5.396 l 97.2805,0 c 0.1844,-1.7724 0.28172,-3.5734 0.28172,-5.396 0,-21.694 -13.41097,-40.1587 -32.18123,-47.1775 9.07564,-5.6179 15.12626,-15.6703 15.12626,-27.132 0,-17.6029 -14.25318,-31.8778 -31.85616,-31.8778 z"
             id="path5449"
             inkscape:connector-curvature="0" /><path
             inkscape:connector-curvature="0"
             id="path5471"
             d="m -466.7858,1843.2973 c -17.60298,0 -31.87784,14.2749 -31.87784,31.8778 0,11.4606 6.04562,21.5138 15.12626,27.132 -18.77479,7.0131 -32.18123,25.4755 -32.18123,47.1775 0,1.8226 0.0973,3.6236 0.28172,5.396 l 97.2805,0 c 0.18441,-1.7724 0.28172,-3.5734 0.28172,-5.396 0,-21.694 -13.41097,-40.1587 -32.18123,-47.1775 9.07564,-5.6179 15.12626,-15.6703 15.12626,-27.132 0,-17.6029 -14.25318,-31.8778 -31.85616,-31.8778 z"
             style="color:#000000;fill:#c6720d;fill-opacity:1;fill-rule:nonzero;stroke:none;stroke-width:2.63000011;marker:none;visibility:visible;display:inline;overflow:visible;enable-background:accumulate" /></g></g></g><g
       id="g3733"
       transform="matrix(0.29090519,0,0,0.29090519,1594.5121,750.95318)"
       inkscape:export-filename="/media/sicher/maren/www/sponsor_canonical_170x78.png"
       inkscape:export-xdpi="19.552074"
       inkscape:export-ydpi="19.552074"><rect
         ry="65"
         style="color:#000000;display:inline;overflow:visible;visibility:visible;opacity:0.51194536;fill:#000000;fill-opacity:1;fill-rule:nonzero;stroke:none;stroke-width:3.6924777;marker:none;enable-background:accumulate;filter:url(#filter4698)"
         id="rect3735"
         width="735.8399"
         height="314.58859"
         x="-876.63416"
         y="-809.69727" /><rect
         y="-809.69727"
         x="-876.63416"
         height="314.58859"
         width="735.8399"
         id="rect3737"
         style="color:#000000;display:inline;overflow:visible;visibility:visible;fill:#ffffff;fill-opacity:1;fill-rule:nonzero;stroke:#b6b6b6;stroke-width:3.6924777;stroke-opacity:1;marker:none;enable-background:accumulate"
         ry="65" /><g
         sketch:type="MSPage"
         id="Page-1"
         transform="matrix(0.59080749,0,0,0.59080749,-792.89246,-753.43101)"
         style="fill:none;fill-rule:evenodd;stroke:none;stroke-width:1"><g
           sketch:type="MSLayerGroup"
           id="wm_no_bg"><g
             sketch:type="MSShapeGroup"
             transform="translate(498,107)"
             id="word"
             style="fill:#8c929d"><path
               id="Fill-2"
               d="m 237.0109,3.0669 -16.373,0 0.052,121.866 66.236,0 0,-15.07 -49.863,0 -0.052,-106.796 z"
               inkscape:connector-curvature="0" /><path
               id="Fill-3"
               d="m 349.9956,103.5367 c -4.093,4.279 -10.977,8.559 -20.28,8.559 -12.466,0 -17.489,-6.14 -17.489,-14.141 0,-12.093 8.372,-17.861 26.234,-17.861 3.349,0 8.744,0.372 11.535,0.93 l 0,22.513 z m -16.931,-73.864 c -13.222,0 -25.349,4.687 -34.812,12.489 l 5.787,10.024 c 6.698,-3.907 14.885,-7.815 26.606,-7.815 13.396,0 19.35,6.885 19.35,18.42 l 0,5.954 c -2.605,-0.558 -8,-0.931 -11.349,-0.931 -28.653,0 -43.165,10.047 -43.165,31.072 0,18.791 11.535,28.28 29.024,28.28 11.781,0 23.071,-5.396 26.978,-14.14 l 2.977,11.907 11.536,0 0,-62.328 c 0,-19.722 -8.559,-32.932 -32.932,-32.932 l 0,0 z"
               inkscape:connector-curvature="0" /><path
               id="Fill-5"
               d="m 418.8252,112.6533 c -6.14,0 -11.536,-0.744 -15.629,-2.605 l 0,-50.514 0,-5.86 c 5.582,-4.652 12.466,-8.001 21.211,-8.001 15.814,0 21.954,11.163 21.954,29.211 0,25.675 -9.861,37.769 -27.536,37.769 m 6.881,-82.981 c -14.633,0 -22.51,9.955 -22.51,9.955 l 0,-15.722 -0.052,-20.838 -7.382,0 -8.618,0 0.052,118.889 c 8,3.349 18.977,5.209 30.885,5.209 30.513,0 45.211,-19.535 45.211,-53.211 0,-26.606 -13.585,-44.282 -37.586,-44.282"
               inkscape:connector-curvature="0" /><path
               id="Fill-7"
               d="m 59.0316,16.2769 c 14.512,0 23.815,4.837 29.955,9.675 l 7.036,-12.188 c -9.59,-8.41 -22.489,-12.93 -36.247,-12.93 -34.792,0 -59.165,21.211 -59.165,64.003 0,44.84 26.294,62.329 56.374,62.329 15.071,0 27.909,-3.535 36.281,-7.07 l -0.343,-47.909 0,-5.652 0,-9.419 -44.653,0 0,15.071 28.466,0 0.343,36.373 c -3.721,1.861 -10.233,3.349 -18.977,3.349 -24.187,0 -40.374,-15.215 -40.374,-47.258 0,-32.559 16.745,-48.374 41.304,-48.374"
               inkscape:connector-curvature="0" /><path
               id="Fill-9"
               d="m 174.1768,3.0669 -16.001,0 0.052,20.466 0,8.373 0,4.88 0,8.516 0,48.746 0,0.186 c 0,19.722 8.559,32.932 32.932,32.932 3.367,0 6.662,-0.306 9.861,-0.887 l 0,-14.369 c -2.316,0.355 -4.788,0.557 -7.442,0.557 -13.396,0 -19.35,-6.884 -19.35,-18.419 l 0,-48.746 26.792,0 0,-13.396 -26.792,0 -0.052,-28.839 z"
               inkscape:connector-curvature="0" /><path
               id="Fill-11"
               d="m 117.575,124.933 16.001,0 0,-93.028 -16.001,0 0,93.028 z"
               inkscape:connector-curvature="0" /><path
               id="Fill-13"
               d="m 117.575,19.068 16.001,0 0,-16.001 -16.001,0 0,16.001 z"
               inkscape:connector-curvature="0" /></g><g
             sketch:type="MSShapeGroup"
             id="logo"><path
               id="Fill-14"
               d="m 185.3984,341.1298 0,0 68.013,-209.322 -136.026,0 68.013,209.322 0,0 z"
               inkscape:connector-curvature="0"
               style="fill:#e24329" /><path
               id="Fill-15"
               d=""
               inkscape:connector-curvature="0"
               style="fill:#e24329" /><path
               id="Fill-16"
               d="m 185.3984,341.1294 -68.013,-209.321 -95.319,0 163.332,209.321 z"
               inkscape:connector-curvature="0"
               style="fill:#fc6d26" /><path
               id="Fill-17"
               d=""
               inkscape:connector-curvature="0"
               style="fill:#e24329" /><path
               id="Fill-18"
               d="m 22.0664,131.8081 0,0 -20.669,63.611 c -1.885,5.802 0.18,12.158 5.116,15.743 l 178.885,129.967 -163.332,-209.321 z"
               inkscape:connector-curvature="0"
               style="fill:#fca326" /><path
               id="Fill-19"
               d=""
               inkscape:connector-curvature="0"
               style="fill:#e24329" /><path
               id="Fill-20"
               d="m 22.0664,131.8083 95.319,0 -40.964,-126.073 c -2.108,-6.487 -11.285,-6.487 -13.392,0 l -40.963,126.073 z"
               inkscape:connector-curvature="0"
               style="fill:#e24329" /><path
               id="Fill-21"
               d="m 185.3984,341.1294 68.013,-209.321 95.319,0 -163.332,209.321 z"
               inkscape:connector-curvature="0"
               style="fill:#fc6d26" /><path
               id="Fill-22"
               d="m 348.7303,131.8081 0,0 20.669,63.611 c 1.885,5.802 -0.18,12.158 -5.116,15.743 l -178.885,129.967 163.332,-209.321 z"
               inkscape:connector-curvature="0"
               style="fill:#fca326" /><path
               id="Fill-23"
               d="m 348.7303,131.8083 -95.319,0 40.964,-126.073 c 2.108,-6.487 11.285,-6.487 13.392,0 l 40.963,126.073 z"
               inkscape:connector-curvature="0"
               style="fill:#e24329" /></g><g
             id="g3840"
             sketch:type="MSShapeGroup"><path
               style="fill:#e24329"
               inkscape:connector-curvature="0"
               d="m 185.3984,341.1298 0,0 68.013,-209.322 -136.026,0 68.013,209.322 0,0 z"
               id="path3842" /><path
               style="fill:#e24329"
               inkscape:connector-curvature="0"
               d=""
               id="path3844" /><path
               style="fill:#fc6d26"
               inkscape:connector-curvature="0"
               d="m 185.3984,341.1294 -68.013,-209.321 -95.319,0 163.332,209.321 z"
               id="path3846" /><path
               style="fill:#e24329"
               inkscape:connector-curvature="0"
               d=""
               id="path3848" /><path
               style="fill:#fca326"
               inkscape:connector-curvature="0"
               d="m 22.0664,131.8081 0,0 -20.669,63.611 c -1.885,5.802 0.18,12.158 5.116,15.743 l 178.885,129.967 -163.332,-209.321 z"
               id="path3850" /><path
               style="fill:#e24329"
               inkscape:connector-curvature="0"
               d=""
               id="path3852" /><path
               style="fill:#e24329"
               inkscape:connector-curvature="0"
               d="m 22.0664,131.8083 95.319,0 -40.964,-126.073 c -2.108,-6.487 -11.285,-6.487 -13.392,0 l -40.963,126.073 z"
               id="path3854" /><path
               style="fill:#fc6d26"
               inkscape:connector-curvature="0"
               d="m 185.3984,341.1294 68.013,-209.321 95.319,0 -163.332,209.321 z"
               id="path3856" /><path
               style="fill:#fca326"
               inkscape:connector-curvature="0"
               d="m 348.7303,131.8081 0,0 20.669,63.611 c 1.885,5.802 -0.18,12.158 -5.116,15.743 l -178.885,129.967 163.332,-209.321 z"
               id="path3858" /><path
               style="fill:#e24329"
               inkscape:connector-curvature="0"
               d="m 348.7303,131.8083 -95.319,0 40.964,-126.073 c 2.108,-6.487 11.285,-6.487 13.392,0 l 40.963,126.073 z"
               id="path3860" /></g></g></g></g></g></svg>