<?xml version="1.0" encoding="UTF-8" standalone="no"?>
<!-- Created with Inkscape (http://www.inkscape.org/) -->

<svg
   xmlns:dc="http://purl.org/dc/elements/1.1/"
   xmlns:cc="http://creativecommons.org/ns#"
   xmlns:rdf="http://www.w3.org/1999/02/22-rdf-syntax-ns#"
   xmlns:svg="http://www.w3.org/2000/svg"
   xmlns="http://www.w3.org/2000/svg"
   xmlns:xlink="http://www.w3.org/1999/xlink"
   xmlns:sodipodi="http://sodipodi.sourceforge.net/DTD/sodipodi-0.dtd"
   xmlns:inkscape="http://www.inkscape.org/namespaces/inkscape"
   width="750"
   height="625"
   id="svg4148"
   version="1.0"
   inkscape:version="0.47 r22583"
   sodipodi:docname="IIIIIII.svg"
   sodipodi:version="0.32"
   inkscape:output_extension="org.inkscape.output.svg.inkscape">
  <defs
     id="defs4150">
    <linearGradient
       inkscape:collect="always"
       id="linearGradient4728">
      <stop
         style="stop-color:#d1d7dc;stop-opacity:1;"
         offset="0"
         id="stop4730" />
      <stop
         style="stop-color:#d1d7dc;stop-opacity:0;"
         offset="1"
         id="stop4732" />
    </linearGradient>
    <linearGradient
       inkscape:collect="always"
       id="linearGradient4720">
      <stop
         style="stop-color:#a39d93;stop-opacity:1;"
         offset="0"
         id="stop4722" />
      <stop
         style="stop-color:#a39d93;stop-opacity:0;"
         offset="1"
         id="stop4724" />
    </linearGradient>
    <linearGradient
       inkscape:collect="always"
       id="linearGradient4663">
      <stop
         style="stop-color:#696969;stop-opacity:1;"
         offset="0"
         id="stop4665" />
      <stop
         style="stop-color:#696969;stop-opacity:0;"
         offset="1"
         id="stop4667" />
    </linearGradient>
    <linearGradient
       inkscape:collect="always"
       id="linearGradient4629">
      <stop
         style="stop-color:#696969;stop-opacity:1;"
         offset="0"
         id="stop4631" />
      <stop
         style="stop-color:#696969;stop-opacity:0"
         offset="1"
         id="stop4633" />
    </linearGradient>
    <linearGradient
       inkscape:collect="always"
       id="linearGradient4611">
      <stop
         style="stop-color:#808080;stop-opacity:1;"
         offset="0"
         id="stop4613" />
      <stop
         style="stop-color:#808080;stop-opacity:0;"
         offset="1"
         id="stop4615" />
    </linearGradient>
    <linearGradient
       inkscape:collect="always"
       id="linearGradient4123">
      <stop
         style="stop-color:#78b878;stop-opacity:1;"
         offset="0"
         id="stop4125" />
      <stop
         style="stop-color:#78b878;stop-opacity:0;"
         offset="1"
         id="stop4127" />
    </linearGradient>
    <linearGradient
       inkscape:collect="always"
       id="linearGradient4067">
      <stop
         style="stop-color:#faf0e6;stop-opacity:1;"
         offset="0"
         id="stop4069" />
      <stop
         style="stop-color:#faf0e6;stop-opacity:0;"
         offset="1"
         id="stop4071" />
    </linearGradient>
    <linearGradient
       inkscape:collect="always"
       id="linearGradient3979">
      <stop
         style="stop-color:#a0522d;stop-opacity:1;"
         offset="0"
         id="stop3981" />
      <stop
         style="stop-color:#a0522d;stop-opacity:0;"
         offset="1"
         id="stop3983" />
    </linearGradient>
    <linearGradient
       inkscape:collect="always"
       id="linearGradient3963">
      <stop
         style="stop-color:#b2af96;stop-opacity:1;"
         offset="0"
         id="stop3965" />
      <stop
         style="stop-color:#b2af96;stop-opacity:0;"
         offset="1"
         id="stop3967" />
    </linearGradient>
    <linearGradient
       inkscape:collect="always"
       id="linearGradient3955">
      <stop
         style="stop-color:#f0e68c;stop-opacity:1;"
         offset="0"
         id="stop3957" />
      <stop
         style="stop-color:#f0e68c;stop-opacity:0;"
         offset="1"
         id="stop3959" />
    </linearGradient>
    <inkscape:perspective
       sodipodi:type="inkscape:persp3d"
       inkscape:vp_x="0 : 526.18109 : 1"
       inkscape:vp_y="0 : 1000 : 0"
       inkscape:vp_z="744.09448 : 526.18109 : 1"
       inkscape:persp3d-origin="372.04724 : 350.78739 : 1"
       id="perspective4156" />
    <filter
       y="0"
       x="0"
       filterUnits="userSpaceOnUse"
       id="ShadowBlur">
      <feGaussianBlur
         id="feGaussianBlur3330"
         result="blur"
         stdDeviation="3"
         in="SourceAlpha" />
    </filter>
    <clipPath
       id="clipoutline1"
       clipPathUnits="userSpaceOnUse">
      <path
         d="M 54.1,12.5 L 12.9,54.7 C -2.7,70.3 23,69 32.3,74.9 C 36.6,77.7 18.5,81.3 22.2,85 C 25.8,88.7 43.9,92.1 47.5,95.7 C 51.1,99.4 40.2,103.3 43.8,107 C 47.3,110.7 55.7,107.2 57.2,115.6 C 58.3,121.8 72.6,118.7 79,113.4 C 83,110 72.1,110 75.7,106.3 C 84.7,97.2 92.7,102.2 96,93.8 C 97.8,89.3 82.4,86.1 86.5,83.2 C 96.3,76.3 132.3,72.8 115.7,56.2 L 73,12.5 C 67.7,7.5 59,7.5 54.1,12.5 z M 44.2,77.2 C 45.1,77.2 75,81.2 63.5,84.3 C 59.1,85.5 38.9,77.2 44.2,77.2 z M 101.4,93.8 C 101.4,95.9 117.7,97.1 116.8,93.3 C 115.5,86.9 103.2,87.4 101.4,93.8 z M 31.9,104.9 C 35.6,108.1 41.2,104.2 43,99.7 C 39.4,95 26.1,100 31.9,104.9 z M 99.4,98.2 C 94.8,102.4 100.2,106.8 104.7,103.9 C 105.9,103.1 104.6,99.2 99.4,98.2 z"
         id="outline1" />
    </clipPath>
    <linearGradient
       gradientUnits="userSpaceOnUse"
       y2="60"
       x2="58"
       y1="35"
       x1="33"
       xlink:href="#WhiteTransparent"
       id="shinySpecular" />
    <linearGradient
       gradientUnits="userSpaceOnUse"
       y2="50"
       x2="90"
       y1="20"
       x1="60"
       xlink:href="#WhiteTransparent"
       id="IcecapTip" />
    <linearGradient
       gradientUnits="userSpaceOnUse"
       y2="40"
       x2="60"
       y1="20"
       x1="80"
       xlink:href="#WhiteTransparent"
       id="sideSpecular" />
    <linearGradient
       gradientUnits="userSpaceOnUse"
       y2="76"
       x2="0"
       y1="128"
       x1="0"
       xlink:href="#WhiteTransparent"
       id="liquidSpecular" />
    <linearGradient
       gradientUnits="userSpaceOnUse"
       y2="64"
       x2="0"
       y1="128"
       x1="0"
       xlink:href="#BlackTransparent"
       id="liquidShade" />
    <linearGradient
       gradientUnits="userSpaceOnUse"
       id="BlackTransparent">
      <stop
         id="stop3318"
         offset="0"
         style="stop-color:black;stop-opacity:1" />
      <stop
         id="stop3320"
         offset="1"
         style="stop-color:black;stop-opacity:0" />
    </linearGradient>
    <linearGradient
       gradientUnits="userSpaceOnUse"
       id="WhiteTransparent">
      <stop
         id="stop3313"
         offset="0"
         style="stop-color:white;stop-opacity:1" />
      <stop
         id="stop3315"
         offset="1"
         style="stop-color:white;stop-opacity:0" />
    </linearGradient>
    <inkscape:perspective
       id="perspective3358"
       inkscape:persp3d-origin="64 : 42.666667 : 1"
       inkscape:vp_z="128 : 64 : 1"
       inkscape:vp_y="0 : 1000 : 0"
       inkscape:vp_x="0 : 64 : 1"
       sodipodi:type="inkscape:persp3d" />
    <linearGradient
       inkscape:collect="always"
       xlink:href="#linearGradient3955"
       id="linearGradient3961"
       x1="370.159"
       y1="162.82187"
       x2="282.84271"
       y2="461.02747"
       gradientUnits="userSpaceOnUse"
       gradientTransform="translate(4.4852812,-220.61731)" />
    <linearGradient
       inkscape:collect="always"
       xlink:href="#linearGradient3963"
       id="linearGradient3969"
       x1="765.08948"
       y1="872.75708"
       x2="152.73506"
       y2="736.41541"
       gradientUnits="userSpaceOnUse"
       gradientTransform="translate(4.4852812,-220.61731)" />
    <linearGradient
       inkscape:collect="always"
       xlink:href="#linearGradient3979"
       id="linearGradient3985"
       x1="444"
       y1="521.36218"
       x2="629.4425"
       y2="473.3071"
       gradientUnits="userSpaceOnUse"
       gradientTransform="translate(4.4852812,-220.61731)" />
    <linearGradient
       inkscape:collect="always"
       xlink:href="#linearGradient3955"
       id="linearGradient3989"
       gradientUnits="userSpaceOnUse"
       x1="370.159"
       y1="162.82187"
       x2="282.84271"
       y2="461.02747"
       gradientTransform="matrix(1,0,0,0.2762226,4.4852812,108.82131)" />
    <filter
       inkscape:collect="always"
       id="filter4061"
       x="-0.03148789"
       width="1.0629758"
       y="-3.3455884"
       height="7.6911769">
      <feGaussianBlur
         inkscape:collect="always"
         stdDeviation="7.8856274"
         id="feGaussianBlur4063" />
    </filter>
    <linearGradient
       inkscape:collect="always"
       xlink:href="#linearGradient4067"
       id="linearGradient4073"
       x1="-30.828419"
       y1="963.82812"
       x2="600.63873"
       y2="556.19861"
       gradientUnits="userSpaceOnUse"
       gradientTransform="translate(4.4852812,-220.61731)" />
    <filter
       inkscape:collect="always"
       id="filter4107"
       x="-0.045572352"
       width="1.0911447"
       y="-0.22290826"
       height="1.4458165">
      <feGaussianBlur
         inkscape:collect="always"
         stdDeviation="6.4854382"
         id="feGaussianBlur4109" />
    </filter>
    <filter
       inkscape:collect="always"
       id="filter4111">
      <feGaussianBlur
         inkscape:collect="always"
         stdDeviation="3.5464756"
         id="feGaussianBlur4113" />
    </filter>
    <linearGradient
       inkscape:collect="always"
       xlink:href="#linearGradient4123"
       id="linearGradient4129"
       x1="1183.2123"
       y1="773.42017"
       x2="901.46442"
       y2="863.79077"
       gradientUnits="userSpaceOnUse" />
    <filter
       inkscape:collect="always"
       id="filter4171"
       x="-0.034624856"
       width="1.0692497"
       y="-0.16936073"
       height="1.3387214">
      <feGaussianBlur
         inkscape:collect="always"
         stdDeviation="4.9274911"
         id="feGaussianBlur4173" />
    </filter>
    <filter
       inkscape:collect="always"
       id="filter4195"
       x="-0.036374439"
       width="1.0727489"
       y="-0.17791846"
       height="1.3558369">
      <feGaussianBlur
         inkscape:collect="always"
         stdDeviation="5.1764756"
         id="feGaussianBlur4197" />
    </filter>
    <filter
       inkscape:collect="always"
       id="filter4287">
      <feGaussianBlur
         inkscape:collect="always"
         stdDeviation="1.7254916"
         id="feGaussianBlur4289" />
    </filter>
    <linearGradient
       inkscape:collect="always"
       xlink:href="#linearGradient4611"
       id="linearGradient4617"
       x1="141"
       y1="533.36218"
       x2="187.5"
       y2="523.69281"
       gradientUnits="userSpaceOnUse"
       gradientTransform="translate(4.4852812,-220.61731)" />
    <linearGradient
       inkscape:collect="always"
       xlink:href="#linearGradient4629"
       id="linearGradient4635"
       x1="241.30019"
       y1="598.39966"
       x2="280.36783"
       y2="578.36615"
       gradientUnits="userSpaceOnUse"
       gradientTransform="translate(4.4852812,-220.61731)" />
    <linearGradient
       inkscape:collect="always"
       xlink:href="#linearGradient4663"
       id="linearGradient4669"
       x1="246.9203"
       y1="370.3414"
       x2="321.71573"
       y2="548.40765"
       gradientUnits="userSpaceOnUse"
       gradientTransform="translate(4.4852812,-220.61731)" />
    <linearGradient
       inkscape:collect="always"
       xlink:href="#linearGradient4720"
       id="linearGradient4726"
       x1="246.42671"
       y1="530.5174"
       x2="242.18407"
       y2="447.43234"
       gradientUnits="userSpaceOnUse"
       gradientTransform="translate(4.4852812,-220.61731)" />
    <linearGradient
       inkscape:collect="always"
       xlink:href="#linearGradient4728"
       id="linearGradient4734"
       x1="91"
       y1="503.61218"
       x2="96.94001"
       y2="466.61218"
       gradientUnits="userSpaceOnUse"
       gradientTransform="translate(4.4852812,-220.61731)" />
  </defs>
  <sodipodi:namedview
     id="base"
     pagecolor="#ffffff"
     bordercolor="#666666"
     borderopacity="1.0"
     inkscape:pageopacity="0.0"
     inkscape:pageshadow="2"
     inkscape:zoom="1"
     inkscape:cx="246.50767"
     inkscape:cy="307.14198"
     inkscape:document-units="px"
     inkscape:current-layer="layer1"
     showgrid="false"
     inkscape:window-width="1278"
     inkscape:window-height="724"
     inkscape:window-x="0"
     inkscape:window-y="25"
     inkscape:window-maximized="0" />
  <metadata
     id="metadata4153">
    <rdf:RDF>
      <cc:Work
         rdf:about="">
        <dc:format>image/svg+xml</dc:format>
        <dc:type
           rdf:resource="http://purl.org/dc/dcmitype/StillImage" />
        <dc:title />
      </cc:Work>
    </rdf:RDF>
  </metadata>
  <g
     inkscape:label="Layer 1"
     inkscape:groupmode="layer"
     id="layer1">
    <rect
       style="fill:url(#linearGradient3989);fill-opacity:1;stroke:none"
       id="rect3987"
       width="750"
       height="66.385666"
       x="-0.35571074"
       y="169.78183" />
    <rect
       style="fill:#8fbc8f;fill-opacity:1;stroke:none"
       id="rect3815"
       width="750"
       height="625"
       x="-0.35571074"
       y="0.076217175" />
    <rect
       y="0.076217175"
       x="-0.35571074"
       height="240.33392"
       width="750"
       id="rect3945"
       style="fill:url(#linearGradient3961);fill-opacity:1;stroke:none" />
    <rect
       style="opacity:1;fill:#2f4f4f;fill-opacity:1;fill-rule:evenodd;stroke:none;stroke-width:2;filter:url(#filter4061)"
       id="rect3991"
       width="601.04077"
       height="5.6568542"
       x="77.781746"
       y="382.02496"
       transform="matrix(1.2917647,0,0,5.25,-104.47572,-1848.466)" />
    <path
       style="fill:url(#linearGradient3969);fill-opacity:1;fill-rule:evenodd;stroke:none;stroke-width:1px;stroke-linecap:butt;stroke-linejoin:miter;stroke-opacity:1"
       d="M 86.50965,507.88993 L 326.68332,627.09813 L 751.94739,627.57123 L 749.84687,454.56408 L 486.3839,404.02497 L 86.50965,507.88993 z"
       id="path3897"
       sodipodi:nodetypes="cccccc" />
    <path
       style="fill:#b8b6a9;fill-opacity:1;fill-rule:evenodd;stroke:none;stroke-width:1px;stroke-linecap:butt;stroke-linejoin:miter;stroke-opacity:1"
       d="M 533.01636,451.99502 L 573.90365,449.59698 L 589.23637,469.98033 L 545.79364,474.77633 L 533.01636,451.99502 z"
       id="path3911" />
    <path
       sodipodi:nodetypes="cc"
       style="fill:none;fill-rule:evenodd;stroke:#6b8e23;stroke-width:4;stroke-linecap:butt;stroke-linejoin:miter;stroke-opacity:1"
       d="M 804.86922,451.23533 C 811.94032,451.23533 328.2792,205.16203 328.2792,205.16203"
       id="path3893" />
    <path
       id="path3931"
       d="M 562.71484,174.80917 L 603.60213,172.41113 L 618.93485,192.79448 L 575.49212,197.59048 L 562.71484,174.80917 z"
       style="fill:#89b189;fill-opacity:1;fill-rule:evenodd;stroke:none;stroke-width:1px;stroke-linecap:butt;stroke-linejoin:miter;stroke-opacity:1" />
    <path
       style="fill:#b8b6a9;fill-opacity:1;fill-rule:evenodd;stroke:none;stroke-width:1px;stroke-linecap:butt;stroke-linejoin:miter;stroke-opacity:1"
       d="M 550.05425,473.84333 C 556.44289,473.84333 621.60699,483.43553 621.60699,483.43553 L 625.44018,497.82373 C 625.44018,497.82373 596.05245,511.01303 585.83062,511.01303 C 575.6088,511.01303 560.27607,500.22183 560.27607,500.22183 L 550.05425,473.84333 z"
       id="path3913" />
    <path
       id="path3891"
       d="M 355.40476,705.72061 C 362.47586,705.72061 59.834077,509.85189 59.834077,509.85189"
       style="fill:none;fill-rule:evenodd;stroke:#6b8e23;stroke-width:4;stroke-linecap:butt;stroke-linejoin:miter;stroke-opacity:1"
       sodipodi:nodetypes="cc" />
    <path
       id="path3921"
       d="M 395.01636,513.20223 L 445.29389,510.91733 L 464.14795,530.33803 L 410.72809,534.90753 L 395.01636,513.20223 z"
       style="fill:#b8b6a9;fill-opacity:1;fill-rule:evenodd;stroke:none;stroke-width:1px;stroke-linecap:butt;stroke-linejoin:miter;stroke-opacity:1" />
    <path
       style="fill:#b8b6a9;fill-opacity:1;fill-rule:evenodd;stroke:none;stroke-width:1px;stroke-linecap:butt;stroke-linejoin:miter;stroke-opacity:1"
       d="M 652.50269,493.11293 C 647.39178,493.11293 583.5054,515.89433 583.5054,515.89433 C 583.5054,515.89433 588.61632,524.28743 596.28268,525.48643 C 603.94905,526.68543 635.89223,541.07373 642.28087,541.07373 C 648.6695,541.07373 675.50179,537.47673 675.50179,537.47673 L 706.16724,533.87963 C 706.16724,533.87963 725.33315,520.69043 718.94452,519.49143 C 712.55588,518.29243 655.05814,511.09823 655.05814,511.09823 L 652.50269,493.11293 z"
       id="path3915" />
    <path
       id="path3923"
       d="M 363.9672,538.01863 C 371.82307,538.01863 451.95286,547.15773 451.95286,547.15773 L 456.66639,560.86643 C 456.66639,560.86643 420.52942,573.43283 407.96003,573.43283 C 395.39065,573.43283 376.53658,563.15123 376.53658,563.15123 L 363.9672,538.01863 z"
       style="fill:#b8b6a9;fill-opacity:1;fill-rule:evenodd;stroke:none;stroke-width:1px;stroke-linecap:butt;stroke-linejoin:miter;stroke-opacity:1" />
    <path
       style="fill:none;fill-rule:evenodd;stroke:#6b8e23;stroke-width:4;stroke-linecap:butt;stroke-linejoin:miter;stroke-opacity:1"
       d="M -3.9999501,524.86063 C 3.0711499,524.86063 762.50373,326.87064 762.50373,326.87064"
       id="path3889" />
    <rect
       y="0.076217175"
       x="-0.35571074"
       height="625"
       width="750"
       id="rect4065"
       style="fill:url(#linearGradient4073);fill-opacity:1;stroke:none"
       inkscape:export-filename="/home/honki/桌面/inkscape_0.48.png"
       inkscape:export-xdpi="90"
       inkscape:export-ydpi="90" />
    <text
       xml:space="preserve"
       style="font-size:23.28404045px;font-style:normal;font-variant:normal;font-weight:normal;font-stretch:normal;fill:#6b8e23;fill-opacity:1;stroke:none;stroke-width:1px;stroke-linecap:butt;stroke-linejoin:miter;stroke-opacity:1;font-family:Droid Sans;-inkscape-font-specification:Droid Sans"
       x="25.516201"
       y="514.7381"
       id="text4597"
       transform="matrix(1.0025918,-0.2519398,-1.0084868e-2,0.9999491,0,0)"><tspan
         sodipodi:role="line"
         id="tspan4599"
         x="25.516201"
         y="514.7381">wwww.inkscape.org</tspan></text>
    <path
       style="fill:#b8b6a9;fill-opacity:1;fill-rule:evenodd;stroke:none;stroke-width:1px;stroke-linecap:butt;stroke-linejoin:miter;stroke-opacity:1"
       d="M 662.06684,461.58723 C 669.7332,457.99013 715.7314,468.78133 715.7314,468.78133 L 699.12093,480.77153 C 699.12093,480.77153 686.34366,474.77633 671.01093,475.97543 C 655.6782,477.17443 633.95683,481.97053 642.90093,477.17443 C 651.84502,472.37833 663.34456,463.98523 662.06684,461.58723 z"
       id="path3917" />
    <path
       id="path3933"
       d="M 579.75273,196.65748 C 586.14137,196.65748 651.30547,206.24968 651.30547,206.24968 L 655.13866,220.63788 C 655.13866,220.63788 625.75093,233.82718 615.5291,233.82718 C 605.30728,233.82718 589.97455,223.03598 589.97455,223.03598 L 579.75273,196.65748 z"
       style="fill:#89b189;fill-opacity:1;fill-rule:evenodd;stroke:none;stroke-width:1px;stroke-linecap:butt;stroke-linejoin:miter;stroke-opacity:1" />
    <path
       id="path3935"
       d="M 700.58595,215.92708 C 695.47504,215.92708 631.58866,238.70848 631.58866,238.70848 C 631.58866,238.70848 636.69958,247.10158 644.36594,248.30058 C 652.03231,249.49958 683.97549,263.88788 690.36413,263.88788 C 696.75276,263.88788 723.58505,260.29088 723.58505,260.29088 L 754.2505,256.69378 C 754.2505,256.69378 773.41641,243.50458 767.02778,242.30558 C 760.63914,241.10658 703.1414,233.91238 703.1414,233.91238 L 700.58595,215.92708 z"
       style="fill:#89b189;fill-opacity:1;fill-rule:evenodd;stroke:none;stroke-width:1px;stroke-linecap:butt;stroke-linejoin:miter;stroke-opacity:1" />
    <path
       id="path3937"
       d="M 693.17953,188.64402 C 700.84589,185.04692 746.84409,195.83812 746.84409,195.83812 L 730.23362,207.82832 C 730.23362,207.82832 717.45635,201.83312 702.12362,203.03222 C 686.79089,204.23122 665.06952,209.02732 674.01362,204.23122 C 682.95771,199.43512 694.45725,191.04202 693.17953,188.64402 z"
       style="fill:#89b189;fill-opacity:1;fill-rule:evenodd;stroke:none;stroke-width:1px;stroke-linecap:butt;stroke-linejoin:miter;stroke-opacity:1" />
    <path
       style="fill:#89b189;fill-opacity:1;fill-rule:evenodd;stroke:none;stroke-width:1px;stroke-linecap:butt;stroke-linejoin:miter;stroke-opacity:1"
       d="M 492.04048,207.062 C 510.89456,204.7773 545.46035,195.6381 545.46035,195.6381 L 554.88739,208.2044 L 518.75041,217.3435 L 476.32876,226.4827 L 443.33415,218.4859 L 492.04048,207.062 z"
       id="path3939" />
    <path
       sodipodi:type="arc"
       style="opacity:0.98999999;fill:#7bb67b;fill-opacity:1;stroke:none;filter:url(#filter4171)"
       id="path3489"
       sodipodi:cx="1360.8707"
       sodipodi:cy="1044.7722"
       sodipodi:rx="170.77296"
       sodipodi:ry="34.913582"
       d="M 1531.6437,1044.7722 A 170.77296,34.913582 0 1 1 1190.0978,1044.7722 A 170.77296,34.913582 0 1 1 1531.6437,1044.7722 z"
       transform="matrix(0.3563929,0,0,0.6132874,-382.68305,-307.2143)" />
    <path
       transform="matrix(0.2386521,0,0,0.4471607,-222.40645,-137.26308)"
       d="M 1531.6437,1044.7722 A 170.77296,34.913582 0 1 1 1190.0978,1044.7722 A 170.77296,34.913582 0 1 1 1531.6437,1044.7722 z"
       sodipodi:ry="34.913582"
       sodipodi:rx="170.77296"
       sodipodi:cy="1044.7722"
       sodipodi:cx="1360.8707"
       id="path3491"
       style="opacity:0.98999999;fill:#89bd89;fill-opacity:1;stroke:none;filter:url(#filter4287)"
       sodipodi:type="arc" />
    <path
       sodipodi:type="arc"
       style="opacity:0.98999999;fill:#cfd6cf;fill-opacity:1;stroke:none;filter:url(#filter4195)"
       id="path3793"
       sodipodi:cx="1360.8707"
       sodipodi:cy="1044.7722"
       sodipodi:rx="170.77296"
       sodipodi:ry="34.913582"
       d="M 1531.6437,1044.7722 A 170.77296,34.913582 0 1 1 1190.0978,1044.7722 A 170.77296,34.913582 0 1 1 1531.6437,1044.7722 z"
       transform="matrix(8.8473367e-2,0,0,0.1657718,-37.667649,164.26838)" />
    <path
       sodipodi:nodetypes="ccc"
       id="path3497"
       d="M 125.98006,220.74335 L 160.31725,201.96059 L 208.44806,216.63453"
       style="fill:none;stroke:#000000;stroke-width:6.39798927;stroke-linecap:butt;stroke-linejoin:miter;stroke-miterlimit:4;stroke-dasharray:none;stroke-opacity:1" />
    <path
       transform="matrix(0.5468367,0,0,0.5468367,-446.88095,-189.20115)"
       d="M 1531.6437,1044.7722 A 170.77296,34.913582 0 1 1 1190.0978,1044.7722 A 170.77296,34.913582 0 1 1 1531.6437,1044.7722 z"
       sodipodi:ry="34.913582"
       sodipodi:rx="170.77296"
       sodipodi:cy="1044.7722"
       sodipodi:cx="1360.8707"
       id="path3499"
       style="opacity:0.98999999;fill:#7bb67b;fill-opacity:1;stroke:none;filter:url(#filter4107)"
       sodipodi:type="arc" />
    <path
       sodipodi:nodetypes="cssccc"
       id="path3501"
       d="M 372.48906,292.35685 C 363.05071,310.14085 466.87293,339.78087 558.89722,323.47878 C 650.92152,307.17692 638.63064,346.67198 723.8331,345.65346 C 799.8516,344.74469 686.6917,280.85947 678.43308,276.41352 C 700.43539,213.25939 379.65735,202.64863 372.48906,292.35685 L 372.48906,292.35685 z"
       style="fill:#8b4513;stroke:none" />
    <path
       sodipodi:nodetypes="cssssssccc"
       id="path3529"
       d="M 391.64405,297.17023 C 391.64405,297.17023 401.11902,280.45936 441.22489,262.22468 C 476.99087,245.96309 593.10096,253.53762 619.4889,262.57518 C 677.65126,282.49509 542.55009,289.70207 523.87868,288.61388 C 437.971,283.60706 507.1185,317.33959 572.92005,315.96536 C 577.3664,315.87255 522.12974,333.53485 483.72732,323.31997 C 445.32483,313.10532 402.38017,312.28816 396.59915,310.24516 C 390.81814,308.20216 389.57936,299.21313 389.57936,299.21313 L 391.64405,297.17023 L 391.64405,297.17023 z"
       style="fill:url(#linearGradient3985);fill-opacity:1;stroke:none;stroke-width:1px;stroke-linecap:butt;stroke-linejoin:miter;stroke-opacity:1" />
    <path
       sodipodi:nodetypes="cscssscscccscscscscscssscccc"
       id="path3503"
       d="M 414.72115,309.64174 C 413.56315,309.62958 412.47958,310.5949 412.37061,311.73576 C 412.26171,312.87649 413.14333,314.02559 414.28318,314.22825 C 414.28318,314.22825 430.37413,317.36705 448.95643,320.45809 C 467.53867,323.54901 488.42255,326.62561 498.92235,326.45313 C 526.93799,325.99289 540.29316,323.5082 553.01262,321.34287 C 565.73213,319.17754 577.83037,317.3131 604.1466,317.94811 C 615.66851,318.23088 631.67285,322.39319 646.86766,327.2476 C 662.06245,332.10201 676.47893,337.61021 685.35494,340.53788 L 685.40984,340.55579 L 685.48283,340.5737 C 697.45218,343.72097 708.7359,342.34109 714.46236,343.21003 C 725.72202,344.91859 744.01296,340.41999 743.77967,339.05261 C 745.00151,338.70742 723.05298,334.79511 722.63035,333.60942 C 722.20768,332.42364 721.51352,327.67365 717.03977,326.93759 C 713.89054,328.0399 706.76657,328.30367 702.13889,329.71589 C 697.53066,331.12214 698.07918,339.09115 686.81498,336.14969 C 686.79688,336.14382 686.76008,336.13753 686.74198,336.13178 C 686.72155,336.12591 686.70811,336.11908 686.68709,336.11387 C 678.03271,333.25371 663.60823,327.72934 648.30931,322.84171 C 632.95298,317.93574 616.78144,313.63286 604.25596,313.32545 C 577.67883,312.68414 564.99762,314.61859 552.22788,316.7925 C 539.45814,318.9663 526.61359,321.37435 498.84929,321.83047 C 489.41974,321.98537 468.23091,318.96825 449.72277,315.88959 C 431.21471,312.81092 415.19552,309.69591 415.19552,309.69591 C 415.03977,309.66192 414.88058,309.6438 414.7211,309.64185 L 414.72115,309.64174 L 414.72115,309.64174 z"
       style="font-size:medium;font-style:normal;font-variant:normal;font-weight:normal;font-stretch:normal;text-indent:0;text-align:start;text-decoration:none;line-height:normal;letter-spacing:normal;word-spacing:normal;text-transform:none;direction:ltr;block-progression:tb;writing-mode:lr-tb;text-anchor:start;fill:#a0522d;fill-opacity:1;stroke:none;stroke-width:8;marker:none;visibility:visible;display:inline;overflow:visible;enable-background:accumulate;font-family:Andale Mono;-inkscape-font-specification:Andale Mono" />
    <path
       sodipodi:nodetypes="cccccccc"
       id="path3505"
       d="m 323.23794,244.60528 c 14.84269,-1.56236 91.39981,-11.71791 91.39981,-11.71791 l 24.45882,11.23027 1.14714,2.31348 -0.34252,21.02 -117.63114,23.46091 0.96789,-46.30675 0,0 z"
       style="fill:#a9a9a9;fill-opacity:1;stroke:none" />
    <path
       sodipodi:nodetypes="cccccc"
       id="path3507"
       d="M 211.26789,261.51689 L 259.09384,334.44416 L 296.25779,355.65772 L 331.51493,339.05634 L 369.44861,257.63366 L 211.26789,261.51689 z"
       style="fill:#2b1b1b;fill-opacity:1;stroke:none;stroke-width:1px;stroke-linecap:butt;stroke-linejoin:miter;stroke-opacity:1" />
    <path
       sodipodi:nodetypes="ccccc"
       style="fill:#402727;fill-opacity:1;stroke:none"
       d="M 294.74305,348.41125 C 295.0477,349.62978 296.34769,354.68203 296.34769,354.68203 L 331.16145,338.66351 L 332.02299,334.65126 L 294.74305,348.41125 z"
       id="path3509" />
    <path
       style="fill:none;stroke:#7cfc00;stroke-width:4.37469387;stroke-linecap:butt;stroke-linejoin:miter;stroke-opacity:1"
       d="M 254.88828,325.97002 L 296.28557,348.33893 L 332.9752,332.75854"
       id="path3511"
       sodipodi:nodetypes="ccc" />
    <path
       sodipodi:nodetypes="ccc"
       id="path3513"
       d="M 254.50752,324.82771 L 296.39794,347.55513 L 331.67197,333.54172"
       style="fill:none;stroke:#adff2f;stroke-width:4.37469387;stroke-linecap:butt;stroke-linejoin:miter;stroke-opacity:1" />
    <path
       style="fill:#2b2b2b;fill-opacity:1;stroke:none"
       d="M 220.16147,278.15207 L 252.42839,327.81651 L 296.24822,349.03007 L 337.81973,332.42868 L 357.99193,286.33108 L 220.16147,278.15207 L 220.16147,278.15207 z"
       id="path3515"
       sodipodi:nodetypes="cccccc" />
    <path
       id="path3517"
       d="M 295.17385,341.73398 C 295.4785,342.95241 296.24002,348.43549 296.24002,348.43549 L 337.51563,331.98625 L 337.51563,327.11233 L 295.17385,341.73398 L 295.17385,341.73398 z"
       style="fill:#2b1b1b;fill-opacity:1;stroke:none;stroke-width:1px;stroke-linecap:butt;stroke-linejoin:miter;stroke-opacity:1" />
    <path
       sodipodi:nodetypes="ccc"
       id="path3519"
       d="M 250.54749,319.95379 L 294.52656,343.06664 L 339.34339,325.43697"
       style="fill:none;stroke:#7cfc00;stroke-width:4.37469387;stroke-linecap:butt;stroke-linejoin:miter;stroke-opacity:1" />
    <path
       style="fill:none;stroke:#adff2f;stroke-width:4.37469387;stroke-linecap:butt;stroke-linejoin:miter;stroke-opacity:1"
       d="M 251.61366,318.58302 L 293.6508,342.1909 L 340.40956,324.0661"
       id="path3521"
       sodipodi:nodetypes="ccc" />
    <path
       sodipodi:nodetypes="ccccccc"
       id="path3523"
       d="M 221.13504,279.53928 L 241.80029,319.10415 L 292.09068,342.56822 L 346.26261,325.49799 L 354.08446,292.30221 L 217.88504,277.28928 L 221.13504,279.53928 z"
       style="fill:#494949;fill-opacity:1;stroke:none" />
    <path
       sodipodi:nodetypes="ccccc"
       id="path3525"
       d="M 243.23667,294.74678 L 249.29709,322.08617 L 252.98442,323.6854 L 247.95336,296.26989 L 243.23667,294.74678 z"
       style="fill:#808080;stroke:none" />
    <path
       sodipodi:nodetypes="ccccc"
       id="path3527"
       d="M 286.47701,311.45746 L 291.43114,342.0438 L 345.06494,325.02741 L 353.89623,292.50253 L 286.47701,311.45746 L 286.47701,311.45746 z"
       style="fill:#2b1b1b;fill-opacity:1;stroke:none;stroke-width:1px;stroke-linecap:butt;stroke-linejoin:miter;stroke-opacity:1" />
    <path
       sodipodi:nodetypes="ccccccccc"
       id="path3531"
       d="M 422.5243,254.4958 L 424.68096,300.93168 L 427.41181,300.54502 L 427.67954,309.75591 L 430.53567,308.45284 L 430.35712,300.54502 L 433.48651,300.73835 L 435.64094,252.5624 L 422.5243,254.4958 L 422.5243,254.4958 z"
       style="fill:#8fbc8f;fill-opacity:1;stroke:#87cefa;stroke-width:1.14244246;stroke-linecap:butt;stroke-linejoin:miter;stroke-opacity:1" />
    <path
       style="fill:#8b4513;fill-opacity:1;stroke:none"
       d="M 424.2816,281.45645 L 425.84097,300.54502 L 428.50549,301.09183 L 428.78979,308.78649 L 429.85213,310.64017 L 430.08371,303.68924 L 431.55317,300.54502 L 434.06244,281.19326 C 428.28506,279.6079 426.28898,280.40289 424.2816,281.45645 L 424.2816,281.45645 z"
       id="path3533"
       sodipodi:nodetypes="cccccccccc" />
    <path
       sodipodi:nodetypes="ccccc"
       id="path3535"
       d="M 426.68429,265.64615 L 431.28282,265.64615 L 429.44342,299.67504 L 427.45069,299.98167 L 426.68429,265.64615 z"
       style="fill:#87cefa;stroke:none" />
    <path
       style="fill:#2f4f4f;stroke:none"
       d="M 426.83758,259.8213 L 429.29008,259.8213 L 428.30911,293.85029 L 427.24634,294.15693 L 426.83758,259.8213 z"
       id="path3537"
       sodipodi:nodetypes="ccccc" />
    <path
       sodipodi:nodetypes="ccccc"
       id="path3539"
       d="M 334.02419,261.51792 L 439.6942,246.74403 L 439.20473,267.03983 L 335.15456,287.25479 L 334.02419,261.51792 L 334.02419,261.51792 z"
       style="fill:#808080;fill-opacity:1;stroke:none" />
    <path
       sodipodi:nodetypes="ccccc"
       id="path3541"
       d="M 313.48954,302.83251 L 318.75181,331.49316 L 322.93265,329.69588 L 318.05881,304.35563 L 313.48954,302.83251 z"
       style="fill:#000000;stroke:none" />
    <path
       id="path3543"
       d="M 369.8624,255.5207 L 438.24333,244.2218 L 439.85749,245.98262 L 370.15588,257.7219 L 369.8624,255.5207 z"
       style="fill:#c0c0c0;stroke:none" />
    <path
       sodipodi:nodetypes="ccccc"
       id="path3545"
       d="M 347.79835,250.96482 L 405.20461,241.83384 L 420.56126,245.56926 L 425.12675,248.88955 L 425.00518,269.00877"
       style="fill:none;stroke:#000000;stroke-width:0.54683673px;stroke-linecap:butt;stroke-linejoin:miter;stroke-opacity:1" />
    <path
       sodipodi:nodetypes="ccccccccccc"
       id="path3547"
       d="M 209.65192,271.08332 L 193.31977,177.65849 L 208.42132,156.44658 L 346.21756,117.15557 L 407.44571,130.6868 L 407.66488,168.18462 L 387.2623,198.36212 L 365.33322,290.58588 L 298.58092,327.66776 L 205.39852,273.01672 L 209.65192,271.08332 z"
       style="fill:#e4e4e4;fill-opacity:1;stroke:none;stroke-width:1px;stroke-linecap:butt;stroke-linejoin:miter;stroke-opacity:1" />
    <path
       style="fill:#000000;stroke:none"
       d="M 242.51703,293.07892 L 248.6094,320.49454 L 251.96014,322.01765 L 247.08629,294.60204 L 242.51703,293.07892 z"
       id="path3549" />
    <path
       sodipodi:nodetypes="ccccc"
       id="path3551"
       d="M 221.76119,190.63766 L 265.47537,202.15793 L 269.91137,310.02916 L 227.27658,285.56146 L 221.76119,190.63766 z"
       style="fill:#c0c0c0;stroke:none;stroke-width:0.86183745px;stroke-linecap:butt;stroke-linejoin:miter;stroke-opacity:1" />
    <path
       sodipodi:nodetypes="cccccccc"
       id="path3553"
       d="M 294.27283,202.55989 L 304.63555,185.73498 L 405.70731,132.9634 L 405.74505,165.42633 L 386.23522,196.73248 L 364.06762,290.25078 L 298.12332,327.79032 L 294.27283,202.55989 L 294.27283,202.55989 z"
       style="fill:#d3d3d3;stroke:none;stroke-width:1px;stroke-linecap:butt;stroke-linejoin:miter;stroke-opacity:1" />
    <path
       sodipodi:nodetypes="cccc"
       id="path3555"
       d="M 284.3128,146.63947 L 281.43081,140.64871 L 321.58481,127.8567 L 329.21531,128.73717"
       style="fill:none;fill-opacity:1;stroke:#d3d3d3;stroke-width:0.54683673px;stroke-linecap:butt;stroke-linejoin:miter;stroke-opacity:1" />
    <path
       id="path3561"
       d="M 326.76133,371.32758 C 351.66395,382.1187 415.01188,410.54148 415.01188,410.54148 C 415.01188,410.54148 392.90701,417.28979 388.75656,414.79961 C 384.60613,412.30924 313.47986,383.77895 313.47986,383.77895 L 253.1293,426.78981 L 213.8233,420.7486 L 277.78609,380.45855 L 138.46226,363.90549 L 152.95251,337.93467 L 218.45241,338.93959 L 281.93652,359.70634 L 375.7365,326.50275 L 384.86747,338.95423 L 326.76133,371.32758 z"
       style="fill:#7cb67c;fill-opacity:1;stroke:none;filter:url(#filter4111)"
       sodipodi:nodetypes="ccsccccccccccc" />
    <path
       sodipodi:nodetypes="ccccc"
       id="path3557"
       d="M 141.646,351.6581 L 124.54014,351.36533 L 128.9922,364.6571 L 150.12471,361.51472 L 141.646,351.6581 L 141.646,351.6581 z"
       style="fill:#4169e1;stroke:none" />
    <path
       sodipodi:nodetypes="cccc"
       id="path3559"
       d="M 125.80791,318.81148 L 136.86774,358.03417 L 154.82789,315.49714 L 125.80791,318.81148 z"
       style="fill:#000000;stroke:none" />
    <path
       sodipodi:nodetypes="cccc"
       id="path3563"
       d="M 223.29604,380.7858 L 240.7971,426.16977 L 256.71352,376.86957 L 223.29604,380.7858 L 223.29604,380.7858 z"
       style="fill:#daa520;stroke:none;stroke-width:1px;stroke-linecap:butt;stroke-linejoin:miter;stroke-opacity:1" />
    <path
       style="fill:#edbb3d;fill-opacity:1;stroke:none"
       d="M 226.67845,386.07459 L 240.76793,425.34834 L 238.83438,387.34135 L 226.67845,386.07459 L 226.67845,386.07459 z"
       id="path3565"
       sodipodi:nodetypes="cccc" />
    <path
       sodipodi:nodetypes="ccccccc"
       id="path3567"
       d="M 237.32668,412.25086 L 230.8412,388.32565 L 235.93742,388.23425 L 241.89695,412.87369 L 243.88025,387.68388 L 250.17321,390.7789 L 243.364,413.46801"
       style="fill:none;stroke:#808080;stroke-width:0.5786984px;stroke-linecap:butt;stroke-linejoin:miter;stroke-opacity:1" />
    <path
       style="fill:url(#linearGradient4726);fill-opacity:1;fill-rule:evenodd;stroke:none;stroke-width:1px;stroke-linecap:butt;stroke-linejoin:miter;stroke-opacity:1"
       d="M 193.63634,179.79244 L 210.96046,277.37317 L 296.60616,327.35288 L 292.63129,201.77341 L 193.63634,179.79244 z"
       id="path4702"
       sodipodi:nodetypes="ccccc" />
    <path
       sodipodi:nodetypes="ccccccccc"
       id="path3569"
       d="M 210.97452,363.9628 L 209.95095,366.9928 L 209.82833,388.61189 L 214.56039,395.4115 L 260.22109,399.93595 L 305.76198,317.72485 L 303.55243,307.22948 L 268.13276,302.83235 L 210.97452,363.9628 z"
       style="fill:#d3d3d3;stroke:none;stroke-width:1px;stroke-linecap:butt;stroke-linejoin:miter;stroke-opacity:1" />
    <path
       sodipodi:nodetypes="cssssczccc"
       id="path3571"
       d="M 235.16267,409.93954 C 236.12278,411.09192 236.34848,411.06424 237.66811,410.32357 C 238.16412,410.04506 239.08782,410.52033 239.91502,411.22968 C 240.5371,411.76308 240.96779,408.99714 241.75669,409.04096 C 242.19219,409.06528 242.83212,410.91891 243.76873,410.50242 C 245.14681,409.8897 246.10231,408.57361 246.03623,408.32554 C 246.03623,408.32554 242.3762,426.49171 240.80808,426.81298 C 239.23991,427.13424 235.16267,409.93954 235.16267,409.93954 L 235.16263,409.93976 L 235.16267,409.93954 L 235.16267,409.93954 z"
       style="fill:#000000;stroke:none" />
    <path
       sodipodi:nodetypes="cccccc"
       id="path3573"
       d="M 301.04404,308.01461 L 252.62787,371.80652 L 259.73659,400.0585 L 303.37525,323.25919 L 301.04404,308.01461 L 301.04404,308.01461 z"
       style="fill:#a9a9a9;fill-opacity:1;stroke:none;stroke-width:1px;stroke-linecap:butt;stroke-linejoin:miter;stroke-opacity:1" />
    <path
       id="path3575"
       d="M 407.88783,347.18902 L 393.5257,372.59892 L 407.88783,411.81852 L 434.95482,381.98947 L 427.2214,352.16053 L 407.88783,347.18902 L 407.88783,347.18902 z"
       style="fill:#daa520;stroke:none" />
    <path
       sodipodi:nodetypes="ccccccc"
       id="path3577"
       d="M 407.72985,410.27281 L 432.40383,382.8572 L 426.92075,353.61399 L 407.42526,347.21706 L 395.24053,371.58645 L 413.11307,378.95352 L 407.72985,410.27281 L 407.72985,410.27281 z"
       style="fill:#b8860b;stroke:none;stroke-width:1px;stroke-linecap:butt;stroke-linejoin:miter;stroke-opacity:1" />
    <path
       sodipodi:nodetypes="ccc"
       id="path3579"
       d="M 358.92424,317.34076 L 349.016,337.58808 L 319.29121,321.64866"
       style="fill:none;stroke:#000000;stroke-width:4.37469387;stroke-linecap:butt;stroke-linejoin:miter;stroke-opacity:1" />
    <path
       sodipodi:nodetypes="cccccccc"
       id="path3581"
       d="M 351.96738,285.41806 L 329.51465,293.97212 L 327.54828,314.55289 L 421.21118,364.12549 L 441.64952,348.10626 L 444.857,330.69437 L 443.44102,326.9079 L 351.96738,285.41806 L 351.96738,285.41806 z"
       style="fill:#c0c0c0;stroke:none;stroke-width:1px;stroke-linecap:butt;stroke-linejoin:miter;stroke-opacity:1" />
    <path
       sodipodi:nodetypes="ccccc"
       id="path3583"
       d="M 38.65955,351.40241 L 18.22115,355.26921 L 32.00315,363.421 L 54.16565,358.22062 L 38.65955,351.40241 z"
       style="fill:#4169e1;stroke:none" />
    <path
       sodipodi:nodetypes="ccccc"
       id="path3585"
       d="M 173.40151,430.91584 L 151.67361,438.13612 L 175.53259,449.83101 L 195.71437,438.32564 L 173.40151,430.91584 L 173.40151,430.91584 z"
       style="fill:#4169e1;stroke:none" />
    <path
       sodipodi:nodetypes="cc"
       id="path3587"
       d="M 37.16685,358.33844 C 37.16685,358.33844 185.53999,315.54756 175.17583,439.20576"
       style="fill:none;stroke:#000000;stroke-width:0.54683673px;stroke-linecap:butt;stroke-linejoin:miter;stroke-opacity:1" />
    <path
       id="path3925"
       d="M 556.94412,546.37813 C 550.65943,546.37813 472.1008,568.08353 472.1008,568.08353 C 472.1008,568.08353 478.3855,576.08023 487.81253,577.22263 C 497.23957,578.36503 536.51887,592.07373 544.37474,592.07373 C 552.23059,592.07373 585.22523,588.64663 585.22523,588.64663 L 622.93336,585.21943 C 622.93336,585.21943 646.50094,572.65313 638.64509,571.51073 C 630.78922,570.36843 560.08646,563.51393 560.08646,563.51393 L 556.94412,546.37813 z"
       style="fill:#b8b6a9;fill-opacity:1;fill-rule:evenodd;stroke:none;stroke-width:1px;stroke-linecap:butt;stroke-linejoin:miter;stroke-opacity:1" />
    <path
       sodipodi:nodetypes="ccsccsc"
       id="path3589"
       d="M 408.24505,413.56403 L 402.84875,417.19735 C 470.93281,437.83955 537.71053,431.03756 605.56132,412.78918 C 662.90267,397.36729 674.63566,445.79562 730.22522,398.55036 L 711.63575,393.46446 C 664.68357,437.13537 646.10074,386.68554 606.3737,400.5938 C 512.77129,433.36359 484.07541,427.00108 408.24505,413.56403 z"
       style="fill:#696969;stroke:none;stroke-width:1px;stroke-linecap:butt;stroke-linejoin:miter;stroke-opacity:1" />
    <path
       id="path3927"
       d="M 538.70479,516.34133 C 548.13181,512.91413 604.69404,523.19573 604.69404,523.19573 L 584.26878,534.61963 C 584.26878,534.61963 568.55706,528.90753 549.70299,530.05003 C 530.84892,531.19243 504.13898,535.76193 515.1372,531.19243 C 526.13541,526.62283 540.27595,518.62613 538.70479,516.34133 z"
       style="fill:#b8b6a9;fill-opacity:1;fill-rule:evenodd;stroke:none;stroke-width:1px;stroke-linecap:butt;stroke-linejoin:miter;stroke-opacity:1" />
    <path
       style="fill:#b8b6a9;fill-opacity:1;fill-rule:evenodd;stroke:none;stroke-width:1px;stroke-linecap:butt;stroke-linejoin:miter;stroke-opacity:1"
       d="M 627.56819,447.19894 C 642.90093,444.8009 649.01093,439.20873 649.01093,439.20873 L 678.6773,448.39796 L 649.28956,457.99013 L 614.79092,467.58233 L 587.95865,459.18913 L 627.56819,447.19894 z"
       id="path3919"
       sodipodi:nodetypes="ccccccc" />
    <path
       transform="matrix(0.5993078,0,0,0.6903965,-518.29454,-360.75903)"
       d="M 1465.293,1014.5482 A 18.513109,16.543631 0 1 1 1428.2668,1014.5482 A 18.513109,16.543631 0 1 1 1465.293,1014.5482 z"
       sodipodi:ry="16.543631"
       sodipodi:rx="18.513109"
       sodipodi:cy="1014.5482"
       sodipodi:cx="1446.7799"
       id="path3593"
       style="fill:#000000;fill-opacity:1;stroke:none"
       sodipodi:type="arc" />
    <path
       sodipodi:nodetypes="cccccc"
       id="path3595"
       d="M 330.12684,298.32707 L 426.79437,337.75429 L 427.87017,343.26531 L 421.52036,363.70504 L 329.07347,313.38212 L 330.12684,298.32707 L 330.12684,298.32707 z"
       style="fill:#a9a9a9;fill-opacity:1;stroke:none;stroke-width:1px;stroke-linecap:butt;stroke-linejoin:miter;stroke-opacity:1" />
    <path
       sodipodi:nodetypes="ccccc"
       id="path3597"
       d="M 134.70357,328.28602 L 148.29237,329.82315 L 136.6711,356.38604 C 137.72833,346.37542 137.85599,335.43523 142.48174,328.99313 L 134.70357,328.28602 z"
       style="fill:#191970;stroke:none" />
    <path
       sodipodi:nodetypes="ccccc"
       id="path3599"
       d="M 330.97623,294.26016 L 425.47689,339.45625 L 425.47689,341.51055 L 330.09577,295.43411 L 330.97623,294.26016 L 330.97623,294.26016 z"
       style="fill:#989898;fill-opacity:1;stroke:none;stroke-width:1px;stroke-linecap:butt;stroke-linejoin:miter;stroke-opacity:1" />
    <path
       sodipodi:nodetypes="ccc"
       id="path3601"
       d="M 430.27893,320.52536 L 407.40147,330.9821 L 404.27799,355.00079"
       style="fill:none;stroke:#594949;stroke-width:0.54683673px;stroke-linecap:butt;stroke-linejoin:miter;stroke-opacity:1" />
    <path
       transform="matrix(0.6631386,0,0,0.6789734,-601.38465,-304.33025)"
       sodipodi:type="arc"
       style="fill:#2f4f4f;stroke:none"
       id="path3603"
       sodipodi:cx="1058.5714"
       sodipodi:cy="813.79077"
       sodipodi:rx="91.428574"
       sodipodi:ry="50"
       d="M 1150,813.79077 A 91.428574,50 0 1 1 967.14284,813.79077 A 91.428574,50 0 1 1 1150,813.79077 z" />
    <path
       sodipodi:nodetypes="csssc"
       id="path3605"
       d="M 157.65196,246.65373 C 157.65196,261.75419 133.5252,276.39988 102.99535,276.39988 C 72.46555,276.39988 43.45035,261.37482 43.45035,246.27436 C 43.45035,231.1738 70.84095,218.25955 101.37075,218.25955 C 131.90061,218.25955 157.65196,231.55327 157.65196,246.65373 z"
       style="fill:#8fbc8f;fill-opacity:1;stroke:none" />
    <path
       sodipodi:nodetypes="cscccc"
       id="path3607"
       d="M 40.44375,251.61918 C 56.90765,274.4861 80.71215,277.29226 99.48085,278.47514 C 124.88021,280.07592 148.08752,270.24395 158.385,253.85161 C 161.38543,252.20009 157.57683,259.15954 156.4469,260.75302 C 132.1515,291.78931 65.33485,290.33564 42.80235,257.53946 C 42.08875,254.53864 40.47165,252.56281 40.44375,251.61918 L 40.44375,251.61918 z"
       style="fill:#000000;stroke:none" />
    <path
       sodipodi:nodetypes="ccccc"
       id="path3609"
       d="M 209.02695,156.52208 L 303.4576,184.82802 L 293.74344,199.60838 L 194.59784,176.54217 L 209.02695,156.52208 L 209.02695,156.52208 z"
       style="fill:#f2f2f2;fill-opacity:1;stroke:none;stroke-width:1px;stroke-linecap:butt;stroke-linejoin:miter;stroke-opacity:1" />
    <path
       style="fill:#a9a9a9;stroke:none;stroke-width:0.79329807px;stroke-linecap:butt;stroke-linejoin:miter;stroke-opacity:1"
       d="M 225.28561,194.56034 L 265.52333,205.1644 L 269.60656,304.45702 L 230.34046,282.66327 L 225.28561,194.56034 L 225.28561,194.56034 z"
       id="path3611"
       sodipodi:nodetypes="ccccc" />
    <path
       sodipodi:nodetypes="ccccc"
       id="path3613"
       d="M 228.89642,200.03572 L 265.62241,209.71432 L 269.34927,300.34111 L 233.48602,280.69052 L 228.89642,200.03572 L 228.89642,200.03572 z"
       style="fill:#6a6464;fill-opacity:1;stroke:none" />
    <path
       sodipodi:nodetypes="cccccc"
       id="path3615"
       d="M 222.36692,191.40615 L 225.19177,194.4835 L 228.65981,198.46638 L 265.23783,208.5075 L 264.7092,202.7335 L 222.36692,191.40615 L 222.36692,191.40615 z"
       style="fill:#808080;stroke:none;stroke-width:1px;stroke-linecap:butt;stroke-linejoin:miter;stroke-opacity:1" />
    <path
       sodipodi:nodetypes="ccccc"
       id="path3617"
       d="M 225.28249,195.12657 L 265.42337,205.16779 L 265.39985,209.19802 L 227.99316,199.57109 L 225.28265,195.12657 L 225.28249,195.12657 z"
       style="fill:#747474;fill-opacity:1;stroke:none;stroke-width:1px;stroke-linecap:butt;stroke-linejoin:miter;stroke-opacity:1" />
    <path
       sodipodi:nodetypes="cccc"
       id="path3619"
       d="M 202.46529,178.79915 L 293.38061,200.40923 L 293.44765,203.17121 L 202.46529,178.79915 z"
       style="fill:#d3d3d3;stroke:none" />
    <path
       transform="matrix(0.2222965,0,0,0.1163912,-101.98345,92.55423)"
       d="M 1750.5943,627.08795 A 98.994949,98.994949 0 1 1 1552.6044,627.08795 A 98.994949,98.994949 0 1 1 1750.5943,627.08795 z"
       sodipodi:ry="98.994949"
       sodipodi:rx="98.994949"
       sodipodi:cy="627.08795"
       sodipodi:cx="1651.5994"
       id="path3621"
       style="fill:#d3d3d3;stroke:none;stroke-width:3.39962626;stroke-linecap:round;stroke-linejoin:round;stroke-miterlimit:4;stroke-dasharray:none"
       sodipodi:type="arc" />
    <path
       transform="matrix(0.1929564,0,0,0.1010292,-53.52525,102.18763)"
       sodipodi:type="arc"
       style="fill:#c0c0c0;stroke:none;stroke-width:3.91655898;stroke-linecap:round;stroke-linejoin:round;stroke-miterlimit:4;stroke-dasharray:none"
       id="path3623"
       sodipodi:cx="1651.5994"
       sodipodi:cy="627.08795"
       sodipodi:rx="98.994949"
       sodipodi:ry="98.994949"
       d="M 1750.5943,627.08795 A 98.994949,98.994949 0 1 1 1552.6044,627.08795 A 98.994949,98.994949 0 1 1 1750.5943,627.08795 z" />
    <path
       sodipodi:type="arc"
       style="fill:#808080;stroke:none;stroke-width:4.61888695;stroke-linecap:round;stroke-linejoin:round;stroke-miterlimit:4;stroke-dasharray:none"
       id="path3625"
       sodipodi:cx="1651.5994"
       sodipodi:cy="627.08795"
       sodipodi:rx="98.994949"
       sodipodi:ry="98.994949"
       d="M 1750.5943,627.08795 A 98.994949,98.994949 0 1 1 1552.6044,627.08795 A 98.994949,98.994949 0 1 1 1750.5943,627.08795 z"
       transform="matrix(0.1636163,0,0,8.566711e-2,-5.0671501,111.82093)" />
    <path
       d="M 1750.5943,627.08795 A 98.994949,98.994949 0 1 1 1552.6044,627.08795 A 98.994949,98.994949 0 1 1 1750.5943,627.08795 z"
       sodipodi:ry="98.994949"
       sodipodi:rx="98.994949"
       sodipodi:cy="627.08795"
       sodipodi:cx="1651.5994"
       id="path3627"
       style="fill:#696969;stroke:none;stroke-width:5.32121563;stroke-linecap:round;stroke-linejoin:round;stroke-miterlimit:4;stroke-dasharray:none"
       sodipodi:type="arc"
       transform="matrix(0.1420211,0,0,7.4360222e-2,30.59935,118.91146)" />
    <path
       sodipodi:nodetypes="cscccc"
       id="path3629"
       d="M 275.06098,155.29482 C 275.06098,155.29482 284.60153,158.95657 285.24772,160.89511 C 285.44158,161.47674 283.09417,162.63497 283.20682,162.97294 L 281.38367,165.82306 L 278.72271,166.92623 L 275.06098,155.29482 L 275.06098,155.29482 z"
       style="fill:#696969;stroke:none;stroke-width:1px;stroke-linecap:butt;stroke-linejoin:miter;stroke-opacity:1" />
    <path
       sodipodi:nodetypes="ccccc"
       id="path3631"
       d="M 251.3321,164.0268 L 249.12254,107.68314 C 247.86039,94.71188 275.13228,92.81659 277.84672,104.3688 L 280.05628,167.34114 C 277.95566,174.63784 250.35446,173.75748 251.3321,164.0268 L 251.3321,164.0268 z"
       style="fill:#b0e0e6;stroke:none;stroke-width:1px;stroke-linecap:butt;stroke-linejoin:miter;stroke-opacity:1" />
    <path
       style="fill:#ff0000;stroke:none"
       d="M 253.89578,166.68534 L 252.01247,125.09369 C 249.00885,115.43903 273.99863,113.80148 276.49593,122.64708 L 278.3793,169.13196 C 276.58879,174.51827 253.0625,173.86832 253.89578,166.68534 z"
       id="path3633"
       sodipodi:nodetypes="ccccc" />
    <path
       transform="matrix(0.5989931,0,0,0.5051877,-506.93345,-191.88496)"
       d="M 1307.8571,620.57648 A 20.714285,9.6428576 0 1 1 1266.4285,620.57648 A 20.714285,9.6428576 0 1 1 1307.8571,620.57648 z"
       sodipodi:ry="9.6428576"
       sodipodi:rx="20.714285"
       sodipodi:cy="620.57648"
       sodipodi:cx="1287.1428"
       id="path3635"
       style="fill:#ff6347;stroke:none"
       sodipodi:type="arc" />
    <path
       sodipodi:nodetypes="ccccc"
       id="path3637"
       d="M 251.61344,109.69934 L 251.85252,165.63045 C 252.59726,168.43352 253.96424,168.67894 255.39678,168.6551 L 253.87926,112.29675 C 252.96003,111.95149 252.1669,110.998 251.61344,109.69934 z"
       style="fill:#f3f4fc;fill-opacity:1;stroke:none" />
    <path
       sodipodi:type="arc"
       style="fill:#d3d3d3;stroke:none"
       id="path3639"
       sodipodi:cx="1651.5994"
       sodipodi:cy="627.08795"
       sodipodi:rx="98.994949"
       sodipodi:ry="98.994949"
       d="M 1750.5943,627.08795 A 98.994949,98.994949 0 1 1 1552.6044,627.08795 A 98.994949,98.994949 0 1 1 1750.5943,627.08795 z"
       transform="matrix(0.2222965,0,0,0.1163912,-64.68285,77.9072)" />
    <path
       d="M 1750.5943,627.08795 A 98.994949,98.994949 0 1 1 1552.6044,627.08795 A 98.994949,98.994949 0 1 1 1750.5943,627.08795 z"
       sodipodi:ry="98.994949"
       sodipodi:rx="98.994949"
       sodipodi:cy="627.08795"
       sodipodi:cx="1651.5994"
       id="path3641"
       style="fill:#c0c0c0;stroke:none"
       sodipodi:type="arc"
       transform="matrix(0.1929564,0,0,0.1010292,-16.22465,87.5406)" />
    <path
       transform="matrix(0.1636163,0,0,8.566711e-2,32.23345,97.17401)"
       d="M 1750.5943,627.08795 A 98.994949,98.994949 0 1 1 1552.6044,627.08795 A 98.994949,98.994949 0 1 1 1750.5943,627.08795 z"
       sodipodi:ry="98.994949"
       sodipodi:rx="98.994949"
       sodipodi:cy="627.08795"
       sodipodi:cx="1651.5994"
       id="path3643"
       style="fill:#808080;stroke:none"
       sodipodi:type="arc" />
    <path
       transform="matrix(0.1420211,0,0,7.4360222e-2,67.89995,104.26443)"
       sodipodi:type="arc"
       style="fill:#696969;stroke:none"
       id="path3645"
       sodipodi:cx="1651.5994"
       sodipodi:cy="627.08795"
       sodipodi:rx="98.994949"
       sodipodi:ry="98.994949"
       d="M 1750.5943,627.08795 A 98.994949,98.994949 0 1 1 1552.6044,627.08795 A 98.994949,98.994949 0 1 1 1750.5943,627.08795 z" />
    <path
       style="fill:#696969;stroke:none"
       d="M 312.36158,140.64789 C 312.36158,140.64789 321.90214,144.30955 322.54834,146.24818 C 322.74219,146.82971 320.39478,147.98794 320.50743,148.32601 L 318.68427,151.17614 L 316.02331,152.2792 L 312.36158,140.64789 L 312.36158,140.64789 z"
       id="path3647"
       sodipodi:nodetypes="cscccc" />
    <path
       style="fill:#b0e0e6;stroke:none"
       d="M 288.6327,149.37977 L 286.42315,93.03622 C 285.16099,80.06485 312.43289,78.16967 315.14734,89.72188 L 317.35688,152.69411 C 315.25627,159.99092 287.65507,159.11046 288.6327,149.37977 L 288.6327,149.37977 z"
       id="path3649"
       sodipodi:nodetypes="ccccc" />
    <path
       style="fill:none;stroke:#696969;stroke-width:0.54683673px;stroke-linecap:butt;stroke-linejoin:miter;stroke-opacity:1"
       d="M 284.01931,144.87865 L 282.01778,141.089 L 321.1446,128.29699 L 328.18814,129.17735"
       id="path3651"
       sodipodi:nodetypes="cccc" />
    <path
       sodipodi:nodetypes="ccccc"
       id="path3653"
       d="M 291.19638,153.97504 L 289.31307,125.78916 C 286.30947,119.24645 311.29925,118.13672 313.79654,124.1312 L 315.6799,155.63306 C 313.88939,159.28319 290.36311,158.8428 291.19638,153.97504 z"
       style="fill:#adff2f;stroke:none" />
    <path
       sodipodi:type="arc"
       style="fill:#d9ff9f;fill-opacity:1;stroke:none"
       id="path3655"
       sodipodi:cx="1287.1428"
       sodipodi:cy="620.57648"
       sodipodi:rx="20.714285"
       sodipodi:ry="9.6428576"
       d="M 1307.8571,620.57648 A 20.714285,9.6428576 0 1 1 1266.4285,620.57648 A 20.714285,9.6428576 0 1 1 1307.8571,620.57648 z"
       transform="matrix(0.5989931,0,0,0.5051877,-468.38285,-187.53188)" />
    <path
       transform="matrix(0.5468367,0,0,0.5468367,-439.41015,-215.76393)"
       d="M 1372.0419,559.14624 A 5.2327042,3.4884696 0 1 1 1361.5765,559.14624 A 5.2327042,3.4884696 0 1 1 1372.0419,559.14624 z"
       sodipodi:ry="3.4884696"
       sodipodi:rx="5.2327042"
       sodipodi:cy="559.14624"
       sodipodi:cx="1366.8092"
       id="path3657"
       style="opacity:0.98999999;fill:#eaffc9;fill-opacity:1;stroke:none;stroke-width:2;stroke-linecap:round;stroke-linejoin:round;stroke-miterlimit:4;stroke-dasharray:none;stroke-opacity:1"
       sodipodi:type="arc" />
    <path
       sodipodi:type="arc"
       style="fill:#ffffff;fill-opacity:1;stroke:none"
       id="path3659"
       sodipodi:cx="1303.2048"
       sodipodi:cy="585.3985"
       sodipodi:rx="4.1359076"
       sodipodi:ry="3.3481157"
       d="M 1307.3407,585.3985 A 4.1359076,3.3481157 0 1 1 1299.0689,585.3985 A 4.1359076,3.3481157 0 1 1 1307.3407,585.3985 z"
       transform="matrix(0.3715258,0,0,0.3715258,-174.36865,-128.80198)" />
    <path
       style="fill:#f3f4fc;fill-opacity:1;stroke:none"
       d="M 289.15313,150.98342 C 289.89787,153.7865 292.85584,155.79978 294.28839,155.77595 L 290.82631,101.71569 L 289.15313,150.98342 z"
       id="path3661"
       sodipodi:nodetypes="cccc" />
    <path
       transform="matrix(0.2222965,0,0,0.1163912,-22.64565,64.50408)"
       d="M 1750.5943,627.08795 A 98.994949,98.994949 0 1 1 1552.6044,627.08795 A 98.994949,98.994949 0 1 1 1750.5943,627.08795 z"
       sodipodi:ry="98.994949"
       sodipodi:rx="98.994949"
       sodipodi:cy="627.08795"
       sodipodi:cx="1651.5994"
       id="path3663"
       style="fill:#d3d3d3;stroke:none"
       sodipodi:type="arc" />
    <path
       transform="matrix(0.1929564,0,0,0.1010292,25.81245,74.13748)"
       sodipodi:type="arc"
       style="fill:#c0c0c0;stroke:none"
       id="path3665"
       sodipodi:cx="1651.5994"
       sodipodi:cy="627.08795"
       sodipodi:rx="98.994949"
       sodipodi:ry="98.994949"
       d="M 1750.5943,627.08795 A 98.994949,98.994949 0 1 1 1552.6044,627.08795 A 98.994949,98.994949 0 1 1 1750.5943,627.08795 z" />
    <path
       sodipodi:type="arc"
       style="fill:#808080;stroke:none"
       id="path3667"
       sodipodi:cx="1651.5994"
       sodipodi:cy="627.08795"
       sodipodi:rx="98.994949"
       sodipodi:ry="98.994949"
       d="M 1750.5943,627.08795 A 98.994949,98.994949 0 1 1 1552.6044,627.08795 A 98.994949,98.994949 0 1 1 1750.5943,627.08795 z"
       transform="matrix(0.1636163,0,0,8.566711e-2,74.27055,83.77088)" />
    <path
       d="M 1750.5943,627.08795 A 98.994949,98.994949 0 1 1 1552.6044,627.08795 A 98.994949,98.994949 0 1 1 1750.5943,627.08795 z"
       sodipodi:ry="98.994949"
       sodipodi:rx="98.994949"
       sodipodi:cy="627.08795"
       sodipodi:cx="1651.5994"
       id="path3669"
       style="fill:#696969;stroke:none"
       sodipodi:type="arc"
       transform="matrix(0.1420211,0,0,7.4360222e-2,109.93715,90.86121)" />
    <path
       sodipodi:nodetypes="cscccc"
       id="path3671"
       d="M 354.39873,127.24467 C 354.39873,127.24467 363.93928,130.90642 364.58547,132.84496 C 364.77933,133.42659 362.43192,134.58482 362.54457,134.92279 L 360.72142,137.77291 L 358.06045,138.87608 L 354.39873,127.24467 L 354.39873,127.24467 z"
       style="fill:#696969;stroke:none" />
    <path
       sodipodi:nodetypes="ccccc"
       id="path3673"
       d="M 330.66984,135.97665 L 328.4603,79.63299 C 327.19814,66.66173 354.47003,64.76644 357.18448,76.31865 L 359.39403,139.29099 C 357.29341,146.58769 329.6922,145.70733 330.66984,135.97665 L 330.66984,135.97665 z"
       style="fill:#b0e0e6;stroke:none" />
    <path
       style="fill:#1e90ff;stroke:none"
       d="M 333.23353,139.5767 L 331.35022,104.50169 C 328.34661,96.35976 353.33639,94.97887 355.83368,102.43851 L 357.71704,141.63988 C 355.92653,146.18225 332.40026,145.63414 333.23353,139.5767 z"
       id="path3675"
       sodipodi:nodetypes="ccccc" />
    <path
       transform="matrix(0.5989931,0,0,0.5051877,-428.34575,-210.435)"
       d="M 1307.8571,620.57648 A 20.714285,9.6428576 0 1 1 1266.4285,620.57648 A 20.714285,9.6428576 0 1 1 1307.8571,620.57648 z"
       sodipodi:ry="9.6428576"
       sodipodi:rx="20.714285"
       sodipodi:cy="620.57648"
       sodipodi:cx="1287.1428"
       id="path3677"
       style="fill:#00bfff;stroke:none"
       sodipodi:type="arc" />
    <path
       transform="matrix(0.5468367,0,0,0.5468367,-360.07235,-244.24481)"
       d="M 1307.3407,585.3985 A 4.1359076,3.3481157 0 1 1 1299.0689,585.3985 A 4.1359076,3.3481157 0 1 1 1307.3407,585.3985 z"
       sodipodi:ry="3.3481157"
       sodipodi:rx="4.1359076"
       sodipodi:cy="585.3985"
       sodipodi:cx="1303.2048"
       id="path3679"
       style="fill:#ffffff;fill-opacity:1;stroke:none"
       sodipodi:type="arc" />
    <path
       sodipodi:nodetypes="ccccc"
       id="path3681"
       d="M 330.95119,81.64919 L 331.19027,137.5803 C 331.935,140.38337 333.30198,140.62889 334.73453,140.60495 L 333.21701,84.2466 C 332.29778,83.90145 331.50464,82.94784 330.95119,81.64919 z"
       style="fill:#f3f4fc;fill-opacity:1;stroke:none" />
    <path
       id="path3683"
       d="M 304.57031,184.37335 L 402.79125,131.81657 L 404.94524,132.67813 L 307.5859,186.09658 L 304.57031,184.37335 L 304.57031,184.37335 z"
       style="fill:#dcdcdc;fill-opacity:1;stroke:none;stroke-width:1px;stroke-linecap:butt;stroke-linejoin:miter;stroke-opacity:1" />
    <path
       sodipodi:type="arc"
       style="fill:#ffffff;fill-opacity:1;stroke:none"
       id="path3685"
       sodipodi:cx="1303.2048"
       sodipodi:cy="585.3985"
       sodipodi:rx="4.1359076"
       sodipodi:ry="3.3481157"
       d="M 1307.3407,585.3985 A 4.1359076,3.3481157 0 1 1 1299.0689,585.3985 A 4.1359076,3.3481157 0 1 1 1307.3407,585.3985 z"
       transform="matrix(0.5468367,0,0,0.5468367,-360.07235,-244.24481)" />
    <path
       id="path4603"
       d="M 233.36027,280.86989 L 231.11027,282.74489 L 269.98527,303.74488 L 269.23527,300.36989 L 233.36027,280.86989 z"
       style="fill:#c0c0c0;fill-opacity:1;fill-rule:evenodd;stroke:none;stroke-width:1px;stroke-linecap:butt;stroke-linejoin:miter;stroke-opacity:1"
       sodipodi:nodetypes="ccccc" />
    <path
       sodipodi:nodetypes="ccccc"
       id="path3687"
       d="M 236.83972,206.48401 L 261.81828,212.88094 L 264.55986,294.51831 L 239.58128,281.41977 L 236.83972,206.48401 L 236.83972,206.48401 z"
       style="fill:#202020;fill-opacity:1;stroke:none;stroke-width:1px;stroke-linecap:butt;stroke-linejoin:miter;stroke-opacity:1" />
    <path
       sodipodi:nodetypes="ccc"
       id="path3689"
       d="M 238.22814,238.00711 L 246.84398,240.59189 L 247.98408,285.25298"
       style="fill:none;stroke:#382929;stroke-width:1.6405102;stroke-linecap:butt;stroke-linejoin:miter;stroke-opacity:1" />
    <path
       sodipodi:nodetypes="ccc"
       style="fill:none;stroke:#382929;stroke-width:1.6405102;stroke-linecap:butt;stroke-linejoin:miter;stroke-opacity:1"
       d="M 239.14201,263.44269 L 252.32712,266.78898 L 253.05334,287.59228"
       id="path3691" />
    <path
       style="fill:#e4e4e4;fill-opacity:1;fill-rule:evenodd;stroke:none;stroke-width:1px;stroke-linecap:butt;stroke-linejoin:miter;stroke-opacity:1"
       d="M 230.48527,282.99489 L 226.98527,285.74489 L 269.48527,310.36988 L 269.48527,304.24489 L 230.48527,282.99489 z"
       id="path4601" />
    <path
       style="fill:none;stroke:#382929;stroke-width:1.6405102;stroke-linecap:butt;stroke-linejoin:miter;stroke-opacity:1"
       d="M 237.31426,213.33314 L 259.02866,218.65956 L 262.08263,292.61834"
       id="path3693"
       sodipodi:nodetypes="ccc" />
    <path
       transform="matrix(0.6034228,0,0,0.5468367,-511.34215,-215.76393)"
       d="M 1271.195,813.66498 A 11.419587,13.647799 0 1 1 1248.3558,813.66498 A 11.419587,13.647799 0 1 1 1271.195,813.66498 z"
       sodipodi:ry="13.647799"
       sodipodi:rx="11.419587"
       sodipodi:cy="813.66498"
       sodipodi:cx="1259.7754"
       id="path3695"
       style="fill:#4b0082;stroke:none"
       sodipodi:type="arc" />
    <path
       transform="matrix(0.5468367,0,0,0.5468367,-439.41015,-215.76393)"
       sodipodi:type="arc"
       style="fill:#8b0000;stroke:none"
       id="path3697"
       sodipodi:cx="1259.7754"
       sodipodi:cy="813.66498"
       sodipodi:rx="11.419587"
       sodipodi:ry="11.419586"
       d="M 1271.195,813.66498 A 11.419587,11.419586 0 1 1 1248.3558,813.66498 A 11.419587,11.419586 0 1 1 1271.195,813.66498 z" />
    <path
       transform="matrix(0.4713885,0,0,0.4713885,-345.33925,-154.6421)"
       d="M 1271.195,813.66498 A 11.419587,11.419586 0 1 1 1248.3558,813.66498 A 11.419587,11.419586 0 1 1 1271.195,813.66498 z"
       sodipodi:ry="11.419586"
       sodipodi:rx="11.419587"
       sodipodi:cy="813.66498"
       sodipodi:cx="1259.7754"
       id="path3699"
       style="fill:#ff0000;stroke:none"
       sodipodi:type="arc" />
    <path
       transform="matrix(0.5468367,0,0,0.5468367,-439.41015,-216.06851)"
       d="M 1266.1815,812.27234 A 4.4564242,3.8993711 0 1 1 1257.2687,812.27234 A 4.4564242,3.8993711 0 1 1 1266.1815,812.27234 z"
       sodipodi:ry="3.8993711"
       sodipodi:rx="4.4564242"
       sodipodi:cy="812.27234"
       sodipodi:cx="1261.7251"
       id="path3701"
       style="fill:#a52a2a;fill-opacity:1;stroke:none"
       sodipodi:type="arc" />
    <path
       transform="matrix(0.5468367,0,0,0.5468367,-439.41015,-215.76393)"
       d="M 1260.6109,810.32263 A 2.785265,3.0637915 0 1 1 1255.0404,810.32263 A 2.785265,3.0637915 0 1 1 1260.6109,810.32263 z"
       sodipodi:ry="3.0637915"
       sodipodi:rx="2.785265"
       sodipodi:cy="810.32263"
       sodipodi:cx="1257.8257"
       id="path3703"
       style="fill:#ffffff;fill-opacity:1;stroke:none"
       sodipodi:type="arc" />
    <path
       sodipodi:nodetypes="ccc"
       id="path3705"
       d="M 189.01524,301.34597 L 216.68846,320.50409 L 249.21337,309.30351"
       style="fill:none;stroke:#000000;stroke-width:4.37469387;stroke-linecap:butt;stroke-linejoin:miter;stroke-opacity:1" />
    <path
       sodipodi:nodetypes="cccccccc"
       id="path3707"
       d="M 118.61532,295.47715 C 118.67,295.54249 117.70637,299.49414 117.37947,300.77009 L 118.67109,320.05035 L 150.85041,335.13818 L 220.37151,286.44799 L 221.80227,271.30613 L 196.85947,261.92745 L 118.61532,295.47715 z"
       style="fill:#dcdcdc;fill-opacity:1;stroke:none" />
    <path
       sodipodi:nodetypes="cccccc"
       id="path3709"
       d="M 148.69448,313.27573 L 150.50481,335.03257 L 222.02658,288.04379 L 221.92048,271.11845 L 150.29312,309.47314 L 148.69448,313.27573 z"
       style="fill:#a9a9a9;fill-opacity:1;stroke:none" />
    <path
       sodipodi:nodetypes="ccccc"
       id="path3711"
       d="M 146.51083,309.25071 L 118.73518,295.93172 L 117.5287,300.69613 L 146.72623,310.97383 L 146.51083,309.25071 L 146.51083,309.25071 z"
       style="fill:#d3d3d3;stroke:none" />
    <path
       sodipodi:nodetypes="cccccc"
       id="path3713"
       d="M 119.37083,296.11149 L 148.66476,309.25071 L 220.58565,271.24079 L 196.95643,262.39472 L 119.37083,296.11149 L 119.37083,296.11149 z"
       style="fill:#f5f5f5;stroke:none" />
    <path
       sodipodi:nodetypes="ccccc"
       id="path3715"
       d="M 298.81555,306.61912 L 251.2515,370.02314 L 211.45315,365.08341 L 267.95129,302.62023 L 298.81555,306.61912 z"
       style="fill:#dcdcdc;stroke:none;stroke-width:1px;stroke-linecap:butt;stroke-linejoin:miter;stroke-opacity:1" />
    <path
       transform="matrix(0.7782162,0,0,0.7782162,-718.89165,-444.33282)"
       d="M 1214.7751,981.46094 A 14.180255,14.180255 0 1 1 1186.4146,981.46094 A 14.180255,14.180255 0 1 1 1214.7751,981.46094 z"
       sodipodi:ry="14.180255"
       sodipodi:rx="14.180255"
       sodipodi:cy="981.46094"
       sodipodi:cx="1200.5948"
       id="path3717"
       style="fill:#000000;fill-opacity:1;stroke:none"
       sodipodi:type="arc" />
    <path
       sodipodi:nodetypes="cccc"
       id="path3719"
       d="M 245.14659,327.29476 L 280.67868,330.87095 L 282.06951,332.93399 L 284.37115,356.88549"
       style="fill:none;fill-opacity:1;stroke:#808080;stroke-width:0.54683673px;stroke-linecap:butt;stroke-linejoin:miter;stroke-opacity:1" />
    <path
       sodipodi:nodetypes="cccc"
       id="path3721"
       d="M 209.2358,266.99079 L 136.96333,301.92041 L 134.22177,304.96664 L 134.16817,327.59205"
       style="fill:none;stroke:#c0c0c0;stroke-width:0.54683673px;stroke-linecap:butt;stroke-linejoin:miter;stroke-opacity:1" />
    <path
       id="path3723"
       d="M 178.69583,281.81568 L 193.01283,284.8619 L 194.53594,286.6896 L 194.58485,306.19302"
       style="fill:none;stroke:#c0c0c0;stroke-width:0.54683673px;stroke-linecap:butt;stroke-linejoin:miter;stroke-opacity:1"
       sodipodi:nodetypes="cccc" />
    <path
       id="path3725"
       d="M 415.93048,381.89219 L 418.40754,381.99995 L 409.79163,408.92454 L 408.60697,409.35527 L 415.93048,381.89219 L 415.93048,381.89219 z"
       style="fill:#daa520;fill-opacity:1;stroke:none;stroke-width:1px;stroke-linecap:butt;stroke-linejoin:miter;stroke-opacity:1" />
    <path
       sodipodi:nodetypes="cccccccc"
       id="path3727"
       d="M 407.68784,412.44926 L 414.77337,380.88805 L 411.26815,376.83039 L 417.51494,371.61121 L 421.21118,378.48756 L 416.83068,381.70646 L 408.42794,411.47234 L 407.68784,412.44926 z"
       style="fill:#8fbc8f;fill-opacity:1;stroke:none;stroke-width:1px;stroke-linecap:butt;stroke-linejoin:miter;stroke-opacity:1" />
    <path
       sodipodi:nodetypes="ccccc"
       id="path3729"
       d="M 395.6832,372.84556 L 410.76096,380.38449 L 411.83796,379.0921 L 397.02082,374.29481 L 395.6832,372.84556 z"
       style="fill:#b8860b;fill-opacity:1;stroke:none;stroke-width:1px;stroke-linecap:butt;stroke-linejoin:miter;stroke-opacity:1" />
    <path
       style="fill:none;stroke:#594949;stroke-width:0.54683673px;stroke-linecap:butt;stroke-linejoin:miter;stroke-opacity:1"
       d="M 367.68013,292.04365 L 344.49809,302.19582 L 344.1182,312.27803 L 374.65131,327.97481 L 374.12093,338.85612"
       id="path3731"
       sodipodi:nodetypes="ccccc" />
    <path
       sodipodi:nodetypes="ccsc"
       id="path3733"
       d="M 244.01739,416.62088 C 242.0533,418.31242 241.57974,420.34204 240.57374,423.56235 C 240.6007,425.24447 240.68637,426.61729 240.87984,426.54998 C 241.37337,426.37879 243.94498,416.88795 244.01739,416.62088 z"
       style="fill:#2b2a31;fill-opacity:1;stroke:none" />
    <path
       id="path3735"
       d="M 205.68053,317.91921 C 205.42132,318.71266 205.25394,319.55028 205.25394,320.41739 C 205.25394,325.38623 209.82068,329.399 215.44758,329.399 C 221.01338,329.399 225.54355,325.47036 225.6411,320.576 C 224.42855,324.34808 220.51194,327.09907 215.85163,327.09907 C 210.22479,327.09907 205.65822,323.0863 205.65822,318.11747 C 205.65822,318.05131 205.67927,317.98516 205.67997,317.91921 L 205.68053,317.91921 z"
       style="fill:#696969;fill-opacity:1;stroke:none" />
    <path
       style="fill:#696969;fill-opacity:1;stroke:none"
       d="M 340.1321,342.28011 C 339.87274,342.73137 339.69185,343.21514 339.65613,343.72793 C 339.45133,346.66559 343.27866,349.35112 348.19824,349.73661 C 353.06443,350.11794 357.18707,348.10557 357.47406,345.21844 C 356.25853,347.36563 352.72085,348.7238 348.64626,348.40444 C 343.72672,348.01894 339.89963,345.33352 340.10442,342.39575 C 340.10442,342.35631 340.12861,342.31899 340.13142,342.28011 L 340.1321,342.28011 z"
       id="path3737" />
    <path
       sodipodi:nodetypes="ccccc"
       id="path3739"
       d="M 210.14829,379.15343 L 256.17138,387.35329 L 294.66206,327.39688 L 295.52366,329.98156 L 302.84718,319.64253"
       style="fill:none;stroke:#000000;stroke-width:0.54683673px;stroke-linecap:butt;stroke-linejoin:miter;stroke-opacity:1" />
    <path
       sodipodi:nodetypes="cccc"
       id="path3741"
       d="M 210.09459,373.51122 L 241.79926,377.47725 L 246.39284,391.72742 L 210.01481,386.08494"
       style="fill:none;stroke:#000000;stroke-width:0.54683673px;stroke-linecap:butt;stroke-linejoin:miter;stroke-opacity:1" />
    <path
       sodipodi:nodetypes="cc"
       id="path3743"
       d="M 210.12308,379.6161 L 255.66287,387.73112"
       style="fill:none;stroke:#a9a9a9;stroke-width:0.54683673px;stroke-linecap:butt;stroke-linejoin:miter;stroke-opacity:1" />
    <path
       id="path3745"
       d="M 109.90125,226.91973 C 115.13404,230.0278 118.37723,234.31741 118.37723,239.05265 C 118.37723,248.54316 105.37305,256.24378 89.34355,256.24378 C 73.31415,256.24378 60.32705,248.54316 60.32705,239.05265 C 60.32705,238.34302 60.40815,237.65486 60.54925,236.96784 C 55.21975,240.74362 52.10745,245.30946 52.10745,250.21153 C 52.10745,263.26785 74.18715,273.84509 101.42525,273.84509 C 128.66339,273.84509 150.74313,263.26785 150.74313,250.21153 C 150.74313,238.54005 133.10195,228.84532 109.90125,226.91973 z"
       style="fill:url(#linearGradient4734);fill-opacity:1;stroke:none" />
    <path
       style="fill:#000000;stroke:none"
       d="M 156.91893,241.83045 C 157.26929,240.66041 155.04438,236.30197 153.96175,234.85847 C 129.49032,206.83667 62.38555,208.41156 45.63845,238.26505 C 70.78055,211.7564 131.24446,208.93022 156.91893,241.83045 L 156.91893,241.83045 z"
       id="path3747"
       sodipodi:nodetypes="cccc" />
    <path
       id="path3749"
       d="M 273.99224,104.08908 C 273.08821,105.6424 270.19736,106.77618 267.02007,107.30172 C 263.84279,107.82727 260.38552,107.76666 258.45863,107.18205 L 258.30486,107.71191 C 260.39121,108.3448 263.8604,108.38537 267.10554,107.84853 C 270.35063,107.31179 273.38176,106.23368 274.47072,104.36254 L 273.99224,104.08908 z"
       style="font-size:medium;font-style:normal;font-variant:normal;font-weight:normal;font-stretch:normal;text-indent:0;text-align:start;text-decoration:none;line-height:normal;letter-spacing:normal;word-spacing:normal;text-transform:none;direction:ltr;block-progression:tb;writing-mode:lr-tb;text-anchor:start;fill:#fff5ee;fill-opacity:1;stroke:none;stroke-width:1px;marker:none;visibility:visible;display:inline;overflow:visible;enable-background:accumulate;font-family:Andale Mono;-inkscape-font-specification:Andale Mono" />
    <path
       transform="matrix(0.5468367,0,0,0.5468367,-439.41015,-216.19476)"
       d="M 1307.3407,585.3985 A 4.1359076,3.3481157 0 1 1 1299.0689,585.3985 A 4.1359076,3.3481157 0 1 1 1307.3407,585.3985 z"
       sodipodi:ry="3.3481157"
       sodipodi:rx="4.1359076"
       sodipodi:cy="585.3985"
       sodipodi:cx="1303.2048"
       id="path3751"
       style="fill:#ffffff;fill-opacity:1;stroke:none"
       sodipodi:type="arc" />
    <path
       sodipodi:nodetypes="ccc"
       style="fill:none;stroke:#c0c0c0;stroke-width:0.54683673px;stroke-linecap:butt;stroke-linejoin:miter;stroke-opacity:1"
       d="M 146.96189,283.53579 L 153.97991,285.74226 L 141.99177,299.50002"
       id="path3753" />
    <path
       transform="matrix(0.3391354,0,0,0.3671602,-250.05925,-58.55935)"
       sodipodi:type="arc"
       style="fill:url(#linearGradient4129);fill-opacity:1;stroke:none"
       id="path3755"
       sodipodi:cx="1058.5714"
       sodipodi:cy="813.79077"
       sodipodi:rx="91.428574"
       sodipodi:ry="50"
       d="M 1150,813.79077 A 91.428574,50 0 1 1 967.14284,813.79077 A 91.428574,50 0 1 1 1150,813.79077 z" />
    <path
       d="M 1150,813.79077 A 91.428574,50 0 1 1 967.14284,813.79077 A 91.428574,50 0 1 1 1150,813.79077 z"
       sodipodi:ry="50"
       sodipodi:rx="91.428574"
       sodipodi:cy="813.79077"
       sodipodi:cx="1058.5714"
       id="path3757"
       style="fill:#fffaf0;fill-opacity:1;stroke:none"
       sodipodi:type="arc"
       transform="matrix(0.1009874,0,0,0.1093326,-24.65505,166.43117)" />
    <path
       transform="matrix(0.5468367,0,0,0.7500885,-433.54055,-363.7414)"
       d="M 1114.1635,759.86743 A 25.224318,14.490566 0 1 1 1063.7149,759.86743 A 25.224318,14.490566 0 1 1 1114.1635,759.86743 z"
       sodipodi:ry="14.490566"
       sodipodi:rx="25.224318"
       sodipodi:cy="759.86743"
       sodipodi:cx="1088.9392"
       id="path3759"
       style="opacity:0.98999999;fill:#000000;fill-opacity:1;stroke:none"
       sodipodi:type="arc" />
    <path
       sodipodi:type="arc"
       style="opacity:0.98999999;fill:#696969;fill-opacity:1;stroke:none"
       id="path3761"
       sodipodi:cx="1088.9392"
       sodipodi:cy="759.86743"
       sodipodi:rx="25.224318"
       sodipodi:ry="14.490566"
       d="M 1114.1635,759.86743 A 25.224318,14.490566 0 1 1 1063.7149,759.86743 A 25.224318,14.490566 0 1 1 1114.1635,759.86743 z"
       transform="matrix(0.5098149,0,0,0.4570749,-393.18305,-145.48246)" />
    <path
       id="path3763"
       d="M 149.50913,201.38379 L 174.49536,202.37345"
       style="fill:#2f4f4f;stroke:#000000;stroke-width:0.89834899;stroke-linecap:butt;stroke-linejoin:miter;stroke-opacity:1" />
    <path
       id="path3765"
       d="M 168.76943,196.43509 L 153.67352,208.80674"
       style="fill:#2f4f4f;stroke:#000000;stroke-width:0.89834899;stroke-linecap:butt;stroke-linejoin:miter;stroke-opacity:1" />
    <path
       sodipodi:nodetypes="ccc"
       id="path3767"
       d="M 137.47035,287.3428 L 169.04082,299.53071 L 169.4969,322.63506"
       style="fill:none;stroke:#000000;stroke-width:0.54683673px;stroke-linecap:butt;stroke-linejoin:miter;stroke-opacity:1" />
    <path
       id="path3769"
       d="M 283.43234,170.99838 L 298.69335,175.10709 L 329.21531,160.43315 L 316.59563,158.37874"
       style="fill:none;fill-opacity:1;stroke:#d3d3d3;stroke-width:0.54683673px;stroke-linecap:butt;stroke-linejoin:miter;stroke-opacity:1" />
    <path
       sodipodi:nodetypes="cccc"
       style="fill:none;stroke:#696969;stroke-width:0.54683673px;stroke-linecap:butt;stroke-linejoin:miter;stroke-opacity:1"
       d="M 285.0465,171.14517 L 298.25315,174.9604 L 327.60116,160.72654 L 318.94348,158.81892"
       id="path3771" />
    <path
       id="path3773"
       d="M 275.81408,116.03689 C 275.5334,116.07952 275.33199,116.32976 275.35037,116.61308 L 276.05694,143.89443 C 276.05901,144.09187 276.16728,144.27277 276.34024,144.36789 C 276.51316,144.46292 276.72396,144.45747 276.89174,144.35362 C 277.05956,144.24966 277.15832,144.06342 277.15022,143.86618 L 276.44366,116.58483 C 276.44578,116.42406 276.37705,116.27049 276.25576,116.16499 C 276.13453,116.05949 275.97299,116.01265 275.81408,116.03699 L 275.81408,116.03689 z"
       style="font-size:medium;font-style:normal;font-variant:normal;font-weight:normal;font-stretch:normal;text-indent:0;text-align:start;text-decoration:none;line-height:normal;letter-spacing:normal;word-spacing:normal;text-transform:none;direction:ltr;block-progression:tb;writing-mode:lr-tb;text-anchor:start;fill:#ff0000;fill-opacity:1;stroke:none;stroke-width:2;marker:none;visibility:visible;display:inline;overflow:visible;enable-background:accumulate;font-family:Andale Mono;-inkscape-font-specification:Andale Mono" />
    <path
       style="font-size:medium;font-style:normal;font-variant:normal;font-weight:normal;font-stretch:normal;text-indent:0;text-align:start;text-decoration:none;line-height:normal;letter-spacing:normal;word-spacing:normal;text-transform:none;direction:ltr;block-progression:tb;writing-mode:lr-tb;text-anchor:start;fill:#1e90ff;fill-opacity:1;stroke:none;stroke-width:2;marker:none;visibility:visible;display:inline;overflow:visible;enable-background:accumulate;font-family:Andale Mono;-inkscape-font-specification:Andale Mono"
       d="M 355.05384,95.53224 C 354.77314,95.55895 354.57175,95.71575 354.59011,95.89322 L 355.29668,112.98756 C 355.29877,113.11121 355.40704,113.22462 355.58,113.28416 C 355.75292,113.34377 355.96372,113.34035 356.13149,113.27521 C 356.29931,113.21014 356.39808,113.09338 356.38998,112.96986 L 355.68341,95.87552 C 355.68554,95.77485 355.61681,95.67861 355.49552,95.61251 C 355.37428,95.5464 355.21275,95.51705 355.05384,95.53224 L 355.05384,95.53224 z"
       id="path3775" />
    <path
       id="path3929"
       d="M 496.28312,502.63263 C 515.1372,500.34793 549.70299,491.20873 549.70299,491.20873 L 559.13003,503.77503 L 522.99305,512.91413 L 480.5714,522.05333 L 447.57679,514.05653 L 496.28312,502.63263 z"
       style="fill:#b8b6a9;fill-opacity:1;fill-rule:evenodd;stroke:none;stroke-width:1px;stroke-linecap:butt;stroke-linejoin:miter;stroke-opacity:1" />
    <path
       sodipodi:nodetypes="csccsssscccccc"
       d="M 240.85204,425.69434 C 263.22747,451.25279 285.57231,591.15303 224.93595,555.58573 C 185.59918,532.51213 300.52996,471.09653 302.21186,483.30893 L 297.98355,565.14733 C 297.98355,565.14733 284.96572,519.20123 309.0383,506.75003 C 333.11087,494.29863 383.44149,518.65063 380.16233,530.28353 C 373.25327,554.79343 322.92094,575.90033 328.49222,548.56513 C 332.6664,528.08503 360.63544,506.04666 370.00319,509.90846 C 394.70916,520.09366 350.94397,541.62153 363.39529,561.54373 C 366.26936,600.83279 404.57743,553.98423 409.02787,508.48423 L 399.97975,575.20983 L 426.87306,539.71663 L 426.81412,580.08883 L 476.51156,525.83093"
       style="fill:none;stroke:#322e39;stroke-width:3;stroke-linecap:round;stroke-linejoin:round;stroke-miterlimit:4;stroke-dasharray:none;stroke-opacity:1"
       id="path3777" />
    <path
       sodipodi:nodetypes="csscccscsccssccssscc"
       d="M 491.69115,476.14543 C 491.69115,476.14543 469.1319,455.86017 457.31339,476.54693 C 446.08174,496.20643 493.61454,566.94583 495.28485,569.28333 C 496.95517,571.62073 464.66276,551.98623 464.66276,551.98623 L 506.7238,518.70773 L 504.74984,579.56803 C 504.74984,579.56803 493.01871,566.96123 508.384,543.11293 C 526.75728,514.59613 534.25834,551.40473 534.25834,551.40473 C 534.25834,551.40473 568.25545,559.20173 565.10316,532.81923 C 563.3401,518.06333 541.04532,504.06292 536.59117,548.47412 C 537.11761,576.28382 567.16263,573.2736 567.16263,573.2736 C 567.16263,573.2736 598.20761,542.10458 600.92351,536.4171 C 606.93551,523.82709 576.67632,498.43431 572.40179,531.69243 C 568.76377,559.99813 596.85676,570.03068 604.65148,569.56328 C 625.79531,569.17808 635.23431,474.70233 614.23874,473.42603 C 609.22786,480.43843 624.29222,557.50923 633.75725,561.24913 C 643.22222,564.98903 652.13048,507.48803 657.69814,518.24023 C 663.2657,528.99243 665.49281,542.54953 673.28753,540.67963 C 681.08225,538.80973 718.94227,467.75153 671.06043,542.08213 C 636.25514,629.48918 621.46748,608.53971 612.0434,599.11563"
       style="fill:none;stroke:#322e39;stroke-width:3;stroke-linecap:round;stroke-linejoin:round;stroke-miterlimit:4;stroke-dasharray:none;stroke-opacity:1"
       id="path249" />
    <path
       sodipodi:nodetypes="ccccc"
       id="path3781"
       d="M 427.82451,341.4444 L 443.80373,329.61565 L 443.38868,327.9555 L 427.61704,337.08647 L 427.82451,341.4444 L 427.82451,341.4444 z"
       style="fill:#d3d3d3;stroke:none;stroke-width:1px;stroke-linecap:butt;stroke-linejoin:miter;stroke-opacity:1" />
    <g
       transform="matrix(0.655414,-6.869732e-2,0,0.655414,-633.82412,-224.91333)"
       id="g3783"
       style="font-size:191.29974365px;font-style:normal;font-weight:normal;fill:#000000;fill-opacity:1;stroke:none;font-family:Bitstream Vera Sans">
      <path
         id="path3785"
         style="font-variant:normal;font-weight:bold;font-stretch:normal;fill:#8fbc8f;fill-opacity:1;font-family:Arial Black;-inkscape-font-specification:'Arial Black, Bold'"
         d="M 1677.07,922.35995 C 1658.9592,906.72855 1649.0906,895.79028 1647.4645,889.54511 C 1645.8759,883.30008 1650.8401,880.17754 1662.358,880.17745 C 1667.8925,880.17754 1673.2379,880.86936 1678.3934,882.25292 C 1683.5059,883.59925 1688.4622,885.37555 1693.262,887.58183 C 1698.0191,889.75086 1702.4408,892.0507 1706.5287,894.48136 C 1710.6102,896.87475 1714.9072,899.67944 1719.4187,902.89542 C 1728.0576,909.02839 1736.233,915.42307 1743.9455,922.07948 C 1761.2327,937.00044 1771.3599,947.92 1774.3272,954.83817 C 1777.2946,961.75647 1772.6077,965.21557 1760.2672,965.21557 C 1753.349,965.21557 1746.4802,964.11237 1739.661,961.90607 C 1732.8411,959.69967 1725.5967,956.46497 1717.9279,952.20179 C 1712.4366,949.17275 1706.0965,945.04053 1698.9092,939.8051 C 1691.7157,934.53232 1684.4361,928.71727 1677.0701,922.35995 M 1699.7972,922.41605 C 1711.9288,932.88691 1721.1418,940.04821 1727.4368,943.89995 C 1733.7265,947.71433 1738.6286,949.62154 1742.1438,949.62154 C 1744.4623,949.62154 1745.5315,948.8175 1745.3512,947.20947 C 1745.165,945.5641 1743.4278,942.98378 1740.1407,939.46855 C 1736.8906,935.95336 1730.9549,930.47489 1722.3324,923.03308 C 1709.681,912.11355 1700.2536,904.78398 1694.0509,901.04434 C 1687.8428,897.26742 1682.8877,895.37893 1679.1856,895.37887 C 1675.4086,895.37893 1674.91,897.30482 1677.6898,901.15652 C 1680.4262,904.97096 1687.7955,912.05746 1699.7972,922.41605" />
      <path
         id="path3787"
         style="font-variant:normal;font-weight:bold;font-stretch:normal;fill:#8fbc8f;fill-opacity:1;font-family:Arial Black;-inkscape-font-specification:'Arial Black, Bold'"
         d="M 1777.5621,940.92697 L 1801.9629,940.92697 L 1828.4792,963.81327 L 1804.0785,963.81327 L 1777.5621,940.92697" />
      <path
         id="path3789"
         style="font-variant:normal;font-weight:bold;font-stretch:normal;fill:#8fbc8f;fill-opacity:1;font-family:Arial Black;-inkscape-font-specification:'Arial Black, Bold'"
         d="M 1861.6606,948.44354 L 1820.0391,948.44354 L 1798.2674,929.65213 L 1782.5669,880.17745 L 1802.4802,880.17745 L 1861.0368,930.71791 L 1871.3581,930.71791 L 1891.8952,948.44354 L 1881.5739,948.44354 L 1899.3817,963.81327 L 1879.4684,963.81327 L 1861.6606,948.44354 M 1841.1235,930.71791 L 1811.163,904.8587 L 1819.1348,930.71791 L 1841.1235,930.71791" />
      <path
         id="path3791"
         style="font-variant:normal;font-weight:bold;font-stretch:normal;fill:#8fbc8f;fill-opacity:1;font-family:Arial Black;-inkscape-font-specification:'Arial Black, Bold'"
         d="M 1879.4689,919.61135 C 1873.6693,917.70421 1868.5818,915.57265 1864.2071,913.21667 C 1858.2372,910.00068 1852.8259,906.2985 1847.9732,902.11011 C 1840.0012,895.22934 1836.7152,889.60127 1838.1154,885.22589 C 1839.2644,881.86035 1843.9895,880.17754 1852.2914,880.17745 C 1863.2858,880.17754 1873.8269,882.2717 1883.9151,886.45995 C 1894.0404,890.64836 1902.7858,895.92117 1910.1519,902.27838 C 1914.4412,905.98063 1917.4015,909.43974 1919.0335,912.65573 C 1920.2363,915.04911 1920.4541,917.36765 1919.6878,919.61135 C 1926.6077,921.74296 1933.1881,924.56634 1939.4304,928.08151 C 1945.7094,931.59675 1951.3187,935.48591 1956.2577,939.749 C 1961.024,943.86257 1964.5331,947.71432 1966.7848,951.30431 C 1969.0311,954.85697 1969.8972,957.60557 1969.383,959.55007 C 1968.9061,961.49467 1967.1307,962.91577 1964.0575,963.81327 C 1961.0644,964.74817 1957.2492,965.21557 1952.6122,965.21557 C 1943.8989,965.21557 1936.0508,964.18717 1929.0683,962.13047 C 1922.0857,960.07367 1915.0798,957.04457 1908.0506,953.04325 C 1901.0206,949.0419 1894.6465,944.57309 1888.9276,939.63681 C 1883.3384,934.81279 1879.7375,930.73664 1878.1253,927.40838 C 1876.4696,924.04279 1876.9175,921.44379 1879.4686,919.61135 M 1871.0162,903.45635 C 1874.3094,906.2985 1877.8531,908.59833 1881.6471,910.35589 C 1885.4349,912.07615 1888.8063,912.93625 1891.7606,912.9362 C 1894.3783,912.93625 1895.5317,912.07615 1895.2217,910.35589 C 1894.9109,908.63573 1893.1745,906.41068 1890.0118,903.68073 C 1886.7191,900.83871 1883.1755,898.53887 1879.3816,896.7812 C 1875.5441,894.98627 1872.2608,894.08877 1869.531,894.0887 C 1866.7637,894.08877 1865.519,894.96757 1865.7977,896.7251 C 1866.0707,898.44538 1867.8105,900.68913 1871.0162,903.45635 M 1910.7919,938.8515 C 1914.9943,942.47892 1919.5423,945.45191 1924.4345,947.77041 C 1929.2839,950.05156 1933.1296,951.19213 1935.9718,951.19213 C 1938.7017,951.19213 1939.8078,950.03288 1939.2909,947.71432 C 1938.7298,945.35841 1936.3699,942.38543 1932.2105,938.79541 C 1928.0081,935.16804 1923.4601,932.19508 1918.5672,929.87651 C 1913.7124,927.558 1909.8448,926.39873 1906.9654,926.3987 C 1904.1233,926.39873 1902.9363,927.52061 1903.4043,929.76432 C 1903.9097,932.0081 1906.3721,935.03716 1910.7919,938.8515" />
    </g>
    <use
       transform="matrix(0.5804068,-0.4675045,0.1168762,0.66284,296.74956,215.98798)"
       id="use3795"
       xlink:href="#outline1"
       class="outline-big"
       style="opacity:0.1;fill:none;stroke:none;stroke-width:16"
       x="0"
       y="0"
       width="744.09448"
       height="1052.3622" />
    <use
       transform="matrix(0.5804068,-0.4675045,0.1168762,0.66284,296.74956,215.98798)"
       id="use3797"
       xlink:href="#outline1"
       class="outline-small"
       style="opacity:0.2;fill:none;stroke:none;stroke-width:8"
       x="0"
       y="0"
       width="744.09448"
       height="1052.3622" />
    <use
       transform="matrix(0.5804068,-0.4675045,0.1168762,0.66284,296.74956,215.98798)"
       id="use3799"
       class="stroke-highlight"
       xlink:href="#outline1"
       clip-path="url(#clipoutline1)"
       style="opacity:0.2;fill:none;stroke:none"
       x="0"
       y="0"
       width="744.09448"
       height="1052.3622" />
    <g
       transform="matrix(0.5468367,0,0,0.5468367,-439.41015,-215.76393)"
       id="g3801">
      <use
         height="1052.3622"
         width="744.09448"
         y="0"
         x="0"
         class="black;"
         xlink:href="#outline1"
         id="use3803"
         transform="matrix(1.156427,-0.7211946,6.6532834e-2,1.2290348,1341.4736,809.47585)"
         style="fill:#373737;fill-opacity:1;stroke:none" />
      <path
         id="path3805"
         class="full-specularity"
         style="opacity:1;fill:#ffffff"
         d="M 1424.0329,777.68166 L 1443.9871,786.32817 C 1445.8216,787.08994 1446.0278,790.89993 1445.0468,792.65513 L 1435.2408,790.3852 L 1434.0358,803.46074 L 1426.0482,803.86821 L 1413.9023,820.20958 L 1408.7744,804.98487 L 1402.9054,824.65364 L 1386.1306,834.98806 C 1382.8926,837.0074 1383.1623,833.15474 1386.3229,827.49906 C 1392.4955,815.64533 1404.6199,794.4894 1408.4211,787.41779 C 1412.3381,780.27405 1419.6303,775.85344 1424.0329,777.68166 z" />
    </g>
    <text
       transform="matrix(1,-0.5764836,0,1,0,0)"
       id="text3807"
       y="389.87302"
       x="296.95102"
       style="font-size:21.86753273px;font-style:normal;font-variant:normal;font-weight:normal;font-stretch:normal;fill:#3a3838;fill-opacity:1;stroke:none;stroke-width:1px;stroke-linecap:butt;stroke-linejoin:miter;stroke-opacity:1;font-family:Droid Sans;-inkscape-font-specification:Droid Sans"
       xml:space="preserve"><tspan
         style="font-style:normal;font-variant:normal;font-weight:bold;font-stretch:normal;fill:#3a3838;fill-opacity:1;font-family:Bitstream Vera Sans;-inkscape-font-specification:Bitstream Vera Sans Bold"
         y="389.87302"
         x="296.95102"
         id="tspan3809"
         sodipodi:role="line">Inkscape</tspan></text>
    <path
       sodipodi:nodetypes="csssssc"
       id="path3811"
       d="M 468.46467,316.31467 C 468.46467,316.31467 493.28342,320.95502 513.13842,321.54466 C 532.99341,322.1343 604.5298,313.36659 619.12906,315.43021 C 633.72832,317.49383 634.31229,315.72504 629.05656,314.84058 C 623.80082,313.95623 624.67677,312.12848 584.38281,313.89728 C 544.08885,315.66609 526.86172,320.93732 511.09451,319.46324 C 495.32732,317.98925 456.78525,313.95623 468.46467,316.31467 z"
       style="fill:#ca8655;fill-opacity:1;fill-rule:evenodd;stroke:none;stroke-width:1px;stroke-linecap:butt;stroke-linejoin:miter;stroke-opacity:1" />
    <path
       transform="matrix(0.5839705,0,0,0.5778353,-494.50275,-247.5902)"
       d="M 2054,1003.3622 A 16,8 0 1 1 2022,1003.3622 A 16,8 0 1 1 2054,1003.3622 z"
       sodipodi:ry="8"
       sodipodi:rx="16"
       sodipodi:cy="1003.3622"
       sodipodi:cx="2038"
       id="path3813"
       style="opacity:1;fill:#ca8655;fill-opacity:1;fill-rule:evenodd;stroke:none;stroke-width:3"
       sodipodi:type="arc" />
    <path
       sodipodi:type="arc"
       style="opacity:1;fill:#817f70;fill-opacity:1;fill-rule:evenodd;stroke:none;stroke-width:4"
       id="path3899"
       sodipodi:cx="-514.06659"
       sodipodi:cy="896.09161"
       sodipodi:rx="6.3639607"
       sodipodi:ry="4.9497476"
       d="M -507.70263,896.09161 A 6.3639607,4.9497476 0 1 1 -520.43055,896.09161 A 6.3639607,4.9497476 0 1 1 -507.70263,896.09161 z"
       transform="translate(1099.0866,-540.22957)" />
    <path
       sodipodi:type="arc"
       style="opacity:1;fill:#817f70;fill-opacity:1;fill-rule:evenodd;stroke:none;stroke-width:4"
       id="path3901"
       sodipodi:cx="-419.66788"
       sodipodi:cy="906.69818"
       sodipodi:rx="8.8388348"
       sodipodi:ry="4.9497476"
       d="M -410.82904,906.69818 A 8.8388348,4.9497476 0 1 1 -428.50671,906.69818 A 8.8388348,4.9497476 0 1 1 -410.82904,906.69818 z"
       transform="translate(1099.0866,-540.22957)" />
    <path
       sodipodi:type="arc"
       style="opacity:1;fill:#817f70;fill-opacity:1;fill-rule:evenodd;stroke:none;stroke-width:4"
       id="path3903"
       sodipodi:cx="-462.09427"
       sodipodi:cy="886.19208"
       sodipodi:rx="6.0104074"
       sodipodi:ry="4.9497476"
       d="M -456.08386,886.19208 A 6.0104074,4.9497476 0 1 1 -468.10468,886.19208 A 6.0104074,4.9497476 0 1 1 -456.08386,886.19208 z"
       transform="translate(1099.0866,-540.22957)" />
    <path
       sodipodi:type="arc"
       style="opacity:1;fill:#817f70;fill-opacity:1;fill-rule:evenodd;stroke:none;stroke-width:4"
       id="path3905"
       sodipodi:cx="-466.33691"
       sodipodi:cy="917.30481"
       sodipodi:rx="8.1317282"
       sodipodi:ry="4.2426405"
       d="M -458.20519,917.30481 A 8.1317282,4.2426405 0 1 1 -474.46864,917.30481 A 8.1317282,4.2426405 0 1 1 -458.20519,917.30481 z"
       transform="translate(1099.0866,-540.22957)" />
    <path
       sodipodi:type="arc"
       style="opacity:1;fill:#b2af96;fill-opacity:1;fill-rule:evenodd;stroke:none;stroke-width:4"
       id="path3907"
       sodipodi:cx="-1030.2545"
       sodipodi:cy="1072.1611"
       sodipodi:rx="10.606602"
       sodipodi:ry="7.0710678"
       d="M -1019.6479,1072.1611 A 10.606602,7.0710678 0 1 1 -1040.8611,1072.1611 A 10.606602,7.0710678 0 1 1 -1019.6479,1072.1611 z"
       transform="translate(1082.0866,-543.22957)" />
    <path
       style="fill:none;fill-opacity:1;stroke:#808080;stroke-width:0.54683673px;stroke-linecap:butt;stroke-linejoin:miter;stroke-opacity:1"
       d="M 274.64659,303.79476 L 264.42868,336.87095 L 274.92306,337.86077 L 276.85355,339.72309 L 279.12115,365.38549"
       id="path3941"
       sodipodi:nodetypes="ccccc" />
    <path
       sodipodi:nodetypes="cccc"
       id="path3943"
       d="M 214.64659,360.29476 L 259.56951,358.43399 L 261.9545,359.50342 L 267.12115,387.38549"
       style="fill:none;fill-opacity:1;stroke:#808080;stroke-width:0.54683673px;stroke-linecap:butt;stroke-linejoin:miter;stroke-opacity:1" />
    <path
       style="fill:url(#linearGradient4617);fill-opacity:1;stroke:none"
       d="M 148.78287,313.36411 L 150.50481,335.03257 L 222.02658,288.04379 L 221.92048,271.11845 L 150.97907,309.18058 L 148.78287,313.36411 z"
       id="path4609"
       sodipodi:nodetypes="cccccc" />
    <path
       style="fill:url(#linearGradient4635);fill-opacity:1;stroke:none;stroke-width:1px;stroke-linecap:butt;stroke-linejoin:miter;stroke-opacity:1"
       d="M 301.04404,308.01461 L 253.37165,369.94683 L 252.62787,373.04396 L 259.6482,399.52817 L 303.37525,323.25919 L 301.04404,308.01461 L 301.04404,308.01461 z"
       id="path4619"
       sodipodi:nodetypes="ccccccc" />
    <path
       style="fill:url(#linearGradient4669);fill-opacity:1;stroke:none;stroke-width:1px;stroke-linecap:butt;stroke-linejoin:miter;stroke-opacity:1"
       d="M 294.27283,202.55989 L 304.63555,185.73498 L 406.94475,131.37241 L 407.33604,167.72443 L 386.76555,197.43959 L 364.06762,290.25078 L 298.12332,327.79032 L 294.27283,202.55989 L 294.27283,202.55989 z"
       id="path4637"
       sodipodi:nodetypes="ccccccccc" />
    <path
       style="fill:#221f31;fill-opacity:1;fill-rule:evenodd;stroke:none;stroke-width:1px;stroke-linecap:butt;stroke-linejoin:miter;stroke-opacity:1"
       d="M 318.98527,319.36988 L 341.11027,331.61988 L 339.86027,332.74488 L 317.98527,320.24488 L 318.98527,319.36988 z"
       id="path4700"
       sodipodi:nodetypes="ccccc" />
    <path
       transform="matrix(5.2650025e-2,0,0,5.7000815e-2,18.558562,203.85671)"
       sodipodi:type="arc"
       style="fill:#fffaf0;fill-opacity:1;stroke:none"
       id="path4736"
       sodipodi:cx="1058.5714"
       sodipodi:cy="813.79077"
       sodipodi:rx="91.428574"
       sodipodi:ry="50"
       d="M 1150,813.79077 A 91.428574,50 0 1 1 967.14284,813.79077 A 91.428574,50 0 1 1 1150,813.79077 z" />
    <path
       transform="translate(1132.9983,-556.6646)"
       d="m -1019.6479,1072.1611 a 10.606602,7.0710678 0 1 1 -21.2132,0 10.606602,7.0710678 0 1 1 21.2132,0 z"
       sodipodi:ry="7.0710678"
       sodipodi:rx="10.606602"
       sodipodi:cy="1072.1611"
       sodipodi:cx="-1030.2545"
       id="path3084"
       style="fill:#b2af96;fill-opacity:1;fill-rule:evenodd;stroke:none"
       sodipodi:type="arc" />
  </g>
  <style
     id="style3332"
     type="text/css">
	.specularity {opacity:0.5;}
	.low-specularity {opacity:0.25;}
	.full-specularity {opacity:1;}
	.black {fill:#000000;}
	.white {fill:#ffffff;}
	.outline-big {stroke-width:16;stroke:none;opacity:0.1;fill:none;}
	.outline-small {stroke-width:8;stroke:none;opacity:0.2;fill:none;}
	.stroke-highlight {fill:none;stroke:none;opacity:0.2;}
       	.base-shadow 	{fill:black;opacity:75;}
	</style>
</svg>
