<?xml version="1.0" encoding="UTF-8" standalone="no"?>
<svg
   xmlns:dc="http://purl.org/dc/elements/1.1/"
   xmlns:cc="http://creativecommons.org/ns#"
   xmlns:rdf="http://www.w3.org/1999/02/22-rdf-syntax-ns#"
   xmlns:svg="http://www.w3.org/2000/svg"
   xmlns="http://www.w3.org/2000/svg"
   xmlns:xlink="http://www.w3.org/1999/xlink"
   xmlns:sodipodi="http://sodipodi.sourceforge.net/DTD/sodipodi-0.dtd"
   xmlns:inkscape="http://www.inkscape.org/namespaces/inkscape"
   sodipodi:docname="d1.svg"
   inkscape:version="0.92.4 5da689c313, 2019-01-14"
   id="svg8"
   version="1.1"
   viewBox="0 0 127 127"
   height="480"
   width="480"
   inkscape:export-xdpi="96"
   inkscape:export-ydpi="96">
  <defs
     id="defs2">
    <linearGradient
       inkscape:collect="always"
       id="linearGradient984">
      <stop
         style="stop-color:#2da39b;stop-opacity:1"
         offset="0"
         id="stop980" />
      <stop
         style="stop-color:#37c89f;stop-opacity:1"
         offset="1"
         id="stop982" />
    </linearGradient>
    <linearGradient
       inkscape:collect="always"
       id="linearGradient976">
      <stop
         style="stop-color:#1f1c17;stop-opacity:1"
         offset="0"
         id="stop972" />
      <stop
         style="stop-color:#000000;stop-opacity:1"
         offset="1"
         id="stop974" />
    </linearGradient>
    <linearGradient
       inkscape:collect="always"
       id="linearGradient968">
      <stop
         style="stop-color:#ffcbb0;stop-opacity:1;"
         offset="0"
         id="stop964" />
      <stop
         style="stop-color:#ff7855;stop-opacity:1"
         offset="1"
         id="stop966" />
    </linearGradient>
    <inkscape:path-effect
       effect="taper_stroke"
       id="path-effect887"
       is_visible="true"
       stroke_width="2.6458333"
       attach_start="1e-07"
       end_offset="0.99999"
       smoothing="0.5"
       jointype="extrapolated"
       miter_limit="100" />
    <inkscape:path-effect
       effect="taper_stroke"
       id="path-effect883"
       is_visible="true"
       stroke_width="2.6458333"
       attach_start="1.2"
       end_offset="1.2"
       smoothing="0.5"
       jointype="extrapolated"
       miter_limit="100" />
    <clipPath
       clipPathUnits="userSpaceOnUse"
       id="clipPath906">
      <rect
         style="fill:#ff9955;stroke:none;stroke-width:2.64583325;stroke-linejoin:bevel;stroke-miterlimit:4;stroke-dasharray:none;stroke-opacity:1"
         id="rect908"
         width="480"
         height="480"
         x="0"
         y="0"
         rx="80" />
    </clipPath>
    <linearGradient
       inkscape:collect="always"
       xlink:href="#linearGradient968"
       id="linearGradient970"
       x1="106.3625"
       y1="127"
       x2="106.3625"
       y2="-112.18333"
       gradientUnits="userSpaceOnUse" />
    <linearGradient
       inkscape:collect="always"
       xlink:href="#linearGradient976"
       id="linearGradient978"
       x1="239.49219"
       y1="240"
       x2="239.49219"
       y2="480"
       gradientUnits="userSpaceOnUse" />
    <linearGradient
       inkscape:collect="always"
       xlink:href="#linearGradient984"
       id="linearGradient1058"
       x1="111.50271"
       y1="8.8277788"
       x2="111.50271"
       y2="75.800026"
       gradientUnits="userSpaceOnUse"
       gradientTransform="translate(-48.00279,0.18708849)" />
  </defs>
  <sodipodi:namedview
     inkscape:window-maximized="1"
     inkscape:window-y="31"
     inkscape:window-x="1920"
     inkscape:window-height="1530"
     inkscape:window-width="2560"
     inkscape:snap-page="true"
     units="px"
     showgrid="false"
     inkscape:document-rotation="0"
     inkscape:current-layer="layer1"
     inkscape:document-units="px"
     inkscape:cy="90.148668"
     inkscape:cx="-4.1039091"
     inkscape:zoom="1"
     inkscape:pageshadow="2"
     inkscape:pageopacity="0.0"
     borderopacity="1.0"
     bordercolor="#666666"
     pagecolor="#ffffff"
     id="base" />
  <metadata
     id="metadata5">
    <rdf:RDF>
      <cc:Work
         rdf:about="">
        <dc:format>image/svg+xml</dc:format>
        <dc:type
           rdf:resource="http://purl.org/dc/dcmitype/StillImage" />
        <dc:title></dc:title>
      </cc:Work>
    </rdf:RDF>
  </metadata>
  <g
     id="layer1"
     inkscape:groupmode="layer"
     inkscape:label="Layer 1">
    <rect
       style="fill:url(#linearGradient970);fill-opacity:1;stroke:none;stroke-width:2.64583325;stroke-linejoin:bevel;stroke-miterlimit:4;stroke-dasharray:none;stroke-opacity:1"
       id="rect889"
       width="127"
       height="127"
       x="0"
       y="0"
       rx="21.166666" />
    <path
       id="path898"
       style="fill:url(#linearGradient978);fill-opacity:1;stroke:none;stroke-width:0.99999899;stroke-linejoin:bevel;stroke-opacity:1"
       d="M 239.49219,240 A 240,240 0 0 0 0,480 h 480 a 240,240 0 0 0 -240,-240 240,240 0 0 0 -0.50781,0 z"
       transform="scale(0.26458333)"
       inkscape:connector-curvature="0"
       clip-path="url(#clipPath906)" />
    <path
       style="fill:#37c89f;fill-opacity:1;fill-rule:nonzero;stroke:none;stroke-width:2.64583325;stroke-linecap:butt;stroke-linejoin:miter;stroke-miterlimit:4;stroke-dasharray:none;stroke-opacity:1"
       d="m 60.112328,87.728797 c -0.522399,0.794837 -1.064129,1.573701 -1.619601,2.3437 0,0 -1e-6,10e-7 -1e-6,10e-7 -1.726401,2.401831 -3.882214,4.898037 -5.336723,6.61662 0,0 0,0 0,0 -1.874932,2.115775 -3.047053,3.578692 -3.047053,3.578692 0,0 1.574138,-1.015193 3.881969,-2.673811 0,0 0,0 0,0 1.874647,-1.409929 4.380992,-3.425141 6.504477,-5.962499 0,0 10e-7,-10e-7 10e-7,-10e-7 0.644357,-0.771366 1.26077,-1.58732 1.827646,-2.449027 0.291377,-0.443119 0.549846,-0.859443 0.778888,-1.247737 0.01866,0.07402 0.03755,0.148707 0.05667,0.224018 0.56866,2.23983 1.332838,5.022563 2.152679,7.271858 0.334123,0.935295 0.732587,1.921039 1.324605,2.87453 1.587935,2.508499 3.330564,4.681379 5.121302,6.516969 1.98137,2.0463 3.70647,3.35573 5.243567,4.23772 1.440638,0.82663 2.378291,1.10219 2.378291,1.10219 0,0 -0.836418,-0.51036 -2.027433,-1.58721 -1.324008,-1.19711 -2.572998,-2.6376 -4.235361,-4.9029 -1.467477,-2.01799 -2.847893,-4.200511 -4.273222,-6.696169 -0.409199,-0.708771 -0.709226,-1.546145 -1.045893,-2.451195 -0.75946,-2.083635 -1.516414,-4.82042 -2.074061,-7.016875 -0.278824,-1.098228 -0.509078,-2.063618 -0.669285,-2.753039 -0.0801,-0.34471 -0.142704,-0.620447 -0.185142,-0.809391 -0.02122,-0.09447 -0.0374,-0.167247 -0.04821,-0.216099 -0.01081,-0.04885 -0.0051,-0.02261 -0.01598,-0.07257 l -1.224151,-5.611408 -1.353996,5.5815 c -0.0033,0.01369 0.0033,-0.01174 -0.0059,0.01995 -0.0092,0.03169 -0.02626,0.08819 -0.05345,0.168839 -0.0544,0.161297 -0.14921,0.419181 -0.301963,0.768264 -0.305507,0.698165 -0.842731,1.761241 -1.752685,3.145077 z"
       id="path881"
       inkscape:connector-curvature="0"
       inkscape:path-effect="#path-effect883"
       inkscape:original-d="m 50.10887,100.26788 c 0,0 6.078149,-5.167703 9.385192,-9.415882 3.400426,-4.368136 4.017886,-6.913456 4.017886,-6.913456 0,0 2.285881,10.478292 4.227514,13.701899 2.084702,3.461139 6.561467,9.982519 11.639588,12.521579"
       sodipodi:nodetypes="cscsc"
       transform="translate(0,-2.0579754)" />
    <path
       style="fill:#37c89f;fill-opacity:1;fill-rule:nonzero;stroke:none;stroke-width:2.64583325;stroke-linecap:butt;stroke-linejoin:miter;stroke-miterlimit:4;stroke-dasharray:none;stroke-opacity:1"
       d="m 62.189308,75.826915 c 0.159177,7.780655 -0.507822,11.793309 -2.024598,21.570636 -1.6e-5,1.05e-4 -3.2e-5,2.1e-4 -4.9e-5,3.15e-4 -0.92692,6.178324 0.736802,12.280694 2.137607,16.711144 l 0,0 c 0.821293,2.62262 1.668351,4.79699 2.306696,6.3265 l 0,0 c 0.334788,0.8022 0.608141,1.41656 0.806813,1.85127 l 0,0 c 0.100584,0.22008 0.176789,0.38256 0.23179,0.49845 l 0,0 0,0 c 0.02745,0.0578 0.04766,0.0999 0.06224,0.13012 0,0 0,0 0,0 0.0085,0.014 0.01405,0.0258 0.0173,0.0334 0.003,0.007 0.0051,0.0128 0.0051,0.0126 0,0 0,0 0,0 0,0 0,0 0,0 0,0 0,0 0,0 2e-5,6e-5 1.7e-5,5e-5 1.7e-5,5e-5 0,0 3e-6,1e-5 -1.7e-5,-5e-5 0,0 0,0 0,0 0,0 0,0 0,0 0,0 0,0 0,0 1.1e-5,4e-5 -0.0021,-0.006 -0.0044,-0.0129 -0.0024,-0.008 -0.0059,-0.0205 -0.0084,-0.0367 0,0 0,0 0,0 -0.0086,-0.0334 -0.01958,-0.0767 -0.03546,-0.13967 l 0,0 0,0 c -0.03217,-0.12744 -0.07409,-0.2949 -0.132427,-0.53259 l 0,0 c -0.115481,-0.47047 -0.268799,-1.10749 -0.463241,-1.95774 l 0,0 c -0.367718,-1.60803 -0.858199,-3.86779 -1.331074,-6.52914 l 0,0 c -0.795332,-4.5359 -1.848883,-10.53406 -0.978021,-15.949235 1.4e-5,-9.1e-5 2.8e-5,-1.82e-4 4.2e-5,-2.72e-4 1.515712,-9.770475 2.218023,-14.077217 2.055318,-22.030355 z"
       id="path885"
       inkscape:connector-curvature="0"
       sodipodi:nodetypes="czc"
       inkscape:path-effect="#path-effect887"
       inkscape:original-d="m 63.511948,75.799854 c 0.160941,7.866898 -0.523714,12.026596 -2.039958,21.800498 -1.516244,9.773898 4.260196,25.361058 4.260196,25.361058"
       transform="translate(0,-2.0579754)" />
    <path
       style="fill:url(#linearGradient1058);fill-opacity:1;stroke:none;stroke-width:0.26458332px;stroke-linecap:butt;stroke-linejoin:miter;stroke-opacity:1"
       d="m 46.241544,11.778112 c -4.00694,-0.0023 -8.320929,1.401683 -12.486576,5.400703 -15.31775,14.705041 -1.49655,29.653489 -1.49655,29.653489 l 31.241505,29.154807 31.24202,-29.154807 c 0,0 13.820687,-14.948448 -1.49706,-29.653489 -14.03165,-13.4703825 -29.74496,2.500106 -29.74496,2.500106 0,0 -7.76825,-7.895317 -17.258379,-7.900809 z"
       id="path1020"
       inkscape:connector-curvature="0" />
    <g
       style="stroke-width:0.92204314"
       transform="matrix(0.09849178,0,0,0.09849178,44.125017,23.068865)"
       id="inkscape-logo">
      <path
         style="fill:#000000;fill-opacity:1;stroke-width:0.92204314"
         inkscape:connector-curvature="0"
         id="path2313"
         d="M 163.15,27.83 28.81,165.3 C -16.58,221.51 59.7,214.97 92.4,231.16 104.13,243.15 47.44,252 59.17,264 c 11.73,11.99 70.93,23.1 82.68,35.09 11.73,11.99 -24.01,24.71 -12.28,36.7 11.73,11.99 38.86,0.63 43.94,28.31 3.62,19.78 48.89,8.5 71.03,-7.7 11.73,-12 -22.44,-10.87 -10.71,-22.86 29.17,-29.83 56.33,-10.84 66.31,-40.73 4.93,-14.77 -42.94,-22.77 -31.19,-34.76 33.75,-19.71 150.4,-32.54 95.05,-87.89 L 224.75,27.83 c -17.03,-16.35 -45.45,-16.53 -61.6,0 z m 154.31,264.98 c 0,6.82 50.25,11.29 50.25,-1.61 -7.16,-20.72 -44.31,-19.32 -50.25,1.61 z M 91.1,329.05 c 11.9,10.29 30.28,-2.56 35.79,-16.92 -11.53,-15.32 -54.69,0.55 -35.79,16.92 z m 220.06,-22.23 c -15.34,13.76 1.72,27.72 16.84,18.83 3.37,-3.42 -0.09,-15.41 -16.84,-18.83 z" />
      <path
         inkscape:connector-curvature="0"
         style="fill:#ffffff;stroke-width:0.92204314"
         id="path2315"
         d="m 131,238.6 c 3.59,2.23 57.89,13.26 71.16,15.46 4.6,0.97 1.34,5.71 -5,8.91 -14.3,3.8 -83.66,-24.37 -66.16,-24.37 z" />
      <path
         inkscape:connector-curvature="0"
         style="fill:#ffffff;stroke-width:0.92204314"
         id="path2317"
         d="m 216.63,37.47 53.15,53.98 c 5.04,5.15 4.97,15.13 2.15,18 L 245.54,88.34 240.35,119.6 218.3,107.96 182.99,130.27 171.3,83.24 152.33,116.06 h -29 c -11.82,0 -13.21,-15 -2.47,-25.74 18.76,-20.25 40.29,-40.89 51.99,-52.85 11.76,-12.02 32.25,-11.68 43.78,0 z" />
    </g>
    <path
       style="fill:#ff7855;fill-opacity:1;stroke:none;stroke-width:0.26458332px;stroke-linecap:butt;stroke-linejoin:miter;stroke-opacity:1"
       d="m 33.103528,79.724033 c -0.696793,0.40176 -1.306127,1.078272 -1.629787,2.190031 -1.190158,4.088104 2.709542,5.293874 2.709542,5.293874 l 8.350741,1.921583 2.511321,-8.192797 c 0,0 0.905533,-3.980073 -3.229947,-4.993417 -3.788262,-0.928267 -4.920452,3.419043 -4.920452,3.419043 0,0 -2.141112,-0.589844 -3.791418,0.361683 z"
       id="path1020-6"
       inkscape:connector-curvature="0" />
    <path
       style="fill:#ff7855;fill-opacity:1;stroke:none;stroke-width:0.26458332px;stroke-linecap:butt;stroke-linejoin:miter;stroke-opacity:1"
       d="m 48.034947,107.71203 c -0.517887,0.13845 -1.026864,0.46887 -1.42701,1.12876 -1.471402,2.42654 0.831157,3.8755 0.831157,3.8755 l 5.04458,2.67759 3.030008,-4.84116 c 0,0 1.269531,-2.4061 -1.218013,-3.77185 -2.278688,-1.25108 -3.757486,1.35234 -3.757486,1.35234 0,0 -1.27666,-0.74907 -2.503236,-0.42118 z"
       id="path1020-6-0"
       inkscape:connector-curvature="0" />
    <path
       style="fill:#ff7855;fill-opacity:1;stroke:none;stroke-width:0.26458332px;stroke-linecap:butt;stroke-linejoin:miter;stroke-opacity:1"
       d="m 84.048922,81.786958 c -0.891381,-0.239395 -1.934736,-0.184885 -3.099456,0.454591 -4.282858,2.351435 -2.096965,6.494087 -2.096965,6.494087 l 5.216713,8.335114 8.685478,-4.610033 c 0,0 3.964252,-2.494726 1.430904,-6.672556 -2.320641,-3.827061 -6.766787,-1.218266 -6.766787,-1.218266 0,0 -1.258721,-2.215937 -3.369887,-2.782937 z"
       id="path1020-6-6"
       inkscape:connector-curvature="0" />
  </g>
  <style
     type="text/css"
     id="style26">
	.specularity {opacity:0.5;}
	.low-specularity {opacity:0.25;}
	.full-specularity {opacity:1;}
	.black {fill:#000000;}
	.white {fill:#ffffff;}
	.outline-big {stroke-width:16;stroke:none;opacity:0.1;fill:none;}
	.outline-small {stroke-width:8;stroke:none;opacity:0.2;fill:none;}
	.stroke-highlight {fill:none;stroke:none;opacity:0.2;}
       	.base-shadow 	{fill:black;opacity:75;}
	</style>
</svg>
