<?xml version="1.0" encoding="UTF-8" standalone="no"?>
<svg
   version="1.0"
   height="20.07403"
   width="38"
   id="svg2"
   sodipodi:docname="mit.svg"
   inkscape:version="1.2.2 (b0a8486541, 2022-12-01)"
   xmlns:inkscape="http://www.inkscape.org/namespaces/inkscape"
   xmlns:sodipodi="http://sodipodi.sourceforge.net/DTD/sodipodi-0.dtd"
   xmlns="http://www.w3.org/2000/svg"
   xmlns:svg="http://www.w3.org/2000/svg"
   xmlns:rdf="http://www.w3.org/1999/02/22-rdf-syntax-ns#"
   xmlns:cc="http://creativecommons.org/ns#"
   xmlns:dc="http://purl.org/dc/elements/1.1/">
  <sodipodi:namedview
     id="namedview9612"
     pagecolor="#ffffff"
     bordercolor="#000000"
     borderopacity="0.25"
     inkscape:showpageshadow="2"
     inkscape:pageopacity="0.0"
     inkscape:pagecheckerboard="0"
     inkscape:deskcolor="#d1d1d1"
     showgrid="false"
     inkscape:zoom="15.992109"
     inkscape:cx="18.008881"
     inkscape:cy="9.1295023"
     inkscape:window-width="1920"
     inkscape:window-height="1011"
     inkscape:window-x="0"
     inkscape:window-y="0"
     inkscape:window-maximized="1"
     inkscape:current-layer="svg2" />
  <metadata
     id="metadata7">
    <rdf:RDF>
      <cc:Work
         rdf:about="">
        <dc:format>image/svg+xml</dc:format>
        <dc:type
           rdf:resource="http://purl.org/dc/dcmitype/StillImage" />
      </cc:Work>
    </rdf:RDF>
  </metadata>
  <defs
     id="defs5">
    <foreignObject
       id="foreignObject8"
       height="1"
       width="1"
       y="0"
       x="0"
       requiredExtensions="http://ns.adobe.com/AdobeIllustrator/10.0/" />
  </defs>
  <path
     id="path9731"
     style="font-weight:bold;font-size:11.2597px;line-height:125%;-inkscape-font-specification:'sans-serif Bold';letter-spacing:0px;word-spacing:0px;stroke-width:1.39164px"
     d="M 4.889231,4.4432629 V 15.630767 h 2.1173622 v -5.202353 c 0,-0.386513 -0.011723,-0.8155549 -0.032616,-1.2856387 C 6.9530832,8.6622452 6.9323547,8.2151919 6.911462,7.7973395 L 6.8652553,6.8568933 h 0.062515 L 9.621359,15.630767 h 2.179879 l 2.881135,-8.7602832 h 0.06251 l -0.04621,0.9404459 c -0.01045,0.4074061 -0.02532,0.8423095 -0.04621,1.3019471 -0.01045,0.4596373 -0.01631,0.8679483 -0.01631,1.2231232 v 5.294767 H 16.84593 V 4.4432629 h -3.229032 l -2.80503,8.5564291 h -0.04621 L 8.118277,4.4432629 Z m 13.867503,0 v 1.348154 l 1.364461,0.625152 v 7.2408921 l -1.364461,0.625152 v 1.348154 h 5.09363 V 14.282613 L 22.485901,13.657461 V 6.4165689 l 1.364463,-0.625152 v -1.348154 z m 5.909045,0 v 1.973306 h 3.038783 v 9.2141981 h 2.367424 V 6.4165689 h 3.038783 v -1.973306 z" />
</svg>
