<?xml version="1.0" encoding="UTF-8" standalone="no"?>
<!-- Created with Inkscape (http://www.inkscape.org/) -->

<svg
   xmlns:dc="http://purl.org/dc/elements/1.1/"
   xmlns:cc="http://creativecommons.org/ns#"
   xmlns:rdf="http://www.w3.org/1999/02/22-rdf-syntax-ns#"
   xmlns:svg="http://www.w3.org/2000/svg"
   xmlns="http://www.w3.org/2000/svg"
   xmlns:sodipodi="http://sodipodi.sourceforge.net/DTD/sodipodi-0.dtd"
   xmlns:inkscape="http://www.inkscape.org/namespaces/inkscape"
   width="64"
   height="63.999996"
   viewBox="0 0 60 60"
   id="svg4197"
   version="1.1"
   inkscape:version="0.92.4 (unknown)"
   sodipodi:docname="contest_0.91.svg"
   inkscape:export-filename="/home/doctormo/Desktop/contest_icon_092.png"
   inkscape:export-xdpi="285"
   inkscape:export-ydpi="285">
  <defs
     id="defs4199">
    <clipPath
       clipPathUnits="userSpaceOnUse"
       id="clipPath5856-1-7">
      <path
         style="color:#000000;display:inline;overflow:visible;visibility:visible;fill:#ffffff;fill-opacity:1;fill-rule:evenodd;stroke:#000000;stroke-width:2.7243309;stroke-linecap:square;stroke-linejoin:round;stroke-miterlimit:4;stroke-dashoffset:0;stroke-opacity:1;marker:none;enable-background:accumulate"
         d="m 379.77379,545.55232 c -11.93661,9.13817 -27.51793,21.08095 -40.55847,34.05414 -13.97449,13.9023 -24.38081,28.90465 -24.72331,41.05226 -3e-4,0.0109 2.9e-4,0.0231 0,0.034 0.0645,17.98209 14.55802,32.43657 32.55576,32.43657 8.92889,0 16.95291,-3.56127 22.85032,-9.36489 1.37903,-1.3559 3.69147,-1.63706 5.35524,-0.65113 l 4.53553,0.01 4.53553,0.01 c 1.66064,-0.98024 3.96428,-0.70058 5.34213,0.64852 5.89535,5.7903 13.91848,9.34786 22.83329,9.34786 17.99781,0 32.49129,-14.45447 32.55576,-32.43656 4e-5,-0.0114 -3e-5,-0.0226 0,-0.034 -0.34247,-12.14761 -10.74882,-27.14996 -24.7233,-41.05226 -13.04055,-12.97319 -28.62185,-24.91597 -40.55848,-34.05414 z"
         id="path5858-7-7"
         inkscape:connector-curvature="0"
         sodipodi:nodetypes="csccscccccsccsc" />
    </clipPath>
  </defs>
  <sodipodi:namedview
     id="base"
     pagecolor="#ffffff"
     bordercolor="#666666"
     borderopacity="1.0"
     inkscape:pageopacity="0.0"
     inkscape:pageshadow="2"
     inkscape:zoom="15.674198"
     inkscape:cx="18.885554"
     inkscape:cy="29.983841"
     inkscape:document-units="px"
     inkscape:current-layer="layer1"
     showgrid="false"
     showguides="false"
     inkscape:window-width="1855"
     inkscape:window-height="1056"
     inkscape:window-x="65"
     inkscape:window-y="24"
     inkscape:window-maximized="1"
     inkscape:guide-bbox="true"
     inkscape:snap-global="false"
     fit-margin-top="0"
     fit-margin-left="0"
     fit-margin-right="0"
     fit-margin-bottom="0"
     inkscape:pagecheckerboard="true"
     borderlayer="true"
     units="px">
    <sodipodi:guide
       position="229.19241,-282.22197"
       orientation="0,1"
       id="guide4855"
       inkscape:locked="false" />
    <sodipodi:guide
       position="176.90436,-137.45752"
       orientation="0,1"
       id="guide4857"
       inkscape:locked="false" />
    <sodipodi:guide
       position="138.87668,-237.71231"
       orientation="0,1"
       id="guide4859"
       inkscape:locked="false" />
    <sodipodi:guide
       position="214.4999,-38.067001"
       orientation="0,1"
       id="guide4861"
       inkscape:locked="false" />
  </sodipodi:namedview>
  <metadata
     id="metadata4202">
    <rdf:RDF>
      <cc:Work
         rdf:about="">
        <dc:format>image/svg+xml</dc:format>
        <dc:type
           rdf:resource="http://purl.org/dc/dcmitype/StillImage" />
        <dc:title />
      </cc:Work>
    </rdf:RDF>
  </metadata>
  <g
     inkscape:label="Layer 1"
     inkscape:groupmode="layer"
     id="layer1"
     transform="translate(-162.31979,-109.90793)">
    <g
       id="g15297"
       transform="matrix(0.21790471,0.00319552,-0.00319254,0.21790683,111.50181,4.1670561)">
      <path
         id="path15299"
         d="m 381.59375,483.03125 c -44.5737,34.17836 -126.526,95.07785 -127.9375,147.90625 0,37.49033 30.3847,67.875 67.875,67.875 18.56043,0 35.35326,-7.45466 47.625,-19.53125 l -17.3125,61.3125 h 59.5 l -17.28125,-61.28125 c 12.26758,12.04896 29.05738,19.5 47.59375,19.5 37.4904,0 67.875,-30.38467 67.875,-67.875 -1.4114,-52.8284 -83.3637,-113.72789 -127.9375,-147.90625 z"
         style="color:#000000;display:inline;overflow:visible;visibility:visible;fill:#ffffff;fill-opacity:1;fill-rule:evenodd;stroke:#000000;stroke-width:2.49746871;stroke-linecap:square;stroke-linejoin:round;stroke-miterlimit:4;stroke-dasharray:none;stroke-dashoffset:0;stroke-opacity:1;marker:none;enable-background:accumulate"
         inkscape:connector-curvature="0" />
      <path
         d="m 381.59375,493.26562 c -21.90658,16.77077 -50.49868,38.67112 -74.42969,62.47852 -25.64281,25.51037 -44.74947,53.04346 -45.38476,75.33594 0.0774,33.03828 26.69491,59.61719 59.75195,59.61719 16.38731,0 31.10805,-6.54971 41.93164,-17.20118 a 8.1166887,8.1166887 0 0 1 13.50391,7.99024 l -14.39844,50.99219 h 38.05469 l -14.3711,-50.9629 a 8.1166887,8.1166887 0 0 1 13.49805,-7.99414 c 10.81982,10.62701 25.54477,17.17579 41.90625,17.17579 33.05715,0 59.67456,-26.5789 59.75195,-59.61719 -0.63525,-22.29248 -19.74,-49.82557 -45.38281,-75.33594 -23.931,-23.8074 -52.52502,-45.70775 -74.43164,-62.47852 z"
         id="path15301"
         style="color:#000000;display:inline;overflow:visible;visibility:visible;fill:#ffffff;fill-opacity:1;fill-rule:evenodd;stroke:#000000;stroke-width:2.49746871;stroke-linecap:square;stroke-linejoin:round;stroke-miterlimit:4;stroke-dasharray:none;stroke-dashoffset:0;stroke-opacity:1;marker:none;enable-background:accumulate"
         inkscape:original="M 381.59375 483.03125 C 337.02005 517.20961 255.06775 578.1091 253.65625 630.9375 C 253.65625 668.42783 284.04095 698.8125 321.53125 698.8125 C 340.09168 698.8125 356.88451 691.35784 369.15625 679.28125 L 351.84375 740.59375 L 411.34375 740.59375 L 394.0625 679.3125 C 406.33008 691.36146 423.11988 698.8125 441.65625 698.8125 C 479.14665 698.8125 509.53125 668.42783 509.53125 630.9375 C 508.11985 578.1091 426.16755 517.20961 381.59375 483.03125 z "
         inkscape:radius="-8.1158772"
         sodipodi:type="inkscape:offset" />
      <g
         clip-path="url(#clipPath5856-1-7)"
         transform="matrix(1.8353131,0,0,1.8353131,-315.41007,-508.00932)"
         id="g15303">
        <g
           style="fill:#000000;stroke:none"
           transform="matrix(0.6910319,0.1903473,-0.1903473,0.6910319,160.59578,636.49891)"
           id="g15305">
          <path
             sodipodi:nodetypes="cccc"
             id="path15307"
             d="m 330.65338,-201.58951 -47.85937,82.89487 56.95774,-76.36322 c -2.40001,-2.51631 -4.5663,-4.37145 -9.09837,-6.53165 z"
             style="color:#000000;display:inline;overflow:visible;visibility:visible;fill:#000000;fill-opacity:1;fill-rule:evenodd;stroke:none;stroke-width:2.15812063;marker:none;enable-background:accumulate"
             inkscape:connector-curvature="0" />
          <path
             sodipodi:nodetypes="cccc"
             id="path15309"
             d="m 365.68888,-165.82197 -82.89487,47.85938 87.50846,-37.65362 c -0.82032,-3.37919 -1.7688,-6.06893 -4.61359,-10.20576 z"
             style="color:#000000;display:inline;overflow:visible;visibility:visible;fill:#000000;fill-opacity:1;fill-rule:evenodd;stroke:none;stroke-width:2.15812063;marker:none;enable-background:accumulate"
             inkscape:connector-curvature="0" />
          <path
             sodipodi:nodetypes="cccc"
             id="path15311"
             d="m 378.14674,-117.32862 h -95.71875 l 94.61136,11.14524 c 0.97918,-3.33662 1.50264,-6.14025 1.10739,-11.14524 z"
             style="color:#000000;display:inline;overflow:visible;visibility:visible;fill:#000000;fill-opacity:1;fill-rule:evenodd;stroke:none;stroke-width:2.15812063;marker:none;enable-background:accumulate"
             inkscape:connector-curvature="0" />
          <path
             sodipodi:nodetypes="cccc"
             id="path15313"
             d="m 364.68888,-69.103221 -82.89487,-47.859379 76.36322,56.957745 c 2.51631,-2.400008 4.37145,-4.566293 6.53165,-9.098366 z"
             style="color:#000000;display:inline;overflow:visible;visibility:visible;fill:#000000;fill-opacity:1;fill-rule:evenodd;stroke:none;stroke-width:2.15812063;marker:none;enable-background:accumulate"
             inkscape:connector-curvature="0" />
          <path
             sodipodi:nodetypes="cccc"
             id="path15315"
             d="m 328.92134,-34.067727 -47.85938,-82.894873 37.65362,87.508465 c 3.37919,-0.820316 6.06893,-1.768801 10.20576,-4.613592 z"
             style="color:#000000;display:inline;overflow:visible;visibility:visible;fill:#000000;fill-opacity:1;fill-rule:evenodd;stroke:none;stroke-width:2.15812063;marker:none;enable-background:accumulate"
             inkscape:connector-curvature="0" />
          <path
             sodipodi:nodetypes="cccc"
             id="path15317"
             d="m 280.42799,-21.609863 v -95.718747 l -11.14524,94.611357 c 3.33662,0.97918 6.14025,1.50264 11.14524,1.10739 z"
             style="color:#000000;display:inline;overflow:visible;visibility:visible;fill:#000000;fill-opacity:1;fill-rule:evenodd;stroke:none;stroke-width:2.15812063;marker:none;enable-background:accumulate"
             inkscape:connector-curvature="0" />
          <path
             sodipodi:nodetypes="cccc"
             id="path15319"
             d="m 233.93462,-202.58951 47.85938,82.89487 -37.65362,-87.50846 c -3.37919,0.82031 -6.06893,1.7688 -10.20576,4.61359 z"
             style="color:#000000;display:inline;overflow:visible;visibility:visible;fill:#000000;fill-opacity:1;fill-rule:evenodd;stroke:none;stroke-width:2.15812063;marker:none;enable-background:accumulate"
             inkscape:connector-curvature="0" />
          <path
             sodipodi:nodetypes="cccc"
             id="path15321"
             d="m 198.16708,-167.55401 82.89487,47.85938 -76.36322,-56.95774 c -2.51631,2.4 -4.37145,4.56629 -6.53165,9.09836 z"
             style="color:#000000;display:inline;overflow:visible;visibility:visible;fill:#000000;fill-opacity:1;fill-rule:evenodd;stroke:none;stroke-width:2.15812063;marker:none;enable-background:accumulate"
             inkscape:connector-curvature="0" />
          <path
             sodipodi:nodetypes="cccc"
             id="path15323"
             d="m 184.70922,-119.32861 h 95.71875 l -94.61136,-11.14524 c -0.97918,3.33662 -1.50264,6.14025 -1.10739,11.14524 z"
             style="color:#000000;display:inline;overflow:visible;visibility:visible;fill:#000000;fill-opacity:1;fill-rule:evenodd;stroke:none;stroke-width:2.15812063;marker:none;enable-background:accumulate"
             inkscape:connector-curvature="0" />
          <path
             sodipodi:nodetypes="cccc"
             id="path15325"
             d="m 197.16709,-70.835257 82.89487,-47.859373 -87.50846,37.653617 c 0.82031,3.379188 1.7688,6.068933 4.61359,10.205756 z"
             style="color:#000000;display:inline;overflow:visible;visibility:visible;fill:#000000;fill-opacity:1;fill-rule:evenodd;stroke:none;stroke-width:2.15812063;marker:none;enable-background:accumulate"
             inkscape:connector-curvature="0" />
          <path
             sodipodi:nodetypes="cccc"
             id="path15327"
             d="m 232.20259,-35.067715 47.85938,-82.894865 -56.95774,76.363217 c 2.4,2.516304 4.56629,4.371449 9.09836,6.531648 z"
             style="color:#000000;display:inline;overflow:visible;visibility:visible;fill:#000000;fill-opacity:1;fill-rule:evenodd;stroke:none;stroke-width:2.15812063;marker:none;enable-background:accumulate"
             inkscape:connector-curvature="0" />
          <path
             sodipodi:nodetypes="cccc"
             id="use15329"
             d="m 281.79399,-215.41339 10e-6,95.71875 11.14524,-94.61136 c -3.33662,-0.97918 -6.14025,-1.50264 -11.14525,-1.10739 z"
             style="color:#000000;display:inline;overflow:visible;visibility:visible;fill:#000000;fill-opacity:1;fill-rule:evenodd;stroke:none;stroke-width:2.15812063;marker:none;enable-background:accumulate"
             inkscape:connector-curvature="0" />
        </g>
        <g
           id="g15331"
           transform="matrix(0.71675107,0.00500916,-0.00500916,0.71675107,175.28849,691.70156)"
           style="fill:#000000;stroke:none">
          <path
             inkscape:connector-curvature="0"
             style="color:#000000;display:inline;overflow:visible;visibility:visible;fill:#000000;fill-opacity:1;fill-rule:evenodd;stroke:none;stroke-width:2.15812063;marker:none;enable-background:accumulate"
             d="m 330.65338,-201.58951 -47.85937,82.89487 56.95774,-76.36322 c -2.40001,-2.51631 -4.5663,-4.37145 -9.09837,-6.53165 z"
             id="path15333"
             sodipodi:nodetypes="cccc" />
          <path
             inkscape:connector-curvature="0"
             style="color:#000000;display:inline;overflow:visible;visibility:visible;fill:#000000;fill-opacity:1;fill-rule:evenodd;stroke:none;stroke-width:2.15812063;marker:none;enable-background:accumulate"
             d="m 365.68888,-165.82197 -82.89487,47.85938 87.50846,-37.65362 c -0.82032,-3.37919 -1.7688,-6.06893 -4.61359,-10.20576 z"
             id="path15335"
             sodipodi:nodetypes="cccc" />
          <path
             inkscape:connector-curvature="0"
             style="color:#000000;display:inline;overflow:visible;visibility:visible;fill:#000000;fill-opacity:1;fill-rule:evenodd;stroke:none;stroke-width:2.15812063;marker:none;enable-background:accumulate"
             d="m 378.14674,-117.32862 h -95.71875 l 94.61136,11.14524 c 0.97918,-3.33662 1.50264,-6.14025 1.10739,-11.14524 z"
             id="path15337"
             sodipodi:nodetypes="cccc" />
          <path
             inkscape:connector-curvature="0"
             style="color:#000000;display:inline;overflow:visible;visibility:visible;fill:#000000;fill-opacity:1;fill-rule:evenodd;stroke:none;stroke-width:2.15812063;marker:none;enable-background:accumulate"
             d="m 364.68888,-69.103221 -82.89487,-47.859379 76.36322,56.957745 c 2.51631,-2.400008 4.37145,-4.566293 6.53165,-9.098366 z"
             id="path15339"
             sodipodi:nodetypes="cccc" />
          <path
             inkscape:connector-curvature="0"
             style="color:#000000;display:inline;overflow:visible;visibility:visible;fill:#000000;fill-opacity:1;fill-rule:evenodd;stroke:none;stroke-width:2.15812063;marker:none;enable-background:accumulate"
             d="m 328.92134,-34.067727 -47.85938,-82.894873 37.65362,87.508465 c 3.37919,-0.820316 6.06893,-1.768801 10.20576,-4.613592 z"
             id="path15341"
             sodipodi:nodetypes="cccc" />
          <path
             inkscape:connector-curvature="0"
             style="color:#000000;display:inline;overflow:visible;visibility:visible;fill:#000000;fill-opacity:1;fill-rule:evenodd;stroke:none;stroke-width:2.15812063;marker:none;enable-background:accumulate"
             d="m 280.42799,-21.609863 v -95.718747 l -11.14524,94.611357 c 3.33662,0.97918 6.14025,1.50264 11.14524,1.10739 z"
             id="path15343"
             sodipodi:nodetypes="cccc" />
          <path
             inkscape:connector-curvature="0"
             style="color:#000000;display:inline;overflow:visible;visibility:visible;fill:#000000;fill-opacity:1;fill-rule:evenodd;stroke:none;stroke-width:2.15812063;marker:none;enable-background:accumulate"
             d="m 233.93462,-202.58951 47.85938,82.89487 -37.65362,-87.50846 c -3.37919,0.82031 -6.06893,1.7688 -10.20576,4.61359 z"
             id="path15345"
             sodipodi:nodetypes="cccc" />
          <path
             inkscape:connector-curvature="0"
             style="color:#000000;display:inline;overflow:visible;visibility:visible;fill:#000000;fill-opacity:1;fill-rule:evenodd;stroke:none;stroke-width:2.15812063;marker:none;enable-background:accumulate"
             d="m 198.16708,-167.55401 82.89487,47.85938 -76.36322,-56.95774 c -2.51631,2.4 -4.37145,4.56629 -6.53165,9.09836 z"
             id="path15347"
             sodipodi:nodetypes="cccc" />
          <path
             inkscape:connector-curvature="0"
             style="color:#000000;display:inline;overflow:visible;visibility:visible;fill:#000000;fill-opacity:1;fill-rule:evenodd;stroke:none;stroke-width:2.15812063;marker:none;enable-background:accumulate"
             d="m 184.70922,-119.32861 h 95.71875 l -94.61136,-11.14524 c -0.97918,3.33662 -1.50264,6.14025 -1.10739,11.14524 z"
             id="path15349"
             sodipodi:nodetypes="cccc" />
          <path
             inkscape:connector-curvature="0"
             style="color:#000000;display:inline;overflow:visible;visibility:visible;fill:#000000;fill-opacity:1;fill-rule:evenodd;stroke:none;stroke-width:2.15812063;marker:none;enable-background:accumulate"
             d="m 197.16709,-70.835257 82.89487,-47.859373 -87.50846,37.653617 c 0.82031,3.379188 1.7688,6.068933 4.61359,10.205756 z"
             id="path15351"
             sodipodi:nodetypes="cccc" />
          <path
             inkscape:connector-curvature="0"
             style="color:#000000;display:inline;overflow:visible;visibility:visible;fill:#000000;fill-opacity:1;fill-rule:evenodd;stroke:none;stroke-width:2.15812063;marker:none;enable-background:accumulate"
             d="m 232.20259,-35.067715 47.85938,-82.894865 -56.95774,76.363217 c 2.4,2.516304 4.56629,4.371449 9.09836,6.531648 z"
             id="path15353"
             sodipodi:nodetypes="cccc" />
          <path
             sodipodi:nodetypes="cccc"
             id="use15355"
             d="m 281.79399,-215.41339 10e-6,95.71875 11.14524,-94.61136 c -3.33662,-0.97918 -6.14025,-1.50264 -11.14525,-1.10739 z"
             style="color:#000000;display:inline;overflow:visible;visibility:visible;fill:#000000;fill-opacity:1;fill-rule:evenodd;stroke:none;stroke-width:2.15812063;marker:none;enable-background:accumulate"
             inkscape:connector-curvature="0" />
        </g>
      </g>
      <path
         inkscape:connector-curvature="0"
         id="path15357"
         d="m 381.43326,560.30084 c -20.35563,0 -36.82835,16.51246 -36.82835,36.86808 0,2.32355 0.22445,4.5893 0.63565,6.79358 -17.65305,2.73652 -31.14716,18.0112 -31.14716,36.43108 0,20.35562 16.47272,36.86808 36.82835,36.86808 12.68226,0 23.88008,-6.41736 30.51151,-16.16952 6.62979,9.76304 17.82086,16.16952 30.51151,16.16952 20.35564,0 36.86808,-16.51246 36.86808,-36.86808 0,-18.41988 -13.49411,-33.69456 -31.14716,-36.43108 0.4112,-2.20428 0.63565,-4.47003 0.63565,-6.79358 0,-20.35562 -16.51244,-36.86808 -36.86808,-36.86808 z"
         style="color:#000000;display:inline;overflow:visible;visibility:visible;fill:#ffffff;fill-opacity:1;fill-rule:evenodd;stroke:none;stroke-width:5;marker:none;enable-background:accumulate" />
      <g
         id="g15359"
         transform="translate(-260)">
        <path
           style="fill:none;stroke:#000000;stroke-width:4.99493742;stroke-miterlimit:4;stroke-dasharray:none"
           d="m 442,685.40625 c -2.45313,-0.0159 -4.91955,0.88341 -6.8125,2.75 l -33.625,33.1875 c -1.85545,1.82945 -2.79028,4.28362 -2.84375,6.6875 0.62261,2.43742 17.16959,5.73744 19,7.59375 2.76453,2.80335 -10.73307,4.72783 -7.96875,7.53125 2.76453,2.80335 16.79776,5.50908 19.5625,8.3125 2.76431,2.80336 -5.73307,5.72789 -2.96875,8.53125 2.76453,2.80336 12.15077,-0.62471 10.40625,6.625 3.73313,3.7857 11.56557,2.03528 16.84375,-1.6875 2.80325,-2.76442 -5.30341,-2.54807 -2.5,-5.3125 2.80326,-2.76447 9.81368,-2.75702 15.78125,-9.375 -2.3573,-3.72331 -10.14716,-5.32927 -7.34375,-8.09375 2.80326,-2.76447 8.22199,-1.34056 19.9375,-6.5625 5.71899,-2.5493 5.2552,-4.49058 5.25,-6.875 0,-0.0477 -2.2e-4,-0.10588 0,-0.15625 h -0.0312 c -0.0212,-2.40436 -0.92049,-4.80101 -2.75,-6.65625 l -33.18755,-33.65625 c -1.86665,-1.89291 -4.29688,-2.82661 -6.75,-2.84375 z m 33.84375,61.96875 c -0.56244,0.0106 -1.08319,0.0554 -1.5,0.15625 -1.04824,0.25411 -6.13536,0.38758 -5.75,3.65625 4.47881,1.66341 11.41127,2.91638 12.25,-0.34375 0.68223,-2.64814 -2.5628,-3.51873 -5,-3.46875 z"
           transform="translate(199.40411,-106.06601)"
           id="path15361"
           inkscape:connector-curvature="0" />
        <path
           id="path15363"
           transform="translate(199.40411,-106.06601)"
           d="m 442,685.40625 c -2.45313,-0.0159 -4.91955,0.88341 -6.8125,2.75 l -33.625,33.1875 c -1.85545,1.82945 -2.79028,4.28362 -2.84375,6.6875 0.62261,2.43742 17.16959,5.73744 19,7.59375 2.76453,2.80335 -10.73307,4.72783 -7.96875,7.53125 2.76453,2.80335 16.79776,5.50908 19.5625,8.3125 2.76431,2.80336 -5.73307,5.72789 -2.96875,8.53125 2.76453,2.80336 12.15077,-0.62471 10.40625,6.625 3.73313,3.7857 11.56557,2.03528 16.84375,-1.6875 2.80325,-2.76442 -5.30341,-2.54807 -2.5,-5.3125 2.80326,-2.76447 9.81368,-2.75702 15.78125,-9.375 -2.3573,-3.72331 -10.14716,-5.32927 -7.34375,-8.09375 2.80326,-2.76447 8.22199,-1.34056 19.9375,-6.5625 5.71899,-2.5493 5.2552,-4.49058 5.25,-6.875 0,-0.0477 -2.2e-4,-0.10588 0,-0.15625 h -0.0312 c -0.0212,-2.40436 -0.92049,-4.80101 -2.75,-6.65625 l -33.18755,-33.65625 c -1.86665,-1.89291 -4.29688,-2.82661 -6.75,-2.84375 z m 33.84375,61.96875 c -0.56244,0.0106 -1.08319,0.0554 -1.5,0.15625 -1.04824,0.25411 -6.13536,0.38758 -5.75,3.65625 4.47881,1.66341 11.41127,2.91638 12.25,-0.34375 0.68223,-2.64814 -2.5628,-3.51873 -5,-3.46875 z"
           style="fill:none;stroke:#ffffff;stroke-width:2.49746871;stroke-miterlimit:4;stroke-dasharray:none"
           inkscape:connector-curvature="0" />
      </g>
      <path
         inkscape:connector-curvature="0"
         style="fill:#000000;stroke:none"
         d="m 338.13278,621.96726 c 0.62261,2.43742 17.14506,5.72688 18.97547,7.58319 2.76453,2.80335 -10.71154,4.7508 -7.94722,7.55422 2.76453,2.80335 16.78792,5.50544 19.55266,8.30886 2.76431,2.80336 -5.73097,5.70726 -2.96665,8.51062 2.76453,2.80336 12.14051,-0.61083 10.39599,6.63888 3.73313,3.7857 11.58619,2.04489 16.86437,-1.67789 2.80325,-2.76442 -5.32073,-2.57254 -2.51732,-5.33697 2.80326,-2.76447 9.83217,-2.73131 15.79974,-9.34929 -2.3573,-3.72331 -10.15301,-5.35744 -7.3496,-8.12192 2.80326,-2.76447 8.21179,-1.31343 19.9273,-6.53537 5.71899,-2.5493 5.25755,-4.51781 5.25235,-6.90223 0,-0.0477 6.9e-4,-0.0918 9.1e-4,-0.14217 l -0.0212,-1.7e-4 c -0.0212,-2.40436 -0.92913,-4.8116 -2.75864,-6.66684 l -33.17244,-33.63891 c -1.86665,-1.89291 -4.31685,-2.84235 -6.76997,-2.85949 l 0.0106,5e-5 h 2.2e-4 c -2.45313,-0.0159 -4.90949,0.89805 -6.80244,2.76464 l -33.6456,33.17202 c -1.85545,1.82945 -2.77806,4.29499 -2.83153,6.69887 z m 42.9646,-38.29412 c 1.09047,0.0371 1.96003,0.87289 3.67913,2.00442 l 15.70616,11.81239 c 1.18335,0.78181 2.04182,1.89858 2.05079,3.25339 l -9.31933,-4.58491 -0.9843,7.05405 -5.12609,-2.44145 -7.97857,5.24333 -2.96915,-10.49689 -3.97371,9.13375 -10.93722,1.01454 0.15544,-4.86428 c 0.0106,-1.16865 6.36552,-9.30372 10.21578,-11.22469 l 7.05506,-4.99224 c 1.04086,-0.66446 1.77137,-0.933 2.42543,-0.91141 h 5.4e-4 z m -14.86127,47.64867 c 4.96587,1.32499 10.48597,3.05849 14.92664,3.11981 l 0.17613,1.99344 c -3.80014,-0.41857 -11.82889,-2.30512 -13.71936,-3.2875 l -1.38319,-1.82575 z m 49.00402,9.98516 c -0.56244,0.0106 -1.07508,0.0716 -1.49189,0.17242 -1.04824,0.25411 -6.12992,0.36393 -5.74456,3.6326 4.47881,1.66341 11.4081,2.93917 12.24683,-0.32096 0.68223,-2.64814 -2.57318,-3.53414 -5.01038,-3.48416 v -6e-5 z m -54.90448,5.28126 c -0.51831,-0.002 -1.03194,0.096 -1.52707,0.34165 -2.63986,1.30855 -4.43239,4.2656 -1.98326,5.50206 2.44931,1.23645 4.21612,-0.1581 6.38117,-1.65625 2.16543,-1.49762 2.09286,-1.78701 1.94108,-2.37169 -0.32362,0.0839 -2.56666,-1.80611 -4.81192,-1.81577 z m 46.12022,1.83344 c -2.04685,0.80197 -2.06553,3.66045 -0.44085,4.89616 1.62404,1.23603 3.66677,0.42865 4.48857,-0.38196 0.8224,-0.81052 0.0265,-3.66942 -4.04772,-4.5142 z"
         id="path15365"
         sodipodi:nodetypes="cssssccscssscccccccccccccccccccccccccccccccccsccccssccccscc" />
      <g
         id="g15367">
        <circle
           style="color:#000000;display:inline;overflow:visible;visibility:visible;fill:#000000;fill-opacity:1;fill-rule:nonzero;stroke:#ffffff;stroke-width:1.26538408;stroke-linecap:square;stroke-linejoin:round;stroke-miterlimit:4;stroke-dasharray:none;stroke-dashoffset:0;stroke-opacity:1;marker:none;enable-background:accumulate"
           id="path15369"
           transform="matrix(1.5789474,0,0,1.5789474,-159.97368,-365.7623)"
           cx="281.5"
           cy="624.86218"
           r="9.5" />
        <circle
           transform="matrix(1.1647973,0,0,1.1647973,-41.390421,-75.975552)"
           id="path15371"
           style="color:#000000;display:inline;overflow:visible;visibility:visible;fill:#000000;fill-opacity:1;fill-rule:nonzero;stroke:#ffffff;stroke-width:1.71529841;stroke-linecap:square;stroke-linejoin:round;stroke-miterlimit:4;stroke-dasharray:none;stroke-dashoffset:0;stroke-opacity:1;marker:none;enable-background:accumulate"
           cx="281.5"
           cy="624.86218"
           r="9.5" />
        <circle
           transform="matrix(0.90595345,0,0,0.90595345,47.47412,104.26617)"
           id="path15373"
           style="color:#000000;display:inline;overflow:visible;visibility:visible;fill:#000000;fill-opacity:1;fill-rule:nonzero;stroke:#ffffff;stroke-width:2.20538378;stroke-linecap:square;stroke-linejoin:round;stroke-miterlimit:4;stroke-dasharray:none;stroke-dashoffset:0;stroke-opacity:1;marker:none;enable-background:accumulate"
           cx="281.5"
           cy="624.86218"
           r="9.5" />
        <circle
           transform="matrix(0.5435721,0,0,0.5435721,162.98447,339.20457)"
           id="path15375"
           style="color:#000000;display:inline;overflow:visible;visibility:visible;fill:#000000;fill-opacity:1;fill-rule:nonzero;stroke:#ffffff;stroke-width:3.67563915;stroke-linecap:square;stroke-linejoin:round;stroke-miterlimit:4;stroke-dasharray:none;stroke-dashoffset:0;stroke-opacity:1;marker:none;enable-background:accumulate"
           cx="281.5"
           cy="624.86218"
           r="9.5" />
        <circle
           transform="matrix(0.3882658,0,0,0.3882658,225.20319,439.7496)"
           id="path15377"
           style="color:#000000;display:inline;overflow:visible;visibility:visible;fill:#000000;fill-opacity:1;fill-rule:nonzero;stroke:#ffffff;stroke-width:5.14589453;stroke-linecap:square;stroke-linejoin:round;stroke-miterlimit:4;stroke-dasharray:none;stroke-dashoffset:0;stroke-opacity:1;marker:none;enable-background:accumulate"
           cx="281.5"
           cy="624.86218"
           r="9.5" />
      </g>
      <g
         id="use15379"
         transform="matrix(-1,0,0,1,759.00003,0)">
        <circle
           style="color:#000000;display:inline;overflow:visible;visibility:visible;fill:#000000;fill-opacity:1;fill-rule:nonzero;stroke:#ffffff;stroke-width:2.5333333;stroke-linecap:square;stroke-linejoin:round;stroke-miterlimit:4;stroke-dasharray:none;stroke-dashoffset:0;stroke-opacity:1;marker:none;enable-background:accumulate"
           id="path56622"
           transform="matrix(1.5789474,0,0,1.5789474,-159.97368,-365.7623)"
           cx="281.5"
           cy="624.86218"
           r="9.5" />
        <circle
           transform="matrix(1.1647973,0,0,1.1647973,-41.390421,-75.975552)"
           id="path56624"
           style="color:#000000;display:inline;overflow:visible;visibility:visible;fill:#000000;fill-opacity:1;fill-rule:nonzero;stroke:#ffffff;stroke-width:3.43407393;stroke-linecap:square;stroke-linejoin:round;stroke-miterlimit:4;stroke-dasharray:none;stroke-dashoffset:0;stroke-opacity:1;marker:none;enable-background:accumulate"
           cx="281.5"
           cy="624.86218"
           r="9.5" />
        <circle
           transform="matrix(0.90595345,0,0,0.90595345,47.47412,104.26617)"
           id="path56626"
           style="color:#000000;display:inline;overflow:visible;visibility:visible;fill:#000000;fill-opacity:1;fill-rule:nonzero;stroke:#ffffff;stroke-width:4.4152379;stroke-linecap:square;stroke-linejoin:round;stroke-miterlimit:4;stroke-dasharray:none;stroke-dashoffset:0;stroke-opacity:1;marker:none;enable-background:accumulate"
           cx="281.5"
           cy="624.86218"
           r="9.5" />
        <circle
           transform="matrix(0.5435721,0,0,0.5435721,162.98447,339.20457)"
           id="path56628"
           style="color:#000000;display:inline;overflow:visible;visibility:visible;fill:#000000;fill-opacity:1;fill-rule:nonzero;stroke:#ffffff;stroke-width:7.35872936;stroke-linecap:square;stroke-linejoin:round;stroke-miterlimit:4;stroke-dasharray:none;stroke-dashoffset:0;stroke-opacity:1;marker:none;enable-background:accumulate"
           cx="281.5"
           cy="624.86218"
           r="9.5" />
        <circle
           transform="matrix(0.3882658,0,0,0.3882658,225.20319,439.7496)"
           id="path56630"
           style="color:#000000;display:inline;overflow:visible;visibility:visible;fill:#000000;fill-opacity:1;fill-rule:nonzero;stroke:#ffffff;stroke-width:10.30222034;stroke-linecap:square;stroke-linejoin:round;stroke-miterlimit:4;stroke-dasharray:none;stroke-dashoffset:0;stroke-opacity:1;marker:none;enable-background:accumulate"
           cx="281.5"
           cy="624.86218"
           r="9.5" />
      </g>
      <path
         sodipodi:nodetypes="cccc"
         inkscape:connector-curvature="0"
         id="path15381"
         d="m 381.45117,683.59729 11.98788,44.37968 h -24.208 z"
         style="color:#000000;display:inline;overflow:visible;visibility:visible;fill:#000000;fill-opacity:1;fill-rule:nonzero;stroke:none;stroke-width:3;marker:none;enable-background:accumulate" />
    </g>
    <text
       xml:space="preserve"
       style="font-size:9.60164928px;line-height:0%;font-family:'Rothenburg Decorative';-inkscape-font-specification:'Rothenburg Decorative';letter-spacing:0px;word-spacing:0px;fill:#292929;fill-opacity:1;stroke:#ffffff;stroke-width:0.46939003;stroke-linecap:butt;stroke-linejoin:miter;stroke-miterlimit:4;stroke-dasharray:none;stroke-opacity:1"
       x="200.03575"
       y="166.34013"
       id="text9523"><tspan
         sodipodi:role="line"
         id="tspan9525"
         x="200.03575"
         y="166.34013"
         style="font-style:normal;font-variant:normal;font-weight:normal;font-stretch:normal;font-size:8.80106354px;line-height:10;font-family:'Arial Black';-inkscape-font-specification:'Arial Black, ';fill:#292929;fill-opacity:1;stroke:#ffffff;stroke-width:0.46939003;stroke-miterlimit:4;stroke-dasharray:none;stroke-opacity:1">0.91</tspan></text>
  </g>
</svg>
