<?xml version="1.0" encoding="UTF-8" standalone="no"?>
<svg
   xmlns:dc="http://purl.org/dc/elements/1.1/"
   xmlns:cc="http://creativecommons.org/ns#"
   xmlns:rdf="http://www.w3.org/1999/02/22-rdf-syntax-ns#"
   xmlns:svg="http://www.w3.org/2000/svg"
   xmlns="http://www.w3.org/2000/svg"
   xmlns:sodipodi="http://sodipodi.sourceforge.net/DTD/sodipodi-0.dtd"
   xmlns:inkscape="http://www.inkscape.org/namespaces/inkscape"
   version="1.1"
   id="svg2"
   width="162"
   height="70"
   viewBox="0 0 162 69.999997"
   sodipodi:docname="osuosl.svg"
   inkscape:version="1.0alpha (c15df26511, 2019-01-24, custom)"
   inkscape:export-filename="/home/doctormo/Desktop/osuosl.png"
   inkscape:export-xdpi="96"
   inkscape:export-ydpi="96">
  <metadata
     id="metadata8">
    <rdf:RDF>
      <cc:Work
         rdf:about="">
        <dc:format>image/svg+xml</dc:format>
        <dc:type
           rdf:resource="http://purl.org/dc/dcmitype/StillImage" />
        <dc:title></dc:title>
      </cc:Work>
    </rdf:RDF>
  </metadata>
  <defs
     id="defs6" />
  <sodipodi:namedview
     pagecolor="#ffffff"
     bordercolor="#666666"
     inkscape:document-rotation="0"
     borderopacity="1"
     objecttolerance="10"
     gridtolerance="10"
     guidetolerance="10"
     inkscape:pageopacity="1"
     inkscape:pageshadow="2"
     inkscape:window-width="640"
     inkscape:window-height="480"
     id="namedview4"
     showgrid="false"
     inkscape:zoom="1.0475803"
     inkscape:cx="108.17308"
     inkscape:cy="-50.320571"
     inkscape:current-layer="g10" />
  <g
     inkscape:groupmode="layer"
     inkscape:label="Image"
     id="g10"
     transform="translate(-32.303028,157.368)">
    <g
       style="stroke-width:2.24884"
       transform="matrix(0.44467325,0,0,0.44467325,38.666592,-139.0707)"
       id="g2727">
      <path
         inkscape:connector-curvature="0"
         id="path2543"
         style="opacity:1;fill:#231f20;fill-opacity:1;fill-rule:nonzero;stroke:none;stroke-width:0.299845;stop-opacity:1"
         d="M 3.599043,88.143736 C 3.599043,93.036962 8.4797095,96.477069 16.933309,96.477069 25.387576,96.477069 30.277576,93.036962 30.277576,88.143736 30.277576,83.366136 25.353709,79.810403 16.933309,79.810403 8.5203762,79.810403 3.599043,83.363523 3.599043,88.143736 Z M 7.8521096,88.117176 C 7.8521096,84.841136 10.852109,81.793203 16.933309,81.860936 23.018776,81.793203 26.023442,84.834363 26.023442,88.117176 26.023442,91.330189 23.299042,94.424989 16.933309,94.424989 10.576109,94.424989 7.8521096,91.330189 7.8521096,88.117176 V 88.117176" />
      <path
         inkscape:connector-curvature="0"
         id="path2545"
         style="opacity:1;fill:#231f20;fill-opacity:1;fill-rule:nonzero;stroke:none;stroke-width:0.299845;stop-opacity:1"
         d="M 33.708909,96.235924 H 37.721842 V 89.835922 H 41.609975 C 46.607309,89.835922 51.408375,88.554149 51.408375,84.935923 51.408375,81.224936 46.671442,80.054136 40.986509,80.054136 H 33.708909 Z M 37.721842,82.101069 H 41.078642 C 43.526642,82.101069 47.161442,82.848936 47.161442,84.905189 47.161442,87.051549 44.081309,87.779669 41.630775,87.779669 H 37.721842 V 82.101069" />
      <path
         inkscape:connector-curvature="0"
         id="path2547"
         style="opacity:1;fill:#231f20;fill-opacity:1;fill-rule:nonzero;stroke:none;stroke-width:0.299845;stop-opacity:1"
         d="M 54.130775,96.235924 H 69.703708 V 94.182282 H 58.141708 V 88.870296 H 68.671841 V 86.815616 H 58.141708 V 82.108803 H 69.703708 V 80.054136 H 54.130775 V 96.235924" />
      <path
         inkscape:connector-curvature="0"
         id="path2549"
         style="opacity:1;fill:#231f20;fill-opacity:1;fill-rule:nonzero;stroke:none;stroke-width:0.299845;stop-opacity:1"
         d="M 73.964641,96.235924 H 77.977574 V 82.945336 H 78.055174 L 90.600107,96.235924 H 95.681441 V 80.050536 H 91.668107 V 93.093216 H 91.590774 L 79.364108,80.050536 H 73.968775 L 73.964641,96.235924" />
      <path
         inkscape:connector-curvature="0"
         id="path2551"
         style="opacity:1;fill:#231f20;fill-opacity:1;fill-rule:nonzero;stroke:none;stroke-width:0.299845;stop-opacity:1"
         d="M 128.75744,80.413069 C 126.85744,80.003603 124.67877,79.810403 122.85877,79.810403 117.87344,79.810403 113.99077,81.326536 113.99077,84.187483 113.99077,89.190616 125.79077,88.199469 125.79077,91.796856 125.79077,93.681229 122.63877,94.424989 120.39344,94.424989 118.38544,94.424989 116.02144,93.989042 114.67744,93.689042 L 114.28411,95.81561 C 116.10944,96.155714 118.00544,96.477069 119.94544,96.477069 125.49211,96.477069 130.04677,95.117176 130.04677,91.681229 130.04677,86.383843 118.24811,87.095816 118.24811,84.008843 118.24811,82.329203 120.84144,81.866136 123.05077,81.866136 125.09477,81.866136 126.19877,82.055736 128.20411,82.489069 L 128.75744,80.413069" />
      <path
         inkscape:connector-curvature="0"
         id="path2553"
         style="opacity:1;fill:#231f20;fill-opacity:1;fill-rule:nonzero;stroke:none;stroke-width:0.299845;stop-opacity:1"
         d="M 132.05211,88.143736 C 132.05211,93.036962 136.92944,96.477069 145.38677,96.477069 153.84011,96.477069 158.72677,93.036962 158.72677,88.143736 158.72677,83.366136 153.80277,79.810403 145.38677,79.810403 136.97344,79.810403 132.05211,83.363523 132.05211,88.143736 Z M 136.29744,88.117176 C 136.29744,84.841136 139.30011,81.793203 145.38011,81.860936 151.46544,81.793203 154.47077,84.834363 154.47077,88.117176 154.47077,91.330189 151.74411,94.424989 145.38011,94.424989 139.02411,94.424989 136.29744,91.330189 136.29744,88.117176 V 88.117176" />
      <path
         inkscape:connector-curvature="0"
         id="path2555"
         style="opacity:1;fill:#231f20;fill-opacity:1;fill-rule:nonzero;stroke:none;stroke-width:0.299845;stop-opacity:1"
         d="M 183.99877,80.050536 H 179.98144 V 89.199469 C 179.98144,92.294256 178.32144,94.419776 173.19611,94.419776 168.07477,94.419776 166.41077,92.294256 166.41077,89.199469 V 80.050536 H 162.40011 V 89.510403 C 162.40011,94.045296 166.34277,96.477069 173.19611,96.477069 180.04944,96.477069 183.99877,94.053109 183.99877,89.510403 V 80.050536" />
      <path
         inkscape:connector-curvature="0"
         id="path2557"
         style="opacity:1;fill:#231f20;fill-opacity:1;fill-rule:nonzero;stroke:none;stroke-width:0.299845;stop-opacity:1"
         d="M 192.8521,82.101069 H 196.64144 C 200.27744,82.101069 202.16944,83.036936 202.16944,84.506229 202.16944,86.069256 199.95744,87.051549 196.20944,87.051549 H 192.8521 Z M 188.83744,96.235924 H 192.8521 V 89.108843 H 195.2161 C 197.30544,89.108843 198.60944,89.108843 199.83344,90.670296 L 204.05877,96.231757 H 208.55477 L 203.32544,89.786443 C 202.45477,88.790616 201.85744,88.445296 200.62944,88.162483 V 88.117176 C 203.88144,87.798429 206.41477,86.405189 206.41477,84.432803 206.41477,80.563469 201.12144,80.050536 195.63077,80.050536 H 188.82677 L 188.83744,96.235924" />
      <path
         inkscape:connector-curvature="0"
         id="path2559"
         style="opacity:1;fill:#231f20;fill-opacity:1;fill-rule:nonzero;stroke:none;stroke-width:0.299845;stop-opacity:1"
         d="M 230.6921,80.530136 C 228.7081,80.003603 226.60677,79.810403 224.4681,79.810403 216.03477,79.810403 209.8561,83.108803 209.8561,88.070296 209.8561,93.195816 215.6721,96.474465 224.43477,96.474465 226.05477,96.474465 228.6281,96.403632 230.7321,95.899465 L 230.49477,93.681229 C 229.11477,94.136962 226.46944,94.419776 224.4961,94.419776 218.77477,94.419776 214.1121,91.913002 214.1121,88.135923 214.1121,84.527589 218.33744,81.857336 224.69477,81.857336 226.70544,81.857336 228.6441,82.138536 230.3801,82.712003 L 230.6921,80.530136" />
      <path
         inkscape:connector-curvature="0"
         id="path2561"
         style="opacity:1;fill:#231f20;fill-opacity:1;fill-rule:nonzero;stroke:none;stroke-width:0.299845;stop-opacity:1"
         d="M 233.70277,96.235924 H 249.27477 V 94.182282 H 237.71344 V 88.870296 H 248.24277 V 86.815616 H 237.71344 V 82.108803 H 249.27477 V 80.054136 H 233.70277 V 96.235924" />
      <path
         inkscape:connector-curvature="0"
         id="path2563"
         style="opacity:1;fill:#231f20;fill-opacity:1;fill-rule:nonzero;stroke:none;stroke-width:0.299845;stop-opacity:1"
         d="M 268.5321,96.235924 H 284.1401 V 94.182282 H 272.5481 V 80.050536 H 268.53344 L 268.5321,96.235924" />
      <path
         inkscape:connector-curvature="0"
         id="path2565"
         style="opacity:1;fill:#231f20;fill-opacity:1;fill-rule:nonzero;stroke:none;stroke-width:0.299845;stop-opacity:1"
         d="M 302.68277,90.194256 H 291.66144 L 297.17344,82.224936 Z M 283.40277,96.235924 H 287.55477 L 290.3681,92.129149 H 303.89877 L 306.70544,96.235924 H 311.0241 L 299.34544,80.050536 H 295.19077 L 283.40277,96.235924" />
      <path
         inkscape:connector-curvature="0"
         id="path2567"
         style="opacity:1;fill:#231f20;fill-opacity:1;fill-rule:nonzero;stroke:none;stroke-width:0.299845;stop-opacity:1"
         d="M 316.9361,81.981203 H 321.0641 C 323.3401,81.981203 326.14277,82.460936 326.14277,84.363523 326.14277,86.722376 322.91877,86.930189 319.09744,86.930189 H 316.9361 Z M 316.9361,88.870296 H 319.48944 C 322.87077,88.870296 326.61077,89.217176 326.61077,91.701029 326.61077,93.863522 323.42277,94.299469 319.88677,94.299469 H 316.93877 Z M 312.9241,96.235924 H 320.30144 C 325.93877,96.235924 330.8601,95.407798 330.8601,91.922376 330.8601,89.651549 328.18677,88.215616 324.4001,88.030189 V 87.986443 C 327.91077,87.478109 330.1481,86.365096 330.1481,84.139563 330.1481,81.154136 326.17477,80.059869 320.41744,80.059869 H 312.9161 L 312.9241,96.235924" />
      <path
         inkscape:connector-curvature="0"
         id="path2569"
         style="opacity:1;fill:#c33a21;fill-opacity:1;fill-rule:nonzero;stroke:none;stroke-width:0.299845;stop-opacity:1"
         d="M 222.81477,-21.353595 H 138.14011 C 128.46011,-21.353595 118.81211,-12.987995 118.81211,-1.1281286 V 10.730138 C 118.81211,17.402538 124.80677,34.091604 141.14411,34.091604 H 197.48544 C 201.02144,34.091604 205.98277,36.179737 205.98277,42.981204 205.98277,49.78227 204.27477,54.66507 198.14944,54.66507 H 118.81211 V 71.402536 H 206.14677 C 210.2961,71.402536 222.81477,65.872936 222.81477,53.967737 V 33.047871 C 222.81477,28.347871 218.1521,17.005204 201.48277,17.005204 H 146.80677 C 132.81077,17.005204 129.47211,-4.6161285 146.80677,-4.6161285 H 223.48277 L 222.81877,-21.353595" />
      <path
         inkscape:connector-curvature="0"
         id="path2571"
         style="opacity:1;fill:#c33a21;fill-opacity:1;fill-rule:nonzero;stroke:none;stroke-width:0.299845;stop-opacity:1"
         d="M 241.5401,-21.353595 V 52.436937 C 241.5401,59.29587 246.21077,71.402536 259.87744,71.402536 H 332.0921 V 53.126537 H 266.21077 C 266.21077,53.126537 258.88144,53.126537 258.88144,45.543737 V -21.348395 H 241.5441" />
      <path
         inkscape:connector-curvature="0"
         id="path2573"
         style="opacity:1;fill:#c33a21;fill-opacity:1;fill-rule:nonzero;stroke:none;stroke-width:0.299845;stop-opacity:1"
         d="M 24.541176,-4.5854618 H 86.410774 C 88.176108,-4.5854618 89.612108,-3.0161285 89.612108,-1.0911952 V 51.70107 C 89.612108,53.624937 88.180108,55.18747 86.410774,55.18747 H 24.541176 C 22.774509,55.18747 21.344243,53.624937 21.344243,51.70107 V -1.0911952 C 21.344243,-3.0161285 22.778643,-4.5854618 24.541176,-4.5854618 Z M 19.935976,-21.353595 C 15.889043,-21.353595 3.599043,-18.437461 3.599043,-3.4963952 V 54.45307 C 3.599043,57.79947 5.9589096,71.402536 19.098509,71.402536 H 91.856107 C 104.99477,71.402536 107.35477,57.79947 107.35477,54.45307 V -3.4963952 C 107.35477,-18.437461 95.069441,-21.353595 91.021441,-21.353595 H 19.935976" />
    </g>
  </g>
</svg>
