<?xml version="1.0" encoding="UTF-8" standalone="no"?>
<svg
   xmlns:osb="http://www.openswatchbook.org/uri/2009/osb"
   xmlns:dc="http://purl.org/dc/elements/1.1/"
   xmlns:cc="http://creativecommons.org/ns#"
   xmlns:rdf="http://www.w3.org/1999/02/22-rdf-syntax-ns#"
   xmlns:svg="http://www.w3.org/2000/svg"
   xmlns="http://www.w3.org/2000/svg"
   xmlns:xlink="http://www.w3.org/1999/xlink"
   xmlns:sodipodi="http://sodipodi.sourceforge.net/DTD/sodipodi-0.dtd"
   xmlns:inkscape="http://www.inkscape.org/namespaces/inkscape"
   style="enable-background:new"
   inkscape:export-ydpi="79.040001"
   inkscape:export-xdpi="79.040001"
   inkscape:export-filename="/home/doctormo/Desktop/shot_screen_stamp_1.0.png"
   sodipodi:docname="1.0_stamp_screens.svg"
   inkscape:version="1.1-dev (081125a829, 2020-04-16, custom)"
   version="1.1"
   id="svg2"
   viewBox="0 0 364.78238 364.42887"
   height="364.42886"
   width="364.78238">
  <sodipodi:namedview
     inkscape:document-rotation="0"
     inkscape:snap-bbox-midpoints="true"
     inkscape:showpageshadow="true"
     borderlayer="false"
     showborder="true"
     showguides="false"
     inkscape:object-paths="false"
     inkscape:snap-midpoints="false"
     inkscape:snap-center="false"
     inkscape:snap-global="false"
     inkscape:snap-intersection-paths="false"
     inkscape:snap-smooth-nodes="true"
     inkscape:object-nodes="true"
     inkscape:bbox-nodes="false"
     inkscape:snap-bbox="true"
     inkscape:window-maximized="1"
     inkscape:window-y="20"
     inkscape:window-x="67"
     inkscape:window-height="852"
     inkscape:window-width="1533"
     inkscape:snap-page="true"
     units="px"
     showgrid="false"
     inkscape:current-layer="g5331-7"
     inkscape:document-units="px"
     inkscape:cy="182.15442"
     inkscape:cx="219.94843"
     inkscape:zoom="1.2370211"
     inkscape:pageshadow="2"
     inkscape:pageopacity="0"
     borderopacity="1.0"
     bordercolor="#666666"
     pagecolor="#ffffff"
     id="base" />
  <defs
     id="defs4">
    <inkscape:path-effect
       back_thickness="0.25"
       front_thickness="1"
       stroke_width_bottom="1"
       stroke_width_top="1"
       fat_output="true"
       bottom_smth_variation="0;1"
       top_smth_variation="0;1"
       scale_tb="1"
       scale_tf="1"
       scale_bb="1"
       scale_bf="1"
       top_tgt_variation="0;1"
       bottom_tgt_variation="0;1"
       top_edge_variation="5.2501494;1"
       bottom_edge_variation="5.2501494;1"
       bender="578.32469,124.21532 , 5,-0.70710678"
       do_bend="true"
       growth="0"
       dist_rdm="75;1"
       direction="574.6578,118.40643 , 8.5357706,1.767767"
       is_visible="true"
       id="path-effect54403"
       effect="rough_hatches" />
    <inkscape:path-effect
       pattern-nodetypes="cccsssccc"
       effect="skeletal"
       id="path-effect11348"
       is_visible="true"
       pattern="m -82.045202,163.73779 v 16.85631 l 19.750362,-0.0335 c 1.258827,-3.16655 4.54292,-4.98086 7.845229,-4.3469 3.302309,0.63397 5.681085,3.53542 5.65532,6.89793 -0.02576,3.36251 -2.448729,6.22717 -5.760367,6.81046 -3.311638,0.58328 -6.567541,-1.28115 -7.759196,-4.41614 l -19.731348,0.0164 v 16.85641"
       copytype="repeated_stretched"
       prop_scale="1"
       scale_y_rel="false"
       spacing="0"
       normal_offset="0.5"
       tang_offset="0"
       prop_units="true"
       vertical_pattern="true"
       fuse_tolerance="0.3" />
    <inkscape:path-effect
       pattern-nodetypes="csscssssssssssssssssssscssssssscsssssssssssscssc"
       fuse_tolerance="0"
       vertical_pattern="false"
       prop_units="false"
       tang_offset="0"
       normal_offset="0"
       spacing="0"
       scale_y_rel="true"
       prop_scale="1"
       copytype="repeated_stretched"
       pattern="m -127.13222,274.60716 c 0.66391,1.24821 0.79139,2.77058 0.34431,4.11181 -0.44708,1.34125 -1.46248,2.48265 -2.74254,3.08287 -0.8233,0.38605 -1.7463,0.55222 -2.65376,0.49397 -0.90745,-0.0583 -1.79793,-0.33928 -2.58292,-0.79826 -1.56997,-0.91796 -2.67955,-2.54354 -3.08437,-4.31656 -0.49643,-2.17434 0.0449,-4.52612 1.28729,-6.37835 1.24236,-1.85223 3.14327,-3.2161 5.2351,-3.98971 3.16534,-1.17063 6.70813,-1.0199 9.95799,-0.10987 3.24987,0.91004 6.2504,2.53931 9.1314,4.29705 2.88099,1.75774 5.68084,3.66057 8.68953,5.18948 3.00869,1.52891 6.269739,2.68514 9.641909,2.8202 3.243338,0.1299 6.46707,-0.69136 9.466062,-1.93318 2.998999,-1.24183 5.804874,-2.89847 8.615204,-4.52271 2.810324,-1.62425 5.651598,-3.22889 8.695857,-4.35521 3.044253,-1.12633 6.32352,-1.76296 9.547466,-1.38576 2.192763,0.25656 4.357539,0.99845 6.111457,2.33927 1.753924,1.34081 3.068463,3.30999 3.408705,5.49133 0.174441,1.11838 0.09274,2.27803 -0.254578,3.35533 -0.347311,1.0773 -0.961298,2.06986 -1.783038,2.84829 -0.82174,0.77842 -1.850734,1.33948 -2.954416,1.59064 -1.103681,0.25116 -2.279297,0.18948 -3.34457,-0.19313 -1.517064,-0.54487 -2.782847,-1.75218 -3.398795,-3.2418 -0.615948,-1.48962 -0.57245,-3.23832 0.116788,-4.69548 -0.51436,1.47888 -0.466539,3.14576 0.131764,4.5927 0.598303,1.44695 1.741657,2.66084 3.150243,3.34458 1.183434,0.57446 2.542466,0.77555 3.843815,0.58316 1.301349,-0.19238 2.540314,-0.77545 3.527951,-1.64442 0.987637,-0.86896 1.721998,-2.01955 2.108651,-3.27693 0.38666,-1.25739 0.426243,-2.61762 0.128036,-3.89886 -0.529103,-2.27329 -2.111805,-4.22908 -4.101667,-5.44901 -1.989861,-1.21993 -4.356304,-1.74271 -6.690346,-1.74567 -3.421566,-0.004 -6.774698,1.06647 -9.833754,2.59923 -3.059051,1.53276 -5.862558,3.52131 -8.66727,5.48109 -2.804706,1.95978 -5.640865,3.90861 -8.743923,5.3502 -3.103057,1.44159 -6.512219,2.36462 -9.927542,2.15794 -3.395824,-0.20549 -6.645229,-1.51588 -9.577599,-3.24071 -2.93237,-1.72483 -5.59505,-3.8639 -8.31994,-5.90077 -2.72489,-2.03686 -5.55023,-3.99384 -8.69546,-5.29054 -3.14522,-1.29669 -6.66055,-1.90177 -9.97993,-1.15644 -2.41769,0.54286 -4.70487,1.83201 -6.22353,3.78996 -0.75932,0.97898 -1.32032,2.11554 -1.60256,3.32191 -0.28223,1.20637 -0.28256,2.48176 0.0319,3.68014 0.51461,1.96139 1.91307,3.69005 3.75977,4.52764 0.92335,0.4188 1.94693,0.61779 2.9594,0.56414 1.01246,-0.0537 2.01187,-0.36089 2.87373,-0.89488 1.16591,-0.72238 2.06702,-1.86229 2.50074,-3.16347 0.43373,-1.30117 0.39679,-2.75376 -0.10251,-4.03121"
       is_visible="true"
       id="path-effect7020"
       effect="skeletal" />
    <linearGradient
       gradientTransform="matrix(1.6361073,0,0,1.6361073,-1064.5199,667.97105)"
       osb:paint="solid"
       id="linearGradient6851">
      <stop
         id="stop6853"
         offset="0"
         style="stop-color:#e3ebf7;stop-opacity:1;" />
    </linearGradient>
    <inkscape:path-effect
       effect="spiro"
       id="path-effect6770"
       is_visible="true" />
    <inkscape:path-effect
       effect="spiro"
       id="path-effect6766"
       is_visible="true" />
    <inkscape:path-effect
       effect="spiro"
       id="path-effect6762"
       is_visible="true" />
    <inkscape:path-effect
       is_visible="true"
       id="path-effect6758"
       effect="spiro" />
    <inkscape:path-effect
       is_visible="true"
       id="path-effect6754"
       effect="spiro" />
    <inkscape:path-effect
       pattern-nodetypes="csssssssssssssscssssssssssssssc"
       fuse_tolerance="0.1"
       vertical_pattern="true"
       prop_units="false"
       tang_offset="0"
       normal_offset="0"
       spacing="0"
       scale_y_rel="true"
       prop_scale="1"
       copytype="single_stretched"
       pattern="m 510.40137,1167.7612 c 3.22922,-43.2246 8.37332,-341.0442 9.69563,-384.36393 1.29,-42.26132 2.189,-127.67462 4.1498,-169.14152 0.93832,-19.84341 7.14004,-52.50325 10.04998,-65.1979 3.06295,-13.36215 4.86861,-25.17993 6.36055,-38.894 2.83907,-26.09704 2.34779,-53.98623 -0.99002,-79.60235 -2.2425,-17.21017 -5.00096,-34.24092 -9.11311,-49.35577 -2.10185,-7.72564 -3.52567,-10.19869 -6.11317,-16.91939 -1.54164,-4.00423 -6.04343,-12.90314 -4.82526,-18.51572 1.50992,-6.9568 2.27716,-12.23415 6.67968,-17.50233 3.29927,-3.948 9.54765,-18.42215 9.85641,-24.45943 0.2089,-4.08476 -1.38133,-11.85616 -1.77881,-16.01003 -0.50083,-5.23397 2.15849,-6.96415 -1.24623,-10.5216 -5.11559,-5.34507 -6.31082,-9.8281 -8.27005,-16.69151 -1.76141,-6.17042 -5.10922,-10.17778 -10.08491,-14.65457 -1.80421,-1.6233 -1.92057,-2.44157 -4.37051,-2.26123 -2.44994,-0.18034 -2.5663,0.63793 -4.37051,2.26123 -4.97569,4.47679 -8.3235,8.48415 -10.08491,14.65457 -1.95923,6.86341 -3.15446,11.34644 -8.27005,16.69151 -3.40472,3.55745 -0.7454,5.28763 -1.24623,10.5216 -0.39748,4.15387 -1.98771,11.92527 -1.77881,16.01003 0.30876,6.03728 6.55714,20.51143 9.85641,24.45943 4.40252,5.26818 5.16976,10.54553 6.67968,17.50233 1.21817,5.61258 -3.28362,14.51149 -4.82526,18.51572 -2.5875,6.7207 -4.01132,9.19375 -6.11317,16.91939 -4.11215,15.11485 -6.87061,32.1456 -9.11311,49.35577 -3.33781,25.61612 -3.82909,53.50531 -0.99002,79.60235 1.49194,13.71407 3.2976,25.53185 6.36055,38.894 2.90994,12.69465 9.11166,45.35449 10.04998,65.1979 1.9608,41.4669 2.8598,126.8802 4.1498,169.14152 1.32231,43.31973 6.46641,341.13933 9.69563,384.36393"
       is_visible="true"
       id="path-effect6747"
       effect="skeletal" />
    <inkscape:path-effect
       linkedpath=""
       allow_transforms="false"
       method="bsplinespiro"
       linkeditem="m 257.62762,331.92694 c 7.20901,39.43642 -25.75204,69.08955 -69.03093,69.08955 -43.27888,0 -81.0286,-30.22686 -62.33184,-65.68997 10.47326,-19.86516 2.92595,-26.28757 11.82571,-38.6231 14.61183,-20.25274 34.10843,-26.28344 61.00511,-26.28344 43.27888,0 51.41414,22.56944 58.53195,61.50696 z"
       is_visible="true"
       id="path-effect56492"
       effect="clone_original" />
    <inkscape:path-effect
       linkedpath=""
       allow_transforms="false"
       method="bsplinespiro"
       linkeditem="m 217.41952,449.54263 c 20.40925,-20.10821 21.20554,-43.00797 35.97407,-33.30624 17.20547,11.30261 0.4946,101.30707 -32.71748,90.69208 -48.79949,-15.59692 -18.1809,-42.68169 -3.25659,-57.38584 z"
       is_visible="true"
       id="path-effect56411"
       effect="clone_original" />
    <inkscape:path-effect
       linkedpath=""
       allow_transforms="false"
       method="bsplinespiro"
       linkeditem="m 222.2021,452.89491 c 22.34119,-27.28441 15.00477,-40.57682 29.7733,-30.87509 17.20547,11.30261 -3.39258,131.46717 -36.69287,94.8974 -33.3003,-36.56976 6.91957,-64.02231 6.91957,-64.02231 z"
       is_visible="true"
       id="path-effect56372"
       effect="clone_original" />
    <inkscape:path-effect
       linkedpath=""
       allow_transforms="false"
       method="bsplinespiro"
       linkeditem="m 265.38705,473.39157 c 32.6126,53.30978 14.05289,103.92358 -36.52225,103.92358 -22.67958,0 -39.09734,4.58861 -60.91977,-15.01553 -20.37595,-18.3047 -22.15675,-58.59794 -7.27043,-91.26732 21.29002,-46.72289 -11.5047,-78.54156 30.75685,-80.17213 10.78892,-0.41627 25.68393,-17.85701 27.68319,-11.53756 6.51877,20.60518 19.13161,49.70358 46.27241,94.06896 z"
       is_visible="true"
       id="path-effect56333"
       effect="clone_original" />
    <inkscape:path-effect
       linkedpath=""
       allow_transforms="false"
       method="bsplinespiro"
       linkeditem="m 222.2021,452.89491 c 22.34119,-27.28441 15.00477,-40.57682 29.7733,-30.87509 17.20547,11.30261 -3.39258,131.46717 -36.69287,94.8974 -33.3003,-36.56976 6.91957,-64.02231 6.91957,-64.02231 z"
       is_visible="false"
       id="path-effect56251"
       effect="clone_original" />
    <inkscape:path-effect
       effect="sketch"
       id="path-effect5585"
       is_visible="true"
       nbiter_approxstrokes="2"
       strokelength="100"
       strokelength_rdm="0.3;1"
       strokeoverlap="0.3"
       strokeoverlap_rdm="0.3;1"
       ends_tolerance="0.1;1"
       parallel_offset="0;1"
       tremble_size="2.7;1"
       tremble_frequency="2.51"
       nbtangents="0"
       tgt_places_rdmness="1;1"
       tgtscale="10"
       tgtlength="100"
       tgtlength_rdm="0.3;1" />
    <filter
       style="color-interpolation-filters:sRGB"
       id="filter5342"
       inkscape:label="Tampon">
      <feTurbulence
         id="feTurbulence5344"
         type="turbulence"
         baseFrequency="0.01"
         numOctaves="6"
         seed="6"
         result="result1" />
      <feTurbulence
         id="feTurbulence5368"
         baseFrequency="0.098000000000000004"
         numOctaves="3" />
      <feBlend
         mode="multiply"
         id="feBlend5370"
         in2="result1" />
      <feComponentTransfer
         id="feComponentTransfer5358"
         result="result2">
        <feFuncR
           id="feFuncR5360"
           type="discrete"
           tableValues="0" />
        <feFuncG
           id="feFuncG5362"
           type="discrete"
           tableValues="0" />
        <feFuncB
           id="feFuncB5364"
           type="discrete"
           tableValues="0" />
        <feFuncA
           id="feFuncA5366"
           type="discrete"
           tableValues="0 0 1 1 1 1 1" />
      </feComponentTransfer>
      <feComposite
         id="feComposite5374"
         in2="result2"
         operator="in"
         in="SourceGraphic"
         result="result3" />
      <feDisplacementMap
         id="feDisplacementMap5376"
         in2="result1"
         xChannelSelector="R"
         yChannelSelector="G"
         scale="6.4"
         result="result4" />
      <feBlend
         mode="screen"
         id="feBlend5378"
         in2="result3" />
    </filter>
    <filter
       y="-0.15000001"
       height="1.3"
       x="-0.15000001"
       width="1.3"
       inkscape:menu-tooltip="Aquarelle paper effect which can be used for pictures as for objects"
       inkscape:menu="Textures"
       inkscape:label="Rough Paper"
       style="color-interpolation-filters:sRGB"
       id="filter5433">
      <feTurbulence
         type="fractalNoise"
         baseFrequency="0.011999999999999976"
         numOctaves="5"
         seed="0"
         result="result4"
         id="feTurbulence5435" />
      <feDisplacementMap
         in="SourceGraphic"
         in2="result4"
         yChannelSelector="G"
         xChannelSelector="R"
         scale="10"
         result="result3"
         id="feDisplacementMap5437" />
      <feDiffuseLighting
         lighting-color="#e9e6d7"
         diffuseConstant="1"
         surfaceScale="0.5"
         result="result1"
         in="result4"
         id="feDiffuseLighting5439">
        <feDistantLight
           azimuth="235"
           elevation="40"
           id="feDistantLight5441" />
      </feDiffuseLighting>
      <feComposite
         operator="in"
         in="result3"
         in2="result1"
         result="result2"
         id="feComposite5443" />
      <feComposite
         k4="0"
         k3="0"
         k2="0"
         in2="result1"
         result="result5"
         operator="arithmetic"
         k1="1.7"
         id="feComposite5445" />
      <feBlend
         in="result5"
         in2="result3"
         mode="normal"
         id="feBlend5447" />
    </filter>
    <filter
       style="color-interpolation-filters:sRGB"
       id="filter5342-8-1"
       inkscape:label="Tampon">
      <feTurbulence
         id="feTurbulence5344-7-5"
         type="turbulence"
         baseFrequency="0.0090000000000000011"
         numOctaves="6"
         seed="6"
         result="result1" />
      <feTurbulence
         id="feTurbulence5368-9-5"
         baseFrequency="0.098000000000000004"
         numOctaves="3" />
      <feBlend
         mode="multiply"
         id="feBlend5370-2-4"
         in2="result1" />
      <feComponentTransfer
         id="feComponentTransfer5358-0-7"
         result="result2">
        <feFuncR
           id="feFuncR5360-2-6"
           type="discrete"
           tableValues="0" />
        <feFuncG
           id="feFuncG5362-3-5"
           type="discrete"
           tableValues="0" />
        <feFuncB
           id="feFuncB5364-7-6"
           type="discrete"
           tableValues="0" />
        <feFuncA
           id="feFuncA5366-5-9"
           type="discrete"
           tableValues="0 0 1 1 1 1 1" />
      </feComponentTransfer>
      <feComposite
         id="feComposite5374-9-3"
         in2="result2"
         operator="in"
         in="SourceGraphic"
         result="result3" />
      <feDisplacementMap
         id="feDisplacementMap5376-2-7"
         in2="result1"
         xChannelSelector="R"
         yChannelSelector="G"
         scale="6.4"
         result="result4" />
    </filter>
    <circle
       transform="rotate(-149.85394,395.04818,529.10266)"
       r="184.77254"
       cy="316.49588"
       cx="392.64163"
       id="circle5318-8-4"
       style="color:#000000;clip-rule:nonzero;display:inline;overflow:visible;visibility:visible;opacity:1;isolation:auto;mix-blend-mode:normal;color-interpolation:sRGB;color-interpolation-filters:linearRGB;solid-color:#000000;solid-opacity:1;fill:none;fill-opacity:1;fill-rule:nonzero;stroke:none;stroke-width:1;stroke-linecap:butt;stroke-linejoin:miter;stroke-miterlimit:4;stroke-dasharray:none;stroke-dashoffset:0;stroke-opacity:1;marker:none;marker-start:none;marker-mid:none;marker-end:none;paint-order:normal;color-rendering:auto;image-rendering:auto;shape-rendering:auto;text-rendering:auto;enable-background:accumulate" />
    <circle
       style="color:#000000;clip-rule:nonzero;display:inline;overflow:visible;visibility:visible;opacity:1;isolation:auto;mix-blend-mode:normal;color-interpolation:sRGB;color-interpolation-filters:linearRGB;solid-color:#000000;solid-opacity:1;fill:none;fill-opacity:1;fill-rule:nonzero;stroke:none;stroke-width:1;stroke-linecap:butt;stroke-linejoin:miter;stroke-miterlimit:4;stroke-dasharray:none;stroke-dashoffset:0;stroke-opacity:1;marker:none;marker-start:none;marker-mid:none;marker-end:none;paint-order:normal;color-rendering:auto;image-rendering:auto;shape-rendering:auto;text-rendering:auto;enable-background:accumulate"
       id="circle5323-9-5"
       cx="392.64163"
       cy="316.49588"
       r="234.26518"
       transform="matrix(-0.90266723,0.43033925,0.43033925,0.90266723,508.58097,259.5029)" />
    <inkscape:path-effect
       effect="sketch"
       id="path-effect5585-05"
       is_visible="true"
       nbiter_approxstrokes="2"
       strokelength="100"
       strokelength_rdm="0.3;1"
       strokeoverlap="0.3"
       strokeoverlap_rdm="0.3;1"
       ends_tolerance="0.1;1"
       parallel_offset="0;1"
       tremble_size="2.7;1"
       tremble_frequency="2.51"
       nbtangents="0"
       tgt_places_rdmness="1;1"
       tgtscale="10"
       tgtlength="100"
       tgtlength_rdm="0.3;1" />
    <inkscape:path-effect
       tgtlength_rdm="0.3;1"
       tgtlength="100"
       tgtscale="10"
       tgt_places_rdmness="1;1"
       nbtangents="0"
       tremble_frequency="2.51"
       tremble_size="2.7;1"
       parallel_offset="0;1"
       ends_tolerance="0.1;1"
       strokeoverlap_rdm="0.3;1"
       strokeoverlap="0.3"
       strokelength_rdm="0.3;1"
       strokelength="100"
       nbiter_approxstrokes="2"
       is_visible="false"
       id="path-effect41901-6"
       effect="sketch" />
    <inkscape:path-effect
       tgtlength_rdm="0.3;1"
       tgtlength="100"
       tgtscale="10"
       tgt_places_rdmness="1;1"
       nbtangents="0"
       tremble_frequency="2.51"
       tremble_size="2.7;1"
       parallel_offset="0;1"
       ends_tolerance="0.1;1"
       strokeoverlap_rdm="0.3;1"
       strokeoverlap="0.3"
       strokelength_rdm="0.3;1"
       strokelength="100"
       nbiter_approxstrokes="2"
       is_visible="false"
       id="path-effect41905-0"
       effect="sketch" />
    <inkscape:path-effect
       tgtlength_rdm="0.3;1"
       tgtlength="100"
       tgtscale="10"
       tgt_places_rdmness="1;1"
       nbtangents="0"
       tremble_frequency="2.51"
       tremble_size="2.7;1"
       parallel_offset="0;1"
       ends_tolerance="0.1;1"
       strokeoverlap_rdm="0.3;1"
       strokeoverlap="0.3"
       strokelength_rdm="0.3;1"
       strokelength="100"
       nbiter_approxstrokes="2"
       is_visible="false"
       id="path-effect41909-2"
       effect="sketch" />
    <inkscape:path-effect
       tgtlength_rdm="0.3;1"
       tgtlength="100"
       tgtscale="10"
       tgt_places_rdmness="1;1"
       nbtangents="0"
       tremble_frequency="2.51"
       tremble_size="2.7;1"
       parallel_offset="0;1"
       ends_tolerance="0.1;1"
       strokeoverlap_rdm="0.3;1"
       strokeoverlap="0.3"
       strokelength_rdm="0.3;1"
       strokelength="100"
       nbiter_approxstrokes="2"
       is_visible="false"
       id="path-effect41913-7"
       effect="sketch" />
    <inkscape:path-effect
       tgtlength_rdm="0.3;1"
       tgtlength="100"
       tgtscale="10"
       tgt_places_rdmness="1;1"
       nbtangents="0"
       tremble_frequency="2.51"
       tremble_size="2.7;1"
       parallel_offset="0;1"
       ends_tolerance="0.1;1"
       strokeoverlap_rdm="0.3;1"
       strokeoverlap="0.3"
       strokelength_rdm="0.3;1"
       strokelength="100"
       nbiter_approxstrokes="2"
       is_visible="false"
       id="path-effect41919-6"
       effect="sketch" />
    <inkscape:path-effect
       tgtlength_rdm="0.3;1"
       tgtlength="100"
       tgtscale="10"
       tgt_places_rdmness="1;1"
       nbtangents="0"
       tremble_frequency="2.51"
       tremble_size="2.7;1"
       parallel_offset="0;1"
       ends_tolerance="0.1;1"
       strokeoverlap_rdm="0.3;1"
       strokeoverlap="0.3"
       strokelength_rdm="0.3;1"
       strokelength="100"
       nbiter_approxstrokes="2"
       is_visible="false"
       id="path-effect41923-1"
       effect="sketch" />
    <inkscape:path-effect
       tgtlength_rdm="0.3;1"
       tgtlength="100"
       tgtscale="10"
       tgt_places_rdmness="1;1"
       nbtangents="0"
       tremble_frequency="2.51"
       tremble_size="2.7;1"
       parallel_offset="0;1"
       ends_tolerance="0.1;1"
       strokeoverlap_rdm="0.3;1"
       strokeoverlap="0.3"
       strokelength_rdm="0.3;1"
       strokelength="100"
       nbiter_approxstrokes="2"
       is_visible="false"
       id="path-effect41927-3"
       effect="sketch" />
    <inkscape:path-effect
       effect="sketch"
       id="path-effect5585-05-90"
       is_visible="true"
       nbiter_approxstrokes="2"
       strokelength="100"
       strokelength_rdm="0.3;1"
       strokeoverlap="0.3"
       strokeoverlap_rdm="0.3;1"
       ends_tolerance="0.1;1"
       parallel_offset="0;1"
       tremble_size="2.7;1"
       tremble_frequency="2.51"
       nbtangents="0"
       tgt_places_rdmness="1;1"
       tgtscale="10"
       tgtlength="100"
       tgtlength_rdm="0.3;1" />
    <filter
       id="filter6821"
       style="color-interpolation-filters:sRGB"
       inkscape:menu-tooltip="Inky splotches underneath the object"
       inkscape:menu="Protrusions"
       inkscape:label="Ink Bleed">
      <feGaussianBlur
         id="feGaussianBlur6823"
         stdDeviation="1.3"
         in="SourceGraphic"
         result="result1" />
      <feTurbulence
         id="feTurbulence6825"
         baseFrequency="0.034"
         numOctaves="4"
         result="result0" />
      <feDisplacementMap
         id="feDisplacementMap6827"
         in2="result0"
         in="result1"
         xChannelSelector="R"
         yChannelSelector="G"
         scale="19.6"
         result="result2" />
      <feColorMatrix
         id="feColorMatrix6829"
         result="result3"
         values="2 0 0 0 0 0 2 0 0 0 0 0 2 0 0 0 0 0 0.7 0" />
      <feGaussianBlur
         id="feGaussianBlur6831"
         stdDeviation="1.1"
         in="SourceGraphic"
         result="result4" />
      <feComposite
         id="feComposite6833"
         in2="result3"
         in="result4" />
    </filter>
    <clipPath
       clipPathUnits="userSpaceOnUse"
       id="clipPath11351">
      <path
         transform="translate(-52.325907,371.90339)"
         style="display:inline;fill:none;fill-rule:evenodd;stroke:#000000;stroke-width:1px;stroke-linecap:butt;stroke-linejoin:miter;stroke-opacity:1;filter:url(#filter11312)"
         d="m 52.325907,659.74511 c 0,-5.66167 0,-11.32333 0,-16.985 6.583454,0.0112 13.166908,0.0225 19.750362,0.0338 1.258827,3.19072 4.54292,5.01888 7.845229,4.38008 3.302309,-0.63881 5.681085,-3.56241 5.65532,-6.95059 -0.02576,-3.38818 -2.448729,-6.27471 -5.760367,-6.86245 -3.311638,-0.58774 -6.567541,1.29093 -7.759196,4.44985 -6.577116,-0.006 -13.154232,-0.011 -19.731348,-0.0165 0,-5.6617 0,-11.3234 0,-16.9851 0,-5.66167 0,-11.32333 0,-16.985 6.583454,0.0112 13.166908,0.0225 19.750362,0.0338 1.258827,3.19072 4.54292,5.01888 7.845229,4.38008 3.302309,-0.63881 5.681085,-3.56241 5.65532,-6.95059 -0.02576,-3.38818 -2.448729,-6.27471 -5.760367,-6.86245 -3.311638,-0.58774 -6.567541,1.29093 -7.759196,4.44985 -6.577116,-0.006 -13.154232,-0.011 -19.731348,-0.0165 0,-5.66169 0,-11.32339 0,-16.98509 0,-5.66167 0,-11.32334 0,-16.985 6.583454,0.0113 13.166908,0.0225 19.750362,0.0338 1.258827,3.19073 4.54292,5.01889 7.845229,4.38009 3.302309,-0.63881 5.681085,-3.56241 5.65532,-6.95059 -0.02576,-3.38818 -2.448729,-6.27471 -5.760367,-6.86246 -3.311638,-0.58773 -6.567541,1.29093 -7.759196,4.44986 -6.577116,-0.006 -13.154232,-0.011 -19.731348,-0.0165 0,-5.6617 0,-11.3234 0,-16.9851 0,-5.66166 0,-11.32333 0,-16.985 6.583454,0.0113 13.166908,0.0225 19.750362,0.0338 1.258827,3.19073 4.54292,5.01889 7.845229,4.38009 3.302309,-0.63881 5.681085,-3.56241 5.65532,-6.95059 -0.02576,-3.38819 -2.448729,-6.27472 -5.760367,-6.86246 -3.311638,-0.58773 -6.567541,1.29093 -7.759196,4.44986 -6.577116,-0.006 -13.154232,-0.011 -19.731348,-0.0165 0,-5.6617 0,-11.3234 0,-16.9851 0,-5.66166 0,-11.32333 0,-16.985 6.583454,0.0113 13.166908,0.0225 19.750362,0.0338 1.258827,3.19072 4.54292,5.01888 7.845229,4.38008 3.302309,-0.63881 5.681085,-3.56241 5.65532,-6.95059 -0.02576,-3.38818 -2.448729,-6.27471 -5.760367,-6.86245 -3.311638,-0.58773 -6.567541,1.29093 -7.759196,4.44985 -6.577116,-0.005 -13.154232,-0.011 -19.731348,-0.0165 0,-5.6617 0,-11.3234 0,-16.9851 0,-5.66167 0,-11.32333 0,-16.985 6.583454,0.0113 13.166908,0.0225 19.750362,0.0338 1.258827,3.19072 4.54292,5.01888 7.845229,4.38008 3.302309,-0.63881 5.681085,-3.56241 5.65532,-6.95059 -0.02576,-3.38818 -2.448729,-6.27471 -5.760367,-6.86245 -3.311638,-0.58774 -6.567541,1.29093 -7.759196,4.44985 -6.577116,-0.006 -13.154232,-0.011 -19.731348,-0.0165 0,-5.6617 0,-11.3234 0,-16.9851 0,-5.66167 0,-11.32334 0,-16.985 6.583454,0.0113 13.166908,0.0225 19.750362,0.0337 1.258827,3.19073 4.54292,5.01889 7.845229,4.38009 3.302309,-0.63881 5.681085,-3.56241 5.65532,-6.95059 -0.02576,-3.38818 -2.448729,-6.27471 -5.760367,-6.86246 -3.311638,-0.58773 -6.567541,1.29094 -7.759196,4.44986 -6.577116,-0.006 -13.154232,-0.011 -19.731348,-0.0165 0,-5.6617 0,-11.3234 0,-16.9851 0,-5.66166 0,-11.32333 0,-16.98499 6.583454,0.0113 13.166908,0.0225 19.750362,0.0337 1.258827,3.19073 4.54292,5.01889 7.845229,4.38009 3.302309,-0.63881 5.681085,-3.56241 5.65532,-6.95059 -0.02576,-3.38818 -2.448729,-6.27471 -5.760367,-6.86246 -3.311638,-0.58773 -6.567541,1.29093 -7.759196,4.44986 -6.577116,-0.006 -13.154232,-0.011 -19.731348,-0.0165 0,-5.6617 0,-11.3234 0,-16.9851 10e-7,-5.66166 10e-7,-11.32333 10e-7,-16.985 6.583454,0.0113 13.166908,0.0225 19.750362,0.0338 1.258827,3.19072 4.54292,5.01889 7.845229,4.38009 3.302309,-0.63881 5.681085,-3.56242 5.65532,-6.9506 -0.02576,-3.38818 -2.448729,-6.27471 -5.760367,-6.86245 -3.311638,-0.58773 -6.567541,1.29093 -7.759196,4.44985 -6.577116,-0.005 -13.154232,-0.011 -19.731348,-0.0165 0,-5.6617 0,-11.3234 0,-16.9851 0,-5.66167 0,-11.32333 0,-16.985 6.583454,0.0112 13.166908,0.0225 19.750362,0.0338 1.258827,3.19072 4.54292,5.01888 7.845229,4.38008 3.302309,-0.63881 5.681085,-3.56241 5.65532,-6.95059 -0.02576,-3.38818 -2.448729,-6.27471 -5.760367,-6.86245 -3.311638,-0.58774 -6.567541,1.29093 -7.759196,4.44985 -6.577116,-0.006 -13.154232,-0.011 -19.731348,-0.0165 0,-5.6617 0,-11.3234 0,-16.9851 0,-5.66167 0,-11.32333 0,-16.985 6.583454,0.0113 13.166908,0.0225 19.750362,0.0338 1.258827,3.19072 4.54292,5.01888 7.845229,4.38008 3.302309,-0.63881 5.681085,-3.56241 5.65532,-6.95059 -0.02576,-3.38818 -2.448729,-6.27471 -5.760367,-6.86245 -3.311638,-0.58774 -6.567541,1.29093 -7.759196,4.44985 -6.577116,-0.006 -13.154232,-0.011 -19.731348,-0.0165 0,-5.6617 0,-11.3234 0,-16.9851 0,-5.66167 0,-11.32334 0,-16.985 6.583454,0.0113 13.166908,0.0225 19.750362,0.0337 1.258827,3.19073 4.54292,5.01889 7.845229,4.38009 3.302309,-0.63881 5.681085,-3.56241 5.65532,-6.95059 -0.02576,-3.38818 -2.448729,-6.27471 -5.760367,-6.86246 -3.311638,-0.58773 -6.567541,1.29093 -7.759196,4.44986 -6.577116,-0.006 -13.154232,-0.011 -19.731348,-0.0165 0,-5.6617 0,-11.3234 0,-16.9851 0,-5.66166 0,-11.32333 0,-16.98499 6.583454,0.0113 13.166908,0.0225 19.750362,0.0337 1.258827,3.19073 4.54292,5.01889 7.845229,4.38009 3.302309,-0.63881 5.681085,-3.56241 5.65532,-6.95059 -0.02576,-3.38819 -2.448729,-6.27472 -5.760367,-6.86246 -3.311638,-0.58773 -6.567541,1.29093 -7.759196,4.44986 -6.577116,-0.006 -13.154232,-0.011 -19.731348,-0.0165 0,-5.6617 0,-11.3234 0,-16.9851 0,-5.66166 0,-11.32333 0,-16.985 6.583454,0.0113 13.166908,0.0225 19.750362,0.0338 1.258827,3.19072 4.54292,5.01888 7.845229,4.38008 3.302309,-0.63881 5.681085,-3.56241 5.65532,-6.95059 -0.02576,-3.38818 -2.448729,-6.27471 -5.760367,-6.86245 -3.311638,-0.58773 -6.567541,1.29093 -7.759196,4.44985 -6.577116,-0.006 -13.154232,-0.011 -19.731348,-0.0165 0,-5.6617 0,-11.3234 0,-16.9851 0,-5.66167 0,-11.32333 0,-16.984999 6.583454,0.01125 13.166908,0.0225 19.750362,0.03376 1.258827,3.190719 4.54292,5.018879 7.845229,4.380079 3.302309,-0.63881 5.681085,-3.562404 5.65532,-6.950585 -0.02576,-3.388181 -2.448729,-6.274711 -5.760367,-6.862454 -3.311638,-0.587733 -6.567541,1.290931 -7.759196,4.449855 -6.577116,-0.0055 -13.154232,-0.01102 -19.731348,-0.01653 0,-5.661699 0,-11.323399 0,-16.985099 0,-5.661666 0,-11.323332 0,-16.984998 6.583454,0.01125 13.166908,0.0225 19.750362,0.03375 1.258827,3.190725 4.54292,5.018887 7.845229,4.380087 3.302309,-0.63881 5.681085,-3.562411 5.65532,-6.950592 -0.02576,-3.388181 -2.448729,-6.274711 -5.760367,-6.862454 -3.311638,-0.587733 -6.567541,1.290931 -7.759196,4.449854 -6.577116,-0.0055 -13.154232,-0.01102 -19.731348,-0.01652 0,-5.661699 0,-11.323399 0,-16.985099 l 749.999992,-5.62e-4 v 624.999997 z"
         id="path11353"
         inkscape:connector-curvature="0" />
    </clipPath>
    <clipPath
       clipPathUnits="userSpaceOnUse"
       id="clipPath13830">
      <path
         sodipodi:nodetypes="ccsssccccc"
         inkscape:connector-curvature="0"
         d="m 0,0 c 0,60 11.995505,120.78921 43.180328,139.98361 l 236.262292,196.88524 c 27.57341,22.97784 57.70381,49.63115 95.55738,49.63115 37.85357,0 67.98397,-26.65331 95.55738,-49.63115 l 236.26229,-196.88524 c 31.18483,-19.1944 43.18033,-79.98361 43.18033,-139.98361 v 625 h -750 z"
         style="fill:#00ffff;fill-opacity:1;fill-rule:evenodd;stroke:none;stroke-width:1px;stroke-linecap:butt;stroke-linejoin:miter;stroke-opacity:1"
         transform="matrix(-1.5946494,-0.37000392,-0.37000392,1.5946494,1230.1154,544.00167)"
         id="path13832" />
    </clipPath>
    <clipPath
       clipPathUnits="userSpaceOnUse"
       id="clipPath13850">
      <path
         id="path13852"
         transform="matrix(-0.99999999,-3.1788591e-6,-3.1788591e-6,0.99999999,750.00002,0.00237234)"
         style="fill:#00ff00;fill-opacity:1;fill-rule:evenodd;stroke:none;stroke-width:1px;stroke-linecap:butt;stroke-linejoin:miter;stroke-opacity:1"
         d="m 0,0 c 0,60 11.995505,120.78921 43.180328,139.98361 l 236.262292,196.88524 c 27.57341,22.97784 57.70381,49.63115 95.55738,49.63115 37.85357,0 67.98397,-26.65331 95.55738,-49.63115 l 236.26229,-196.88524 c 31.18483,-19.1944 43.18033,-79.98361 43.18033,-139.98361 z"
         inkscape:connector-curvature="0"
         sodipodi:nodetypes="ccsssccc" />
    </clipPath>
    <clipPath
       clipPathUnits="userSpaceOnUse"
       id="clipPath13964">
      <path
         transform="translate(5.0443397e-6,2.8247456e-6)"
         style="fill:#00ffff;fill-opacity:1;fill-rule:evenodd;stroke:none;stroke-width:1px;stroke-linecap:butt;stroke-linejoin:miter;stroke-opacity:1"
         d="m 0,625 375,-312.5 375,312.5 z"
         id="path13966"
         inkscape:connector-curvature="0" />
    </clipPath>
    <clipPath
       clipPathUnits="userSpaceOnUse"
       id="clipPath13996">
      <path
         style="fill:none;fill-opacity:1;fill-rule:evenodd;stroke:#00ffff;stroke-width:0.61086893px;stroke-linecap:butt;stroke-linejoin:miter;stroke-opacity:1"
         d="m 0,0 v 625 l 313.43555,-261.19727 c -11.93289,-8.32174 -23.16144,-17.90796 -33.99219,-26.93359 l -236.263672,-196.88476 c -31.18483,-19.1944 -43.179688,-79.984381 -43.179688,-139.98438 z m 750,0 c 0,59.999999 -11.99486,120.78998 -43.17969,139.98438 l -236.26367,196.88476 c -10.83075,9.02563 -22.0593,18.61185 -33.99219,26.93359 l 313.43555,261.19727 z"
         id="path13998"
         inkscape:connector-curvature="0"
         transform="matrix(1.5946494,0.37000392,-0.37000392,1.5946494,34.128309,266.49873)" />
    </clipPath>
    <clipPath
       clipPathUnits="userSpaceOnUse"
       id="clipPath4649">
      <path
         sodipodi:nodetypes="ccsssccc"
         inkscape:connector-curvature="0"
         d="m 0,0 c 0,60 11.995505,120.78921 43.180328,139.98361 l 236.262292,196.88524 c 27.57341,22.97784 57.70381,49.63115 95.55738,49.63115 37.85357,0 67.98397,-26.65331 95.55738,-49.63115 l 236.26229,-196.88524 c 31.18483,-19.1944 43.18033,-79.98361 43.18033,-139.98361 z"
         style="fill:none;fill-opacity:1;fill-rule:evenodd;stroke:#00ff00;stroke-width:3;stroke-linecap:butt;stroke-linejoin:miter;stroke-miterlimit:4;stroke-dasharray:none;stroke-opacity:1"
         transform="matrix(-1,0,0,1,750,0)"
         id="path4651" />
    </clipPath>
    <clipPath
       clipPathUnits="userSpaceOnUse"
       id="clipPath6851">
      <path
         style="fill:none;fill-opacity:1;fill-rule:evenodd;stroke:#00ff00;stroke-width:1px;stroke-linecap:butt;stroke-linejoin:miter;stroke-opacity:1"
         d="m 313.43555,363.80273 -313.43555,261.19727 h 750 l -313.43555,-261.19727 c -18.44637,12.86412 -38.57965,22.69727 -61.56445,22.69727 -22.9848,0 -43.11808,-9.83315 -61.56445,-22.69727 z"
         id="path6853"
         inkscape:connector-curvature="0" />
    </clipPath>
    <filter
       style="color-interpolation-filters:sRGB"
       id="filter7371"
       inkscape:label="Sign">
      <feFlood
         id="feFlood7401"
         flood-color="rgb(0,0,0)"
         result="result7" />
      <feOffset
         dx="-4"
         dy="-2"
         id="feOffset7385"
         in="SourceAlpha"
         result="result4" />
      <feComposite
         id="feComposite7399"
         operator="in"
         in2="result4"
         result="result3"
         in="result7" />
      <feComponentTransfer
         id="feComponentTransfer7433"
         in="result7"
         result="result8">
        <feFuncR
           id="feFuncR7435"
           type="table"
           tableValues="1 0" />
        <feFuncG
           id="feFuncG7437"
           type="table"
           tableValues="1 0" />
        <feFuncB
           id="feFuncB7439"
           type="table"
           tableValues="1 0" />
        <feFuncA
           id="feFuncA7441"
           type="identity" />
      </feComponentTransfer>
      <feOffset
         dx="1"
         dy="1"
         id="feOffset7397"
         in="SourceAlpha"
         result="result2" />
      <feComposite
         id="feComposite7377"
         in2="result2"
         in="result8"
         operator="in"
         result="result1" />
      <feColorMatrix
         id="feColorMatrix7449"
         in="SourceGraphic"
         result="result10"
         values="0.9 0 0 0 0 0 0.9 0 0 0 0 0 0.9 0 0 0 0 0 1 0 " />
      <feComposite
         id="feComposite7403"
         in2="result1"
         in="result10"
         result="result5" />
      <feGaussianBlur
         stdDeviation="0.40000000000000002"
         id="feGaussianBlur7447"
         result="result9" />
      <feComposite
         k4="0"
         k3="0"
         id="feComposite7417"
         in="BackgroundImage"
         operator="arithmetic"
         k1="1"
         k2="0.5"
         result="result6"
         in2="result9" />
      <feMerge
         id="feMerge7443">
        <feMergeNode
           inkscape:collect="always"
           id="feMergeNode7445"
           in="result6" />
      </feMerge>
    </filter>
    <inkscape:path-effect
       effect="sketch"
       id="path-effect5585-05-3"
       is_visible="true"
       nbiter_approxstrokes="2"
       strokelength="100"
       strokelength_rdm="0.3;1"
       strokeoverlap="0.3"
       strokeoverlap_rdm="0.3;1"
       ends_tolerance="0.1;1"
       parallel_offset="0;1"
       tremble_size="2.7;1"
       tremble_frequency="2.51"
       nbtangents="0"
       tgt_places_rdmness="1;1"
       tgtscale="10"
       tgtlength="100"
       tgtlength_rdm="0.3;1" />
    <inkscape:path-effect
       effect="sketch"
       id="path-effect5585-05-5"
       is_visible="true"
       nbiter_approxstrokes="2"
       strokelength="100"
       strokelength_rdm="0.3;1"
       strokeoverlap="0.3"
       strokeoverlap_rdm="0.3;1"
       ends_tolerance="0.1;1"
       parallel_offset="0;1"
       tremble_size="2.7;1"
       tremble_frequency="2.51"
       nbtangents="0"
       tgt_places_rdmness="1;1"
       tgtscale="10"
       tgtlength="100"
       tgtlength_rdm="0.3;1" />
  </defs>
  <metadata
     id="metadata7">
    <rdf:RDF>
      <cc:Work
         rdf:about="">
        <dc:format>image/svg+xml</dc:format>
        <dc:type
           rdf:resource="http://purl.org/dc/dcmitype/StillImage" />
        <dc:title></dc:title>
      </cc:Work>
    </rdf:RDF>
  </metadata>
  <g
     transform="translate(724.4191,97.18388)"
     inkscape:groupmode="layer"
     id="layer5"
     inkscape:label="Stamp"
     style="display:inline;opacity:1">
    <g
       id="g5331-7"
       style="display:inline;filter:url(#filter5342-8-1)"
       transform="matrix(0.5950607,-0.13807097,0.13807097,0.5950607,-815.10415,-301.87079)">
      <circle
         transform="translate(-102.28479,397.66658)"
         r="262.311"
         cy="316.49588"
         cx="392.64163"
         id="path5165-3"
         style="color:#000000;clip-rule:nonzero;display:inline;overflow:visible;visibility:visible;opacity:1;isolation:auto;mix-blend-mode:normal;color-interpolation:sRGB;color-interpolation-filters:linearRGB;solid-color:#000000;solid-opacity:1;fill:none;fill-opacity:1;fill-rule:nonzero;stroke:url(#linearGradient6851);stroke-width:36.59379959;stroke-linecap:butt;stroke-linejoin:miter;stroke-miterlimit:4;stroke-dasharray:none;stroke-dashoffset:0;stroke-opacity:1;marker:none;marker-start:none;marker-mid:none;marker-end:none;paint-order:normal;color-rendering:auto;image-rendering:auto;shape-rendering:auto;text-rendering:auto;enable-background:accumulate" />
      <circle
         style="color:#000000;clip-rule:nonzero;display:inline;overflow:visible;visibility:visible;opacity:1;isolation:auto;mix-blend-mode:normal;color-interpolation:sRGB;color-interpolation-filters:linearRGB;solid-color:#000000;solid-opacity:1;fill:none;fill-opacity:1;fill-rule:nonzero;stroke:url(#linearGradient6851);stroke-width:22.18810081;stroke-linecap:butt;stroke-linejoin:miter;stroke-miterlimit:4;stroke-dasharray:none;stroke-dashoffset:0;stroke-opacity:1;marker:none;marker-start:none;marker-mid:none;marker-end:none;paint-order:normal;color-rendering:auto;image-rendering:auto;shape-rendering:auto;text-rendering:auto;enable-background:accumulate"
         id="circle5167-6"
         cx="392.64163"
         cy="316.49588"
         r="163.32573"
         transform="translate(-102.28479,397.66658)" />
      <path
         inkscape:connector-curvature="0"
         d="m 41.74217,78.53304 c 2.23193,1.63922 6.63675,0.65053 9.28212,1.84176 6.34952,2.85921 14.15494,6.04542 12.71857,0.40455 0,0 -1.61577,1.34204 -1.61577,1.34204 0,0 -0.0315,-2.55754 -0.0315,-2.55754 0,0 -3.75198,0.91629 -3.75198,0.91629 0,0 -2.90617,-2.33276 -4.23852,-3.10199 -0.27829,-0.16067 -1.7077,1.29281 -1.7077,1.29281 0,0 -0.25697,-1.5438 -0.25697,-1.5438 -1.85737,-0.19764 -3.69616,-0.28481 -5.31515,-0.27182 -3.88094,0.0311 -6.49906,0.63774 -5.08307,1.6777 z m 28.75783,-63.03304 16.3,16.6 c 1.5,1.5 1.5,4.6 0.6,5.5 l -8.1,-6.6 -1.6,9.7 -6.7,-3.6 -10.9,6.9 -3.6,-14.5 -5.8,12.6 -14.5,-0.1 c -2.8,0 -2.4,-2.9 0.5,-5.8 5.7,-6.3 16.8,-17 20.3,-20.7 3.6,-3.7 9.9,-3.6 13.5,0 z m -16.4,-3 -41.2,42.2 c -15.6,15.6 10.1,14.3 19.4,20.2 4.3,2.8 -13.8,6.4 -10.1,10.1 3.6,3.7 21.7,7.1 25.3,10.7 3.6,3.7 -7.3,7.6 -3.7,11.3 3.5,3.7 11.9,0.2 13.4,8.6 1.1,6.2 15.4,3.1 21.8,-2.2 4,-3.4 -6.9,-3.4 -3.3,-7.1 9,-9.1 17,-4.1 20.3,-12.5 1.8,-4.5 -13.6,-7.7 -9.5,-10.6 9.8,-6.9 45.8,-10.4 29.2,-27 l -42.7,-43.7 c -5.3,-5 -14,-5 -18.9,0 z m 47.3,81.3 c 0,2.1 16.3,3.3 15.4,-0.5 -1.3,-6.4 -13.6,-5.9 -15.4,0.5 z m -69.5,11.1 c 3.7,3.2 9.3,-0.7 11.1,-5.2 -3.6,-4.7 -16.9,0.3 -11.1,5.2 z m 67.5,-6.7 c -4.6,4.2 0.8,8.6 5.3,5.7 1.2,-0.8 -0.1,-4.7 -5.3,-5.7 z"
         style="opacity:0.98999999;fill:url(#linearGradient6851);fill-opacity:1;fill-rule:evenodd;stroke:none"
         transform="matrix(2.0698373,0,0,2.0691897,157.70008,578.02363)"
         id="path5221-1" />
      <text
         id="text5314-2"
         style="font-style:normal;font-weight:normal;font-size:12px;line-height:0%;font-family:sans-serif;letter-spacing:0px;word-spacing:0px;opacity:0.99;fill:url(#linearGradient6851);fill-opacity:1;stroke:none;stroke-width:1px;stroke-linecap:butt;stroke-linejoin:miter;stroke-opacity:1"
         xml:space="preserve"><textPath
           style="font-style:normal;font-variant:normal;font-weight:bold;font-stretch:normal;font-size:60px;font-family:sans-serif;-inkscape-font-specification:'sans-serif Bold';letter-spacing:10px;fill:url(#linearGradient6851);stroke:none"
           id="textPath5320-9"
           xlink:href="#circle5318-8-4">INKSCAPE</textPath></text>
      <circle
         transform="rotate(-149.85394,395.04818,529.10266)"
         r="184.77254"
         cy="316.49588"
         cx="392.64163"
         id="circle5497"
         style="color:#000000;clip-rule:nonzero;display:inline;overflow:visible;visibility:visible;opacity:1;isolation:auto;mix-blend-mode:normal;color-interpolation:sRGB;color-interpolation-filters:linearRGB;solid-color:#000000;solid-opacity:1;fill:none;fill-opacity:1;fill-rule:nonzero;stroke:none;stroke-width:1;stroke-linecap:butt;stroke-linejoin:miter;stroke-miterlimit:4;stroke-dasharray:none;stroke-dashoffset:0;stroke-opacity:1;marker:none;marker-start:none;marker-mid:none;marker-end:none;paint-order:normal;color-rendering:auto;image-rendering:auto;shape-rendering:auto;text-rendering:auto;enable-background:accumulate" />
      <circle
         cx="392.64163"
         cy="316.49588"
         r="234.26518"
         style="color:#000000;clip-rule:nonzero;display:inline;overflow:visible;visibility:visible;opacity:1;isolation:auto;mix-blend-mode:normal;color-interpolation:sRGB;color-interpolation-filters:linearRGB;solid-color:#000000;solid-opacity:1;fill:none;fill-opacity:1;fill-rule:nonzero;stroke:none;stroke-width:1;stroke-linecap:butt;stroke-linejoin:miter;stroke-miterlimit:4;stroke-dasharray:none;stroke-dashoffset:0;stroke-opacity:1;marker:none;marker-start:none;marker-mid:none;marker-end:none;paint-order:normal;color-rendering:auto;image-rendering:auto;shape-rendering:auto;text-rendering:auto;enable-background:accumulate"
         id="circle5499"
         transform="matrix(-0.90266723,0.43033925,0.43033925,0.90266723,508.58097,259.5029)" />
      <text
         transform="matrix(0.97588804,0,0,0.97588804,7.0856806,18.820531)"
         y="0"
         x="390.7182"
         xml:space="preserve"
         style="font-style:normal;font-weight:normal;font-size:12px;line-height:0%;font-family:sans-serif;letter-spacing:0px;word-spacing:0px;opacity:0.99;fill:url(#linearGradient6851);fill-opacity:1;stroke:none;stroke-width:1px;stroke-linecap:butt;stroke-linejoin:miter;stroke-opacity:1"
         id="text5325-3"><textPath
           style="font-style:normal;font-variant:normal;font-weight:bold;font-stretch:normal;font-size:60px;font-family:sans-serif;-inkscape-font-specification:'sans-serif Bold';text-align:start;letter-spacing:10px;text-anchor:start;fill:url(#linearGradient6851);stroke:none"
           id="textPath5329-1"
           xlink:href="#circle5323-9-5"> 1.0 SCREENS</textPath></text>
    </g>
  </g>
  <style
     id="style26"
     type="text/css">
	.specularity {opacity:0.5;}
	.low-specularity {opacity:0.25;}
	.full-specularity {opacity:1;}
	.black {fill:#000000;}
	.white {fill:#ffffff;}
	.outline-big {stroke-width:16;stroke:none;opacity:0.1;fill:none;}
	.outline-small {stroke-width:8;stroke:none;opacity:0.2;fill:none;}
	.stroke-highlight {fill:none;stroke:none;opacity:0.2;}
       	.base-shadow 	{fill:black;opacity:75;}
	</style>
  <style
     id="style26-1"
     type="text/css">
	.specularity {opacity:0.5;}
	.low-specularity {opacity:0.25;}
	.full-specularity {opacity:1;}
	.black {fill:#000000;}
	.white {fill:#ffffff;}
	.outline-big {stroke-width:16;stroke:none;opacity:0.1;fill:none;}
	.outline-small {stroke-width:8;stroke:none;opacity:0.2;fill:none;}
	.stroke-highlight {fill:none;stroke:none;opacity:0.2;}
       	.base-shadow 	{fill:black;opacity:75;}
	</style>
</svg>
