<?xml version="1.0" encoding="UTF-8" standalone="no"?>
<svg
   width="700.00037"
   height="220"
   viewBox="0 0 185.20843 58.208335"
   version="1.1"
   id="svg243962"
   inkscape:version="1.3-dev (87fea0ec9a, 2022-12-04)"
   sodipodi:docname="start-welcome-text.svg"
   inkscape:export-filename="/home/doctormo/Projects/inkscape/inkscape/share/screens/start-welcome.png"
   inkscape:export-xdpi="96"
   inkscape:export-ydpi="96"
   xml:space="preserve"
   xmlns:inkscape="http://www.inkscape.org/namespaces/inkscape"
   xmlns:sodipodi="http://sodipodi.sourceforge.net/DTD/sodipodi-0.dtd"
   xmlns:xlink="http://www.w3.org/1999/xlink"
   xmlns="http://www.w3.org/2000/svg"
   xmlns:svg="http://www.w3.org/2000/svg"><sodipodi:namedview
     id="namedview243964"
     pagecolor="#ffffff"
     bordercolor="#666666"
     borderopacity="1.0"
     objecttolerance="10.0"
     gridtolerance="10.0"
     guidetolerance="10.0"
     inkscape:pageshadow="2"
     inkscape:pageopacity="0.0"
     inkscape:pagecheckerboard="0"
     inkscape:document-units="px"
     showgrid="false"
     units="px"
     inkscape:zoom="0.96142804"
     inkscape:cx="13581.36"
     inkscape:cy="110.25266"
     inkscape:window-width="1534"
     inkscape:window-height="843"
     inkscape:window-x="66"
     inkscape:window-y="20"
     inkscape:window-maximized="1"
     inkscape:current-layer="g19"
     inkscape:showpageshadow="2"
     inkscape:deskcolor="#d1d1d1"><inkscape:page
       x="0"
       y="0"
       width="185.20844"
       height="58.208336"
       id="page1"
       inkscape:label="en"
       margin="0"
       bleed="0" /><inkscape:page
       x="195.20844"
       y="0"
       width="185.20844"
       height="58.208336"
       id="page2"
       inkscape:label="cs" /><inkscape:page
       x="390.41687"
       y="0"
       width="185.20844"
       height="58.208336"
       id="page3"
       inkscape:label="de" /><inkscape:page
       x="585.62531"
       y="0"
       width="185.20844"
       height="58.208336"
       id="page4"
       inkscape:label="es" /><inkscape:page
       x="780.83374"
       y="0"
       width="185.20844"
       height="58.208336"
       id="page5"
       inkscape:label="fr" /><inkscape:page
       x="976.04218"
       y="0"
       width="185.20844"
       height="58.208336"
       id="page6"
       inkscape:label="is" /><inkscape:page
       x="1171.2506"
       y="0"
       width="185.20844"
       height="58.208336"
       id="page7"
       inkscape:label="it" /><inkscape:page
       x="1366.459"
       y="0"
       width="185.20844"
       height="58.208336"
       id="page8"
       inkscape:label="ja" /><inkscape:page
       x="1561.6675"
       y="0"
       width="185.20844"
       height="58.208336"
       id="page9"
       inkscape:label="pl" /><inkscape:page
       x="1756.876"
       y="0"
       width="185.20844"
       height="58.208336"
       id="page10"
       inkscape:label="pt" /><inkscape:page
       x="1952.0845"
       y="0"
       width="185.20844"
       height="58.208336"
       id="page11"
       inkscape:label="ru" /><inkscape:page
       x="2147.293"
       y="0"
       width="185.20844"
       height="58.208336"
       id="page12"
       inkscape:label="sk" /><inkscape:page
       x="2342.5015"
       y="0"
       width="185.20844"
       height="58.208336"
       id="page13"
       inkscape:label="uk" /><inkscape:page
       x="2537.71"
       y="0"
       width="185.20844"
       height="58.208336"
       id="page14"
       inkscape:label="zh_CN" /><inkscape:page
       x="2732.9185"
       y="0"
       width="185.20844"
       height="58.208336"
       id="page15"
       inkscape:label="zh_TW" /><inkscape:page
       x="2928.127"
       y="0"
       width="185.20844"
       height="58.208336"
       id="page16"
       inkscape:label="ca" /><inkscape:page
       x="3123.3354"
       y="0"
       width="185.20844"
       height="58.208336"
       id="page17"
       inkscape:label="hu" /><inkscape:page
       x="3318.5439"
       y="0"
       width="185.20844"
       height="58.208336"
       id="page18"
       inkscape:label="sl" /><inkscape:page
       x="3513.7524"
       y="0"
       width="185.20844"
       height="58.208336"
       id="page19"
       inkscape:label="ro" /></sodipodi:namedview><defs
     id="defs243959" /><image
     preserveAspectRatio="none"
     inkscape:svg-dpi="96"
     width="185.20834"
     height="58.208336"
     xlink:href="start-welcome.svg"
     id="image1-36"
     x="3513.7524"
     y="-1.7347235e-18"
     inkscape:label="start-welcome"
     style="display:inline"
     sodipodi:insensitive="true" /><image
     preserveAspectRatio="none"
     inkscape:svg-dpi="96"
     width="700"
     height="220"
     xlink:href="start-welcome.svg"
     id="image1"
     x="511.8475"
     y="1316.5725"
     inkscape:label="start-welcome"
     style="display:inline"
     transform="matrix(0.26458334,0,0,0.26458334,-135.42632,-348.34315)"
     sodipodi:insensitive="true" /><image
     preserveAspectRatio="none"
     inkscape:svg-dpi="96"
     width="185.20833"
     height="58.208336"
     xlink:href="start-welcome.svg"
     id="image1-1"
     x="195.20844"
     y="1.9859717e-06"
     inkscape:label="start-welcome"
     sodipodi:insensitive="true" /><image
     preserveAspectRatio="none"
     inkscape:svg-dpi="96"
     width="185.20833"
     height="58.208336"
     xlink:href="start-welcome.svg"
     id="image1-14"
     x="390.41687"
     y="1.9859717e-06"
     inkscape:label="start-welcome"
     sodipodi:insensitive="true" /><image
     preserveAspectRatio="none"
     inkscape:svg-dpi="96"
     width="185.20833"
     height="58.208336"
     xlink:href="start-welcome.svg"
     id="image1-1-9"
     x="585.62531"
     y="1.9859717e-06"
     inkscape:label="start-welcome"
     sodipodi:insensitive="true" /><image
     preserveAspectRatio="none"
     inkscape:svg-dpi="96"
     width="185.20833"
     height="58.208336"
     xlink:href="start-welcome.svg"
     id="image1-0"
     x="780.83374"
     y="1.9859717e-06"
     inkscape:label="start-welcome"
     style="display:inline"
     sodipodi:insensitive="true" /><image
     preserveAspectRatio="none"
     inkscape:svg-dpi="96"
     width="185.20833"
     height="58.208336"
     xlink:href="start-welcome.svg"
     id="image1-1-3"
     x="976.04218"
     y="1.9859717e-06"
     inkscape:label="start-welcome"
     sodipodi:insensitive="true" /><image
     preserveAspectRatio="none"
     inkscape:svg-dpi="96"
     width="185.20833"
     height="58.208336"
     xlink:href="start-welcome.svg"
     id="image1-14-2"
     x="1171.2506"
     y="1.9859717e-06"
     inkscape:label="start-welcome"
     sodipodi:insensitive="true" /><image
     preserveAspectRatio="none"
     inkscape:svg-dpi="96"
     width="185.20833"
     height="58.208336"
     xlink:href="start-welcome.svg"
     id="image1-1-9-8"
     x="1366.459"
     y="1.9859717e-06"
     inkscape:label="start-welcome"
     sodipodi:insensitive="true" /><image
     preserveAspectRatio="none"
     inkscape:svg-dpi="96"
     width="185.20833"
     height="58.208336"
     xlink:href="start-welcome.svg"
     id="image1-3"
     x="1561.6675"
     y="1.9859717e-06"
     inkscape:label="start-welcome"
     style="display:inline"
     sodipodi:insensitive="true" /><image
     preserveAspectRatio="none"
     inkscape:svg-dpi="96"
     width="185.20833"
     height="58.208336"
     xlink:href="start-welcome.svg"
     id="image1-1-2"
     x="1756.876"
     y="1.9859717e-06"
     inkscape:label="start-welcome"
     sodipodi:insensitive="true" /><image
     preserveAspectRatio="none"
     inkscape:svg-dpi="96"
     width="185.20833"
     height="58.208336"
     xlink:href="start-welcome.svg"
     id="image1-14-9"
     x="1952.0845"
     y="1.9859717e-06"
     inkscape:label="start-welcome"
     sodipodi:insensitive="true" /><image
     preserveAspectRatio="none"
     inkscape:svg-dpi="96"
     width="185.20833"
     height="58.208336"
     xlink:href="start-welcome.svg"
     id="image1-1-9-5"
     x="2147.293"
     y="1.9859717e-06"
     inkscape:label="start-welcome"
     sodipodi:insensitive="true" /><image
     preserveAspectRatio="none"
     inkscape:svg-dpi="96"
     width="185.20833"
     height="58.208336"
     xlink:href="start-welcome.svg"
     id="image1-33"
     x="2342.5015"
     y="1.9859717e-06"
     inkscape:label="start-welcome"
     style="display:inline"
     sodipodi:insensitive="true" /><image
     preserveAspectRatio="none"
     inkscape:svg-dpi="96"
     width="185.20833"
     height="58.208336"
     xlink:href="start-welcome.svg"
     id="image1-1-7"
     x="2537.71"
     y="1.9859717e-06"
     inkscape:label="start-welcome"
     sodipodi:insensitive="true" /><image
     preserveAspectRatio="none"
     inkscape:svg-dpi="96"
     width="185.20833"
     height="58.208336"
     xlink:href="start-welcome.svg"
     id="image1-14-4"
     x="2732.9185"
     y="1.9859717e-06"
     inkscape:label="start-welcome"
     sodipodi:insensitive="true" /><image
     preserveAspectRatio="none"
     inkscape:svg-dpi="96"
     width="185.20833"
     height="58.208336"
     xlink:href="start-welcome.svg"
     id="image1-1-9-3"
     x="2928.127"
     y="1.9859717e-06"
     inkscape:label="start-welcome"
     sodipodi:insensitive="true" /><image
     preserveAspectRatio="none"
     inkscape:svg-dpi="96"
     width="185.20833"
     height="58.208336"
     xlink:href="start-welcome.svg"
     id="image1-7"
     x="3123.3354"
     y="1.9859717e-06"
     inkscape:label="start-welcome"
     style="display:inline"
     sodipodi:insensitive="true" /><image
     preserveAspectRatio="none"
     inkscape:svg-dpi="96"
     width="185.20833"
     height="58.208336"
     xlink:href="start-welcome.svg"
     id="image1-1-78"
     x="3318.5439"
     y="1.9859717e-06"
     inkscape:label="start-welcome"
     sodipodi:insensitive="true" /><g
     inkscape:groupmode="layer"
     id="layer2"
     inkscape:label="Text"
     style="font-variation-settings:normal;opacity:1;vector-effect:none;fill:#cbe1fb;fill-opacity:1;stroke-width:0.125564;stroke-linecap:butt;stroke-linejoin:miter;stroke-miterlimit:4;stroke-dasharray:none;stroke-dashoffset:0;stroke-opacity:1;-inkscape-stroke:none;stop-color:#000000;stop-opacity:1"><g
       inkscape:groupmode="layer"
       id="layer3"
       inkscape:label="en"
       style="font-variation-settings:normal;display:inline;vector-effect:none;fill:#cbe1fb;fill-opacity:1;stroke-width:0.125564;stroke-linecap:butt;stroke-linejoin:miter;stroke-miterlimit:4;stroke-dasharray:none;stroke-dashoffset:0;stroke-opacity:1;-inkscape-stroke:none;stop-color:#000000;stop-opacity:1"
       transform="translate(-13.234204,-29.619188)"><text
         xml:space="preserve"
         style="font-size:15.457px;line-height:1.25;font-family:'Roboto Condensed';-inkscape-font-specification:'Roboto Condensed, ';font-variation-settings:normal;vector-effect:none;fill:#cbe1fb;fill-opacity:1;stroke-width:0.125564;stroke-linecap:butt;stroke-linejoin:miter;stroke-miterlimit:4;stroke-dasharray:none;stroke-dashoffset:0;stroke-opacity:1;-inkscape-stroke:none;stop-color:#000000;stop-opacity:1"
         x="20.434931"
         y="49.541061"
         id="text118971"><tspan
           sodipodi:role="line"
           id="tspan118969"
           x="20.434931"
           y="49.541061"
           style="font-style:normal;font-variant:normal;font-weight:bold;font-stretch:normal;font-family:Raleway;-inkscape-font-specification:Raleway;font-variation-settings:normal;vector-effect:none;fill:#cbe1fb;fill-opacity:1;stroke-width:0.125564;stroke-linecap:butt;stroke-linejoin:miter;stroke-miterlimit:4;stroke-dasharray:none;stroke-dashoffset:0;stroke-opacity:1;-inkscape-stroke:none;stop-color:#000000;stop-opacity:1">Welcome!</tspan></text><text
         xml:space="preserve"
         style="font-size:5.02259px;line-height:1.25;font-family:'Roboto Condensed';-inkscape-font-specification:'Roboto Condensed, ';font-variation-settings:normal;vector-effect:none;fill:#cbe1fb;fill-opacity:1;stroke-width:0.125564;stroke-linecap:butt;stroke-linejoin:miter;stroke-miterlimit:4;stroke-dasharray:none;stroke-dashoffset:0;stroke-opacity:1;-inkscape-stroke:none;stop-color:#000000;stop-opacity:1"
         x="34.357765"
         y="60.836632"
         id="text115541"><tspan
           sodipodi:role="line"
           id="tspan115539"
           x="34.357765"
           y="60.836632"
           style="font-style:normal;font-variant:normal;font-weight:bold;font-stretch:normal;font-family:Raleway;-inkscape-font-specification:Raleway;font-variation-settings:normal;vector-effect:none;fill:#cbe1fb;fill-opacity:1;stroke-width:0.125564;stroke-linecap:butt;stroke-linejoin:miter;stroke-miterlimit:4;stroke-dasharray:none;stroke-dashoffset:0;stroke-opacity:1;-inkscape-stroke:none;stop-color:#000000;stop-opacity:1">Let's set up a few things...</tspan></text></g><g
       inkscape:groupmode="layer"
       id="layer3-7"
       inkscape:label="cs"
       transform="translate(184.59759,-32.578567)"
       style="font-variation-settings:normal;vector-effect:none;fill:#cbe1fb;fill-opacity:1;stroke-width:0.125564;stroke-linecap:butt;stroke-linejoin:miter;stroke-miterlimit:4;stroke-dasharray:none;stroke-dashoffset:0;stroke-opacity:1;-inkscape-stroke:none;stop-color:#000000;stop-opacity:1"><text
         xml:space="preserve"
         style="font-size:14.993px;line-height:1.25;font-family:'Roboto Condensed';-inkscape-font-specification:'Roboto Condensed, ';font-variation-settings:normal;vector-effect:none;fill:#cbe1fb;fill-opacity:1;stroke-width:0.125564;stroke-linecap:butt;stroke-linejoin:miter;stroke-miterlimit:4;stroke-dasharray:none;stroke-dashoffset:0;stroke-opacity:1;-inkscape-stroke:none;stop-color:#000000;stop-opacity:1"
         x="17.660858"
         y="50.030529"
         id="text118971-2"><tspan
           sodipodi:role="line"
           id="tspan118969-5"
           x="17.660858"
           y="50.030529"
           style="font-weight:bold;font-family:Raleway;-inkscape-font-specification:Raleway;font-variation-settings:normal;vector-effect:none;fill:#cbe1fb;fill-opacity:1;stroke-width:0.125564;stroke-linecap:butt;stroke-linejoin:miter;stroke-miterlimit:4;stroke-dasharray:none;stroke-dashoffset:0;stroke-opacity:1;-inkscape-stroke:none;stop-color:#000000;stop-opacity:1">Vítejte!</tspan></text><text
         xml:space="preserve"
         style="font-size:5.02259px;line-height:1.25;font-family:'Roboto Condensed';-inkscape-font-specification:'Roboto Condensed, ';font-variation-settings:normal;vector-effect:none;fill:#cbe1fb;fill-opacity:1;stroke-width:0.125564;stroke-linecap:butt;stroke-linejoin:miter;stroke-miterlimit:4;stroke-dasharray:none;stroke-dashoffset:0;stroke-opacity:1;-inkscape-stroke:none;stop-color:#000000;stop-opacity:1"
         x="30.141687"
         y="61.804218"
         id="text115541-0"><tspan
           sodipodi:role="line"
           x="30.141687"
           y="61.804218"
           style="font-weight:bold;font-family:Raleway;-inkscape-font-specification:Raleway;font-variation-settings:normal;vector-effect:none;fill:#cbe1fb;fill-opacity:1;stroke-width:0.125564;stroke-linecap:butt;stroke-linejoin:miter;stroke-miterlimit:4;stroke-dasharray:none;stroke-dashoffset:0;stroke-opacity:1;-inkscape-stroke:none;stop-color:#000000;stop-opacity:1"
           id="tspan4231">Tady můžeš upravit</tspan><tspan
           sodipodi:role="line"
           x="30.141687"
           y="68.287956"
           style="font-weight:bold;font-family:Raleway;-inkscape-font-specification:Raleway;font-variation-settings:normal;vector-effect:none;fill:#cbe1fb;fill-opacity:1;stroke-width:0.125564;stroke-linecap:butt;stroke-linejoin:miter;stroke-miterlimit:4;stroke-dasharray:none;stroke-dashoffset:0;stroke-opacity:1;-inkscape-stroke:none;stop-color:#000000;stop-opacity:1"
           id="tspan42873">      několik nastavení...</tspan></text></g><g
       inkscape:groupmode="layer"
       id="layer3-2"
       inkscape:label="de"
       style="font-variation-settings:normal;display:inline;vector-effect:none;fill:#cbe1fb;fill-opacity:1;stroke-width:0.125564;stroke-linecap:butt;stroke-linejoin:miter;stroke-miterlimit:4;stroke-dasharray:none;stroke-dashoffset:0;stroke-opacity:1;-inkscape-stroke:none;stop-color:#000000;stop-opacity:1"
       transform="translate(378.59115,-32.556143)"><text
         xml:space="preserve"
         style="font-size:12.0826px;line-height:1.25;font-family:'Roboto Condensed';-inkscape-font-specification:'Roboto Condensed, ';font-variation-settings:normal;vector-effect:none;fill:#cbe1fb;fill-opacity:1;stroke-width:0.125563;stroke-linecap:butt;stroke-linejoin:miter;stroke-miterlimit:4;stroke-dasharray:none;stroke-dashoffset:0;stroke-opacity:1;-inkscape-stroke:none;stop-color:#000000;stop-opacity:1"
         x="17.731413"
         y="48.923653"
         id="text118971-6"><tspan
           sodipodi:role="line"
           id="tspan118969-56"
           x="17.731413"
           y="48.923653"
           style="font-style:normal;font-variant:normal;font-weight:bold;font-stretch:normal;font-family:Raleway;-inkscape-font-specification:Raleway;font-variation-settings:normal;vector-effect:none;fill:#cbe1fb;fill-opacity:1;stroke-width:0.125563;stroke-linecap:butt;stroke-linejoin:miter;stroke-miterlimit:4;stroke-dasharray:none;stroke-dashoffset:0;stroke-opacity:1;-inkscape-stroke:none;stop-color:#000000;stop-opacity:1">Willkommen!</tspan></text><text
         xml:space="preserve"
         style="font-size:5.02259px;line-height:1.25;font-family:'Roboto Condensed';-inkscape-font-specification:'Roboto Condensed, ';font-variation-settings:normal;vector-effect:none;fill:#cbe1fb;fill-opacity:1;stroke-width:0.125564;stroke-linecap:butt;stroke-linejoin:miter;stroke-miterlimit:4;stroke-dasharray:none;stroke-dashoffset:0;stroke-opacity:1;-inkscape-stroke:none;stop-color:#000000;stop-opacity:1"
         x="31.787169"
         y="61.916218"
         id="text115541-6"><tspan
           sodipodi:role="line"
           x="31.787169"
           y="61.916218"
           style="font-style:normal;font-variant:normal;font-weight:bold;font-stretch:normal;font-family:Raleway;-inkscape-font-specification:Raleway;font-variation-settings:normal;vector-effect:none;fill:#cbe1fb;fill-opacity:1;stroke-width:0.125564;stroke-linecap:butt;stroke-linejoin:miter;stroke-miterlimit:4;stroke-dasharray:none;stroke-dashoffset:0;stroke-opacity:1;-inkscape-stroke:none;stop-color:#000000;stop-opacity:1"
           id="tspan15517">Lass uns ein paar</tspan><tspan
           sodipodi:role="line"
           x="31.787169"
           y="68.399956"
           style="font-style:normal;font-variant:normal;font-weight:bold;font-stretch:normal;font-family:Raleway;-inkscape-font-specification:Raleway;font-variation-settings:normal;vector-effect:none;fill:#cbe1fb;fill-opacity:1;stroke-width:0.125564;stroke-linecap:butt;stroke-linejoin:miter;stroke-miterlimit:4;stroke-dasharray:none;stroke-dashoffset:0;stroke-opacity:1;-inkscape-stroke:none;stop-color:#000000;stop-opacity:1"
           id="tspan16225">     Dinge einrichten…</tspan></text></g><g
       inkscape:groupmode="layer"
       id="layer3-3"
       inkscape:label="es"
       transform="translate(575.98907,-31.000559)"
       style="font-variation-settings:normal;display:inline;vector-effect:none;fill:#cbe1fb;fill-opacity:1;stroke-width:0.125564;stroke-linecap:butt;stroke-linejoin:miter;stroke-miterlimit:4;stroke-dasharray:none;stroke-dashoffset:0;stroke-opacity:1;-inkscape-stroke:none;stop-color:#000000;stop-opacity:1"><text
         xml:space="preserve"
         style="font-size:12.619px;line-height:1.25;font-family:'Roboto Condensed';-inkscape-font-specification:'Roboto Condensed, ';font-variation-settings:normal;vector-effect:none;fill:#cbe1fb;fill-opacity:1;stroke-width:0.125564;stroke-linecap:butt;stroke-linejoin:miter;stroke-miterlimit:4;stroke-dasharray:none;stroke-dashoffset:0;stroke-opacity:1;-inkscape-stroke:none;stop-color:#000000;stop-opacity:1"
         x="17.281206"
         y="49.685574"
         id="text118971-4"><tspan
           sodipodi:role="line"
           id="tspan118969-1"
           x="17.281206"
           y="49.685574"
           style="font-weight:bold;font-family:Raleway;-inkscape-font-specification:Raleway;font-variation-settings:normal;vector-effect:none;fill:#cbe1fb;fill-opacity:1;stroke-width:0.125564;stroke-linecap:butt;stroke-linejoin:miter;stroke-miterlimit:4;stroke-dasharray:none;stroke-dashoffset:0;stroke-opacity:1;-inkscape-stroke:none;stop-color:#000000;stop-opacity:1">¡Bienvenid@!</tspan></text><text
         xml:space="preserve"
         style="font-size:5.02259px;line-height:1.25;font-family:'Roboto Condensed';-inkscape-font-specification:'Roboto Condensed, ';font-variation-settings:normal;vector-effect:none;fill:#cbe1fb;fill-opacity:1;stroke-width:0.125564;stroke-linecap:butt;stroke-linejoin:miter;stroke-miterlimit:4;stroke-dasharray:none;stroke-dashoffset:0;stroke-opacity:1;-inkscape-stroke:none;stop-color:#000000;stop-opacity:1"
         x="31.843357"
         y="62.164307"
         id="text115541-7"><tspan
           sodipodi:role="line"
           x="31.843357"
           y="62.164307"
           style="font-weight:bold;font-family:Raleway;-inkscape-font-specification:Raleway;font-variation-settings:normal;vector-effect:none;fill:#cbe1fb;fill-opacity:1;stroke-width:0.125564;stroke-linecap:butt;stroke-linejoin:miter;stroke-miterlimit:4;stroke-dasharray:none;stroke-dashoffset:0;stroke-opacity:1;-inkscape-stroke:none;stop-color:#000000;stop-opacity:1"
           id="tspan42873-1">Configuremos</tspan><tspan
           sodipodi:role="line"
           x="31.843357"
           y="68.648048"
           style="font-weight:bold;font-family:Raleway;-inkscape-font-specification:Raleway;font-variation-settings:normal;vector-effect:none;fill:#cbe1fb;fill-opacity:1;stroke-width:0.125564;stroke-linecap:butt;stroke-linejoin:miter;stroke-miterlimit:4;stroke-dasharray:none;stroke-dashoffset:0;stroke-opacity:1;-inkscape-stroke:none;stop-color:#000000;stop-opacity:1"
           id="tspan20">    algunas cosas...</tspan></text></g><g
       inkscape:groupmode="layer"
       id="layer3-3-3"
       inkscape:label="fr"
       transform="translate(772.07136,-28.753954)"
       style="font-variation-settings:normal;display:inline;vector-effect:none;fill:#cbe1fb;fill-opacity:1;stroke-width:0.125564;stroke-linecap:butt;stroke-linejoin:miter;stroke-miterlimit:4;stroke-dasharray:none;stroke-dashoffset:0;stroke-opacity:1;-inkscape-stroke:none;stop-color:#000000;stop-opacity:1"><text
         xml:space="preserve"
         style="font-size:14.1232px;line-height:1.25;font-family:'Roboto Condensed';-inkscape-font-specification:'Roboto Condensed, ';font-variation-settings:normal;vector-effect:none;fill:#cbe1fb;fill-opacity:1;stroke-width:0.125564;stroke-linecap:butt;stroke-linejoin:miter;stroke-miterlimit:4;stroke-dasharray:none;stroke-dashoffset:0;stroke-opacity:1;-inkscape-stroke:none;stop-color:#000000;stop-opacity:1"
         x="15.235725"
         y="47.975616"
         id="text118971-4-0"><tspan
           sodipodi:role="line"
           id="tspan118969-1-8"
           x="15.235725"
           y="47.975616"
           style="font-weight:bold;font-family:Raleway;-inkscape-font-specification:Raleway;font-variation-settings:normal;vector-effect:none;fill:#cbe1fb;fill-opacity:1;stroke-width:0.125564;stroke-linecap:butt;stroke-linejoin:miter;stroke-miterlimit:4;stroke-dasharray:none;stroke-dashoffset:0;stroke-opacity:1;-inkscape-stroke:none;stop-color:#000000;stop-opacity:1">Bienvenue!</tspan></text><text
         xml:space="preserve"
         style="font-size:5.02259px;line-height:1.25;font-family:'Roboto Condensed';-inkscape-font-specification:'Roboto Condensed, ';font-variation-settings:normal;vector-effect:none;fill:#cbe1fb;fill-opacity:1;stroke-width:0.125564;stroke-linecap:butt;stroke-linejoin:miter;stroke-miterlimit:4;stroke-dasharray:none;stroke-dashoffset:0;stroke-opacity:1;-inkscape-stroke:none;stop-color:#000000;stop-opacity:1"
         x="29.736893"
         y="58.711414"
         id="text115541-7-2"><tspan
           sodipodi:role="line"
           x="29.736893"
           y="58.711414"
           style="font-weight:bold;font-family:Raleway;-inkscape-font-specification:Raleway;font-variation-settings:normal;vector-effect:none;fill:#cbe1fb;fill-opacity:1;stroke-width:0.125564;stroke-linecap:butt;stroke-linejoin:miter;stroke-miterlimit:4;stroke-dasharray:none;stroke-dashoffset:0;stroke-opacity:1;-inkscape-stroke:none;stop-color:#000000;stop-opacity:1"
           id="tspan42873-1-9">Installons-nous</tspan><tspan
           sodipodi:role="line"
           x="29.736893"
           y="65.195152"
           style="font-weight:bold;font-family:Raleway;-inkscape-font-specification:Raleway;font-variation-settings:normal;vector-effect:none;fill:#cbe1fb;fill-opacity:1;stroke-width:0.125564;stroke-linecap:butt;stroke-linejoin:miter;stroke-miterlimit:4;stroke-dasharray:none;stroke-dashoffset:0;stroke-opacity:1;-inkscape-stroke:none;stop-color:#000000;stop-opacity:1"
           id="tspan21">    confortablement…</tspan></text></g><g
       inkscape:groupmode="layer"
       id="layer3-3-3-0"
       inkscape:label="hu"
       transform="translate(3111.8255,-31.375647)"
       style="font-variation-settings:normal;display:inline;vector-effect:none;fill:#cbe1fb;fill-opacity:1;stroke-width:0.125564;stroke-linecap:butt;stroke-linejoin:miter;stroke-miterlimit:4;stroke-dasharray:none;stroke-dashoffset:0;stroke-opacity:1;-inkscape-stroke:none;stop-color:#000000;stop-opacity:1"><text
         xml:space="preserve"
         style="font-size:13.58px;line-height:1.25;font-family:'Roboto Condensed';-inkscape-font-specification:'Roboto Condensed, ';font-variation-settings:normal;vector-effect:none;fill:#cbe1fb;fill-opacity:1;stroke-width:0.125564;stroke-linecap:butt;stroke-linejoin:miter;stroke-miterlimit:4;stroke-dasharray:none;stroke-dashoffset:0;stroke-opacity:1;-inkscape-stroke:none;stop-color:#000000;stop-opacity:1"
         x="17.593418"
         y="50.964745"
         id="text118971-4-0-1"><tspan
           sodipodi:role="line"
           id="tspan118969-1-8-0"
           x="17.593418"
           y="50.964745"
           style="font-weight:bold;font-family:Raleway;-inkscape-font-specification:Raleway;font-variation-settings:normal;vector-effect:none;fill:#cbe1fb;fill-opacity:1;stroke-width:0.125564;stroke-linecap:butt;stroke-linejoin:miter;stroke-miterlimit:4;stroke-dasharray:none;stroke-dashoffset:0;stroke-opacity:1;-inkscape-stroke:none;stop-color:#000000;stop-opacity:1">Üdvözöljük!</tspan></text><text
         xml:space="preserve"
         style="font-size:5.02259px;line-height:1.25;font-family:'Roboto Condensed';-inkscape-font-specification:'Roboto Condensed, ';font-variation-settings:normal;vector-effect:none;fill:#cbe1fb;fill-opacity:1;stroke-width:0.125564;stroke-linecap:butt;stroke-linejoin:miter;stroke-miterlimit:4;stroke-dasharray:none;stroke-dashoffset:0;stroke-opacity:1;-inkscape-stroke:none;stop-color:#000000;stop-opacity:1"
         x="30.651299"
         y="62.413361"
         id="text115541-7-2-8"><tspan
           sodipodi:role="line"
           x="30.651299"
           y="62.413361"
           style="font-weight:bold;font-family:Raleway;-inkscape-font-specification:Raleway;font-variation-settings:normal;vector-effect:none;fill:#cbe1fb;fill-opacity:1;stroke-width:0.125564;stroke-linecap:butt;stroke-linejoin:miter;stroke-miterlimit:4;stroke-dasharray:none;stroke-dashoffset:0;stroke-opacity:1;-inkscape-stroke:none;stop-color:#000000;stop-opacity:1"
           id="tspan42873-1-9-1">Állítsunk be néhány dolgot</tspan></text></g><g
       inkscape:groupmode="layer"
       id="layer3-6"
       inkscape:label="is"
       transform="translate(968.73295,-31.837979)"
       style="font-variation-settings:normal;vector-effect:none;fill:#cbe1fb;fill-opacity:1;stroke-width:0.125564;stroke-linecap:butt;stroke-linejoin:miter;stroke-miterlimit:4;stroke-dasharray:none;stroke-dashoffset:0;stroke-opacity:1;-inkscape-stroke:none;stop-color:#000000;stop-opacity:1"><text
         xml:space="preserve"
         style="font-size:13.5986px;line-height:1.25;font-family:'Roboto Condensed';-inkscape-font-specification:'Roboto Condensed, ';font-variation-settings:normal;vector-effect:none;fill:#cbe1fb;fill-opacity:1;stroke-width:0.125564;stroke-linecap:butt;stroke-linejoin:miter;stroke-miterlimit:4;stroke-dasharray:none;stroke-dashoffset:0;stroke-opacity:1;-inkscape-stroke:none;stop-color:#000000;stop-opacity:1"
         x="14.922986"
         y="50.275414"
         id="text118971-7"><tspan
           sodipodi:role="line"
           id="tspan118969-8"
           x="14.922986"
           y="50.275414"
           style="font-weight:bold;font-family:Raleway;-inkscape-font-specification:Raleway;font-variation-settings:normal;vector-effect:none;fill:#cbe1fb;fill-opacity:1;stroke-width:0.125564;stroke-linecap:butt;stroke-linejoin:miter;stroke-miterlimit:4;stroke-dasharray:none;stroke-dashoffset:0;stroke-opacity:1;-inkscape-stroke:none;stop-color:#000000;stop-opacity:1">Velkomin!</tspan></text><text
         xml:space="preserve"
         style="font-size:5.02259px;line-height:1.25;font-family:'Roboto Condensed';-inkscape-font-specification:'Roboto Condensed, ';font-variation-settings:normal;vector-effect:none;fill:#cbe1fb;fill-opacity:1;stroke-width:0.125564;stroke-linecap:butt;stroke-linejoin:miter;stroke-miterlimit:4;stroke-dasharray:none;stroke-dashoffset:0;stroke-opacity:1;-inkscape-stroke:none;stop-color:#000000;stop-opacity:1"
         x="27.850597"
         y="62.559875"
         id="text115541-8"><tspan
           sodipodi:role="line"
           x="27.850597"
           y="62.559875"
           style="font-weight:bold;font-family:Raleway;-inkscape-font-specification:Raleway;font-variation-settings:normal;vector-effect:none;fill:#cbe1fb;fill-opacity:1;stroke-width:0.125564;stroke-linecap:butt;stroke-linejoin:miter;stroke-miterlimit:4;stroke-dasharray:none;stroke-dashoffset:0;stroke-opacity:1;-inkscape-stroke:none;stop-color:#000000;stop-opacity:1"
           id="tspan42873-2">Við ættum að stilla</tspan><tspan
           sodipodi:role="line"
           x="27.850597"
           y="69.043617"
           style="font-weight:bold;font-family:Raleway;-inkscape-font-specification:Raleway;font-variation-settings:normal;vector-effect:none;fill:#cbe1fb;fill-opacity:1;stroke-width:0.125564;stroke-linecap:butt;stroke-linejoin:miter;stroke-miterlimit:4;stroke-dasharray:none;stroke-dashoffset:0;stroke-opacity:1;-inkscape-stroke:none;stop-color:#000000;stop-opacity:1"
           id="tspan22">      nokkur atriði...</tspan></text></g><g
       inkscape:groupmode="layer"
       id="layer3-1"
       inkscape:label="it"
       style="font-variation-settings:normal;display:inline;vector-effect:none;fill:#cbe1fb;fill-opacity:1;stroke-width:0.125564;stroke-linecap:butt;stroke-linejoin:miter;stroke-miterlimit:4;stroke-dasharray:none;stroke-dashoffset:0;stroke-opacity:1;-inkscape-stroke:none;stop-color:#000000;stop-opacity:1"
       transform="translate(1158.8483,-32.038166)"><text
         xml:space="preserve"
         style="font-size:13.9208px;line-height:1.25;font-family:'Roboto Condensed';-inkscape-font-specification:'Roboto Condensed, ';font-variation-settings:normal;vector-effect:none;fill:#cbe1fb;fill-opacity:1;stroke-width:0.125564;stroke-linecap:butt;stroke-linejoin:miter;stroke-miterlimit:4;stroke-dasharray:none;stroke-dashoffset:0;stroke-opacity:1;-inkscape-stroke:none;stop-color:#000000;stop-opacity:1"
         x="19.392647"
         y="50.756561"
         id="text118971-3"><tspan
           sodipodi:role="line"
           id="tspan118969-89"
           x="19.392647"
           y="50.756561"
           style="font-style:normal;font-variant:normal;font-weight:bold;font-stretch:normal;font-family:Raleway;-inkscape-font-specification:Raleway;font-variation-settings:normal;vector-effect:none;fill:#cbe1fb;fill-opacity:1;stroke-width:0.125564;stroke-linecap:butt;stroke-linejoin:miter;stroke-miterlimit:4;stroke-dasharray:none;stroke-dashoffset:0;stroke-opacity:1;-inkscape-stroke:none;stop-color:#000000;stop-opacity:1">Benvenuto!</tspan></text><text
         xml:space="preserve"
         style="font-size:5.02259px;line-height:1.25;font-family:'Roboto Condensed';-inkscape-font-specification:'Roboto Condensed, ';font-variation-settings:normal;vector-effect:none;fill:#cbe1fb;fill-opacity:1;stroke-width:0.125564;stroke-linecap:butt;stroke-linejoin:miter;stroke-miterlimit:4;stroke-dasharray:none;stroke-dashoffset:0;stroke-opacity:1;-inkscape-stroke:none;stop-color:#000000;stop-opacity:1"
         x="32.948406"
         y="62.630718"
         id="text115541-3"><tspan
           sodipodi:role="line"
           x="32.948406"
           y="62.630718"
           style="font-style:normal;font-variant:normal;font-weight:bold;font-stretch:normal;font-family:Raleway;-inkscape-font-specification:Raleway;font-variation-settings:normal;vector-effect:none;fill:#cbe1fb;fill-opacity:1;stroke-width:0.125564;stroke-linecap:butt;stroke-linejoin:miter;stroke-miterlimit:4;stroke-dasharray:none;stroke-dashoffset:0;stroke-opacity:1;-inkscape-stroke:none;stop-color:#000000;stop-opacity:1"
           id="tspan4898">Sistemiamo alcune cose…</tspan></text></g><g
       inkscape:groupmode="layer"
       id="layer3-5"
       inkscape:label="ja"
       style="font-variation-settings:normal;display:inline;vector-effect:none;fill:#cbe1fb;fill-opacity:1;stroke-width:0.125564;stroke-linecap:butt;stroke-linejoin:miter;stroke-miterlimit:4;stroke-dasharray:none;stroke-dashoffset:0;stroke-opacity:1;-inkscape-stroke:none;stop-color:#000000;stop-opacity:1"
       transform="translate(1418.3826,-83.706034)"><text
         xml:space="preserve"
         style="font-size:12.9777px;line-height:1.25;font-family:'Roboto Condensed';-inkscape-font-specification:'Roboto Condensed, ';font-variation-settings:normal;vector-effect:none;fill:#cbe1fb;fill-opacity:1;stroke-width:0.125564;stroke-linecap:butt;stroke-linejoin:miter;stroke-miterlimit:4;stroke-dasharray:none;stroke-dashoffset:0;stroke-opacity:1;-inkscape-stroke:none;stop-color:#000000;stop-opacity:1"
         x="-45.32262"
         y="102.0694"
         id="text118971-41"><tspan
           sodipodi:role="line"
           id="tspan118969-2"
           x="-45.32262"
           y="102.0694"
           style="font-style:normal;font-variant:normal;font-weight:bold;font-stretch:normal;font-family:Raleway;-inkscape-font-specification:Raleway;font-variation-settings:normal;vector-effect:none;fill:#cbe1fb;fill-opacity:1;stroke-width:0.125564;stroke-linecap:butt;stroke-linejoin:miter;stroke-miterlimit:4;stroke-dasharray:none;stroke-dashoffset:0;stroke-opacity:1;-inkscape-stroke:none;stop-color:#000000;stop-opacity:1">ようこそ！</tspan></text><path
         id="rect22"
         style="opacity:1;vector-effect:none;fill:#ffffff;fill-rule:evenodd;stroke:#000000;stroke-width:0.125564;paint-order:stroke markers fill;stop-color:#000000;stop-opacity:1"
         d="M -29.957416,107.2685 H 41.33192 c 2.178484,0 3.932282,1.7538 3.932282,3.93228 v 3.80418 c 0,2.17849 -1.753798,3.93228 -3.932282,3.93228 -0.672722,3.43654 0.868439,6.17031 3.072503,8.69365 -3.882428,-1.14347 -6.637847,-3.99757 -8.17973,-8.69365 h -66.182109 c -2.178484,0 -3.932282,-1.75379 -3.932282,-3.93228 v -3.80418 c 0,-2.17848 1.753798,-3.93228 3.932282,-3.93228 z"
         sodipodi:nodetypes="sssscccssss" /><text
         xml:space="preserve"
         style="font-size:5.02259px;line-height:1.25;font-family:'Roboto Condensed';-inkscape-font-specification:'Roboto Condensed, ';font-variation-settings:normal;vector-effect:none;fill:#333333;fill-opacity:1;stroke-width:0.125564;stroke-linecap:butt;stroke-linejoin:miter;stroke-miterlimit:4;stroke-dasharray:none;stroke-dashoffset:0;stroke-opacity:1;-inkscape-stroke:none;stop-color:#000000;stop-opacity:1"
         x="-31.880322"
         y="115.13615"
         id="text115541-2"><tspan
           sodipodi:role="line"
           x="-31.880322"
           y="115.13615"
           style="font-style:normal;font-variant:normal;font-weight:bold;font-stretch:normal;font-family:Raleway;-inkscape-font-specification:Raleway;font-variation-settings:normal;vector-effect:none;fill:#333333;fill-opacity:1;stroke-width:0.125564;stroke-linecap:butt;stroke-linejoin:miter;stroke-miterlimit:4;stroke-dasharray:none;stroke-dashoffset:0;stroke-opacity:1;-inkscape-stroke:none;stop-color:#000000;stop-opacity:1"
           id="tspan4231-7">いくつか簡単な設定をしましょう</tspan></text></g><g
       inkscape:groupmode="layer"
       id="layer3-79"
       inkscape:label="pl"
       transform="translate(1559.0591,-30.210713)"
       style="font-variation-settings:normal;vector-effect:none;fill:#cbe1fb;fill-opacity:1;stroke-width:0.125564;stroke-linecap:butt;stroke-linejoin:miter;stroke-miterlimit:4;stroke-dasharray:none;stroke-dashoffset:0;stroke-opacity:1;-inkscape-stroke:none;stop-color:#000000;stop-opacity:1"><text
         xml:space="preserve"
         style="font-size:14.5573px;line-height:1.25;font-family:'Roboto Condensed';-inkscape-font-specification:'Roboto Condensed, ';font-variation-settings:normal;vector-effect:none;fill:#cbe1fb;fill-opacity:1;stroke-width:0.125565;stroke-linecap:butt;stroke-linejoin:miter;stroke-miterlimit:4;stroke-dasharray:none;stroke-dashoffset:0;stroke-opacity:1;-inkscape-stroke:none;stop-color:#000000;stop-opacity:1"
         x="9.935667"
         y="49.702301"
         id="text118971-1"><tspan
           sodipodi:role="line"
           id="tspan118969-4"
           x="9.935667"
           y="49.702301"
           style="font-weight:bold;font-family:Raleway;-inkscape-font-specification:Raleway;font-variation-settings:normal;vector-effect:none;fill:#cbe1fb;fill-opacity:1;stroke-width:0.125565;stroke-linecap:butt;stroke-linejoin:miter;stroke-miterlimit:4;stroke-dasharray:none;stroke-dashoffset:0;stroke-opacity:1;-inkscape-stroke:none;stop-color:#000000;stop-opacity:1">Witajcie!</tspan></text><text
         xml:space="preserve"
         style="font-size:5.02259px;line-height:1.25;font-family:'Roboto Condensed';-inkscape-font-specification:'Roboto Condensed, ';font-variation-settings:normal;vector-effect:none;fill:#cbe1fb;fill-opacity:1;stroke-width:0.125564;stroke-linecap:butt;stroke-linejoin:miter;stroke-miterlimit:4;stroke-dasharray:none;stroke-dashoffset:0;stroke-opacity:1;-inkscape-stroke:none;stop-color:#000000;stop-opacity:1"
         x="24.109806"
         y="62.249603"
         id="text115541-04"><tspan
           sodipodi:role="line"
           x="24.109806"
           y="62.249603"
           style="font-weight:bold;font-family:Raleway;-inkscape-font-specification:Raleway;font-variation-settings:normal;vector-effect:none;fill:#cbe1fb;fill-opacity:1;stroke-width:0.125564;stroke-linecap:butt;stroke-linejoin:miter;stroke-miterlimit:4;stroke-dasharray:none;stroke-dashoffset:0;stroke-opacity:1;-inkscape-stroke:none;stop-color:#000000;stop-opacity:1"
           id="tspan38256">Skonfigurujmy</tspan><tspan
           sodipodi:role="line"
           x="24.109806"
           y="68.733345"
           style="font-weight:bold;font-family:Raleway;-inkscape-font-specification:Raleway;font-variation-settings:normal;vector-effect:none;fill:#cbe1fb;fill-opacity:1;stroke-width:0.125564;stroke-linecap:butt;stroke-linejoin:miter;stroke-miterlimit:4;stroke-dasharray:none;stroke-dashoffset:0;stroke-opacity:1;-inkscape-stroke:none;stop-color:#000000;stop-opacity:1"
           id="tspan1">   kilka ustawień...</tspan></text></g><g
       inkscape:groupmode="layer"
       id="layer3-78"
       inkscape:label="pt"
       transform="translate(1750.9028,-30.121324)"
       style="font-variation-settings:normal;vector-effect:none;fill:#cbe1fb;fill-opacity:1;stroke-width:0.125564;stroke-linecap:butt;stroke-linejoin:miter;stroke-miterlimit:4;stroke-dasharray:none;stroke-dashoffset:0;stroke-opacity:1;-inkscape-stroke:none;stop-color:#000000;stop-opacity:1"><text
         xml:space="preserve"
         style="font-size:14.4164px;line-height:1.25;font-family:'Roboto Condensed';-inkscape-font-specification:'Roboto Condensed, ';font-variation-settings:normal;vector-effect:none;fill:#cbe1fb;fill-opacity:1;stroke-width:0.125564;stroke-linecap:butt;stroke-linejoin:miter;stroke-miterlimit:4;stroke-dasharray:none;stroke-dashoffset:0;stroke-opacity:1;-inkscape-stroke:none;stop-color:#000000;stop-opacity:1"
         x="11.969817"
         y="48.966438"
         id="text118971-76"><tspan
           sodipodi:role="line"
           id="tspan118969-80"
           x="11.969817"
           y="48.966438"
           style="font-weight:bold;font-family:Raleway;-inkscape-font-specification:Raleway;font-variation-settings:normal;vector-effect:none;fill:#cbe1fb;fill-opacity:1;stroke-width:0.125564;stroke-linecap:butt;stroke-linejoin:miter;stroke-miterlimit:4;stroke-dasharray:none;stroke-dashoffset:0;stroke-opacity:1;-inkscape-stroke:none;stop-color:#000000;stop-opacity:1">Bemvindo!</tspan></text><text
         xml:space="preserve"
         style="font-size:5.02259px;line-height:1.25;font-family:'Roboto Condensed';-inkscape-font-specification:'Roboto Condensed, ';font-variation-settings:normal;vector-effect:none;fill:#cbe1fb;fill-opacity:1;stroke-width:0.125564;stroke-linecap:butt;stroke-linejoin:miter;stroke-miterlimit:4;stroke-dasharray:none;stroke-dashoffset:0;stroke-opacity:1;-inkscape-stroke:none;stop-color:#000000;stop-opacity:1"
         x="29.999084"
         y="61.38718"
         id="text115541-86"><tspan
           sodipodi:role="line"
           x="29.999084"
           y="61.38718"
           style="font-weight:bold;font-family:Raleway;-inkscape-font-specification:Raleway;font-variation-settings:normal;vector-effect:none;fill:#cbe1fb;fill-opacity:1;stroke-width:0.125564;stroke-linecap:butt;stroke-linejoin:miter;stroke-miterlimit:4;stroke-dasharray:none;stroke-dashoffset:0;stroke-opacity:1;-inkscape-stroke:none;stop-color:#000000;stop-opacity:1"
           id="tspan4680">Vamos configurar</tspan><tspan
           sodipodi:role="line"
           x="29.999084"
           y="67.870918"
           style="font-weight:bold;font-family:Raleway;-inkscape-font-specification:Raleway;font-variation-settings:normal;vector-effect:none;fill:#cbe1fb;fill-opacity:1;stroke-width:0.125564;stroke-linecap:butt;stroke-linejoin:miter;stroke-miterlimit:4;stroke-dasharray:none;stroke-dashoffset:0;stroke-opacity:1;-inkscape-stroke:none;stop-color:#000000;stop-opacity:1"
           id="tspan23">    algumas coisas…</tspan></text></g><g
       inkscape:groupmode="layer"
       id="layer3-52"
       inkscape:label="ru"
       transform="translate(1934.9502,-30.760583)"
       style="font-variation-settings:normal;vector-effect:none;fill:#cbe1fb;fill-opacity:1;stroke-width:0.125564;stroke-linecap:butt;stroke-linejoin:miter;stroke-miterlimit:4;stroke-dasharray:none;stroke-dashoffset:0;stroke-opacity:1;-inkscape-stroke:none;stop-color:#000000;stop-opacity:1"><text
         xml:space="preserve"
         style="font-size:9.87366px;line-height:1.25;font-family:'Roboto Condensed';-inkscape-font-specification:'Roboto Condensed, ';font-variation-settings:normal;vector-effect:none;fill:#cbe1fb;fill-opacity:1;stroke-width:0.125564;stroke-linecap:butt;stroke-linejoin:miter;stroke-miterlimit:4;stroke-dasharray:none;stroke-dashoffset:0;stroke-opacity:1;-inkscape-stroke:none;stop-color:#000000;stop-opacity:1"
         x="23.097208"
         y="45.057812"
         id="text118971-5"><tspan
           sodipodi:role="line"
           x="23.097208"
           y="45.057812"
           style="font-weight:bold;font-family:Raleway;-inkscape-font-specification:Raleway;font-variation-settings:normal;vector-effect:none;fill:#cbe1fb;fill-opacity:1;stroke-width:0.125564;stroke-linecap:butt;stroke-linejoin:miter;stroke-miterlimit:4;stroke-dasharray:none;stroke-dashoffset:0;stroke-opacity:1;-inkscape-stroke:none;stop-color:#000000;stop-opacity:1"
           id="tspan2634">Добро пожаловать!</tspan></text><text
         xml:space="preserve"
         style="font-size:5.02259px;line-height:1.25;font-family:'Roboto Condensed';-inkscape-font-specification:'Roboto Condensed, ';font-variation-settings:normal;vector-effect:none;fill:#cbe1fb;fill-opacity:1;stroke-width:0.125564;stroke-linecap:butt;stroke-linejoin:miter;stroke-miterlimit:4;stroke-dasharray:none;stroke-dashoffset:0;stroke-opacity:1;-inkscape-stroke:none;stop-color:#000000;stop-opacity:1"
         x="29.019817"
         y="54.258434"
         id="text115541-38"><tspan
           sodipodi:role="line"
           x="29.019817"
           y="54.258434"
           style="font-weight:bold;font-family:Raleway;-inkscape-font-specification:Raleway;font-variation-settings:normal;vector-effect:none;fill:#cbe1fb;fill-opacity:1;stroke-width:0.125564;stroke-linecap:butt;stroke-linejoin:miter;stroke-miterlimit:4;stroke-dasharray:none;stroke-dashoffset:0;stroke-opacity:1;-inkscape-stroke:none;stop-color:#000000;stop-opacity:1"
           id="tspan38256-8">Давайте кое-что настроим…</tspan></text></g><g
       inkscape:groupmode="layer"
       id="layer3-4"
       inkscape:label="sk"
       transform="translate(2145.6818,-68.98312)"
       style="font-variation-settings:normal;vector-effect:none;fill:#cbe1fb;fill-opacity:1;stroke-width:0.125564;stroke-linecap:butt;stroke-linejoin:miter;stroke-miterlimit:4;stroke-dasharray:none;stroke-dashoffset:0;stroke-opacity:1;-inkscape-stroke:none;stop-color:#000000;stop-opacity:1"><text
         xml:space="preserve"
         style="font-size:13.4261px;line-height:1.25;font-family:'Roboto Condensed';-inkscape-font-specification:'Roboto Condensed, ';font-variation-settings:normal;vector-effect:none;fill:#cbe1fb;fill-opacity:1;stroke-width:0.125564;stroke-linecap:butt;stroke-linejoin:miter;stroke-miterlimit:4;stroke-dasharray:none;stroke-dashoffset:0;stroke-opacity:1;-inkscape-stroke:none;stop-color:#000000;stop-opacity:1"
         x="14.218747"
         y="87.822365"
         id="text118971-35"><tspan
           sodipodi:role="line"
           id="tspan118969-0"
           x="14.218747"
           y="87.822365"
           style="font-weight:bold;font-family:Raleway;-inkscape-font-specification:Raleway;font-variation-settings:normal;vector-effect:none;fill:#cbe1fb;fill-opacity:1;stroke-width:0.125564;stroke-linecap:butt;stroke-linejoin:miter;stroke-miterlimit:4;stroke-dasharray:none;stroke-dashoffset:0;stroke-opacity:1;-inkscape-stroke:none;stop-color:#000000;stop-opacity:1">Vítajte!</tspan></text><text
         xml:space="preserve"
         style="font-size:5.02259px;line-height:1.25;font-family:'Roboto Condensed';-inkscape-font-specification:'Roboto Condensed, ';font-variation-settings:normal;vector-effect:none;fill:#cbe1fb;fill-opacity:1;stroke-width:0.125564;stroke-linecap:butt;stroke-linejoin:miter;stroke-miterlimit:4;stroke-dasharray:none;stroke-dashoffset:0;stroke-opacity:1;-inkscape-stroke:none;stop-color:#000000;stop-opacity:1"
         x="26.131018"
         y="98.937416"
         id="text115541-5"><tspan
           sodipodi:role="line"
           x="26.131018"
           y="98.937416"
           style="font-weight:bold;font-family:Raleway;-inkscape-font-specification:Raleway;font-variation-settings:normal;vector-effect:none;fill:#cbe1fb;fill-opacity:1;stroke-width:0.125564;stroke-linecap:butt;stroke-linejoin:miter;stroke-miterlimit:4;stroke-dasharray:none;stroke-dashoffset:0;stroke-opacity:1;-inkscape-stroke:none;stop-color:#000000;stop-opacity:1"
           id="tspan4231-9">Tu môžeš upraviť</tspan><tspan
           sodipodi:role="line"
           x="26.131018"
           y="105.42116"
           style="font-weight:bold;font-family:Raleway;-inkscape-font-specification:Raleway;font-variation-settings:normal;vector-effect:none;fill:#cbe1fb;fill-opacity:1;stroke-width:0.125564;stroke-linecap:butt;stroke-linejoin:miter;stroke-miterlimit:4;stroke-dasharray:none;stroke-dashoffset:0;stroke-opacity:1;-inkscape-stroke:none;stop-color:#000000;stop-opacity:1"
           id="tspan24">    pár nastavení...</tspan></text></g><g
       inkscape:groupmode="layer"
       id="layer3-34"
       inkscape:label="uk"
       style="font-variation-settings:normal;display:inline;vector-effect:none;fill:#cbe1fb;fill-opacity:1;stroke-width:0.125564;stroke-linecap:butt;stroke-linejoin:miter;stroke-miterlimit:4;stroke-dasharray:none;stroke-dashoffset:0;stroke-opacity:1;-inkscape-stroke:none;stop-color:#000000;stop-opacity:1"
       transform="translate(2328.2555,-29.153575)"><text
         xml:space="preserve"
         style="font-size:15.0345px;line-height:1.25;font-family:'Roboto Condensed';-inkscape-font-specification:'Roboto Condensed, ';font-variation-settings:normal;vector-effect:none;fill:#cbe1fb;fill-opacity:1;stroke-width:0.125565;stroke-linecap:butt;stroke-linejoin:miter;stroke-miterlimit:4;stroke-dasharray:none;stroke-dashoffset:0;stroke-opacity:1;-inkscape-stroke:none;stop-color:#000000;stop-opacity:1"
         x="21.106312"
         y="48.858749"
         id="text118971-62"><tspan
           sodipodi:role="line"
           id="tspan118969-53"
           x="21.106312"
           y="48.858749"
           style="font-style:normal;font-variant:normal;font-weight:bold;font-stretch:normal;font-family:Raleway;-inkscape-font-specification:Raleway;font-variation-settings:normal;vector-effect:none;fill:#cbe1fb;fill-opacity:1;stroke-width:0.125565;stroke-linecap:butt;stroke-linejoin:miter;stroke-miterlimit:4;stroke-dasharray:none;stroke-dashoffset:0;stroke-opacity:1;-inkscape-stroke:none;stop-color:#000000;stop-opacity:1">Вітаємо!</tspan></text><text
         xml:space="preserve"
         style="font-size:5.02259px;line-height:1.25;font-family:'Roboto Condensed';-inkscape-font-specification:'Roboto Condensed, ';font-variation-settings:normal;vector-effect:none;fill:#cbe1fb;fill-opacity:1;stroke-width:0.125564;stroke-linecap:butt;stroke-linejoin:miter;stroke-miterlimit:4;stroke-dasharray:none;stroke-dashoffset:0;stroke-opacity:1;-inkscape-stroke:none;stop-color:#000000;stop-opacity:1"
         x="34.470089"
         y="58.940014"
         id="text115541-20"><tspan
           sodipodi:role="line"
           id="tspan115539-0"
           x="34.470089"
           y="58.940014"
           style="font-style:normal;font-variant:normal;font-weight:bold;font-stretch:normal;font-family:Raleway;-inkscape-font-specification:Raleway;font-variation-settings:normal;vector-effect:none;fill:#cbe1fb;fill-opacity:1;stroke-width:0.125564;stroke-linecap:butt;stroke-linejoin:miter;stroke-miterlimit:4;stroke-dasharray:none;stroke-dashoffset:0;stroke-opacity:1;-inkscape-stroke:none;stop-color:#000000;stop-opacity:1">Давайте налаштуємо</tspan><tspan
           sodipodi:role="line"
           x="34.470089"
           y="65.423752"
           style="font-style:normal;font-variant:normal;font-weight:bold;font-stretch:normal;font-family:Raleway;-inkscape-font-specification:Raleway;font-variation-settings:normal;vector-effect:none;fill:#cbe1fb;fill-opacity:1;stroke-width:0.125564;stroke-linecap:butt;stroke-linejoin:miter;stroke-miterlimit:4;stroke-dasharray:none;stroke-dashoffset:0;stroke-opacity:1;-inkscape-stroke:none;stop-color:#000000;stop-opacity:1"
           id="tspan9751">        декілька речей…</tspan></text></g><g
       inkscape:groupmode="layer"
       id="layer3-0"
       inkscape:label="zh_CN"
       transform="translate(2531.3421,-24.606481)"
       style="font-variation-settings:normal;vector-effect:none;fill:#cbe1fb;fill-opacity:1;stroke-width:0.125564;stroke-linecap:butt;stroke-linejoin:miter;stroke-miterlimit:4;stroke-dasharray:none;stroke-dashoffset:0;stroke-opacity:1;-inkscape-stroke:none;stop-color:#000000;stop-opacity:1"><text
         xml:space="preserve"
         style="font-size:16.706px;line-height:1.25;font-family:'Roboto Condensed';-inkscape-font-specification:'Roboto Condensed, ';font-variation-settings:normal;vector-effect:none;fill:#cbe1fb;fill-opacity:1;stroke-width:0.125564;stroke-linecap:butt;stroke-linejoin:miter;stroke-miterlimit:4;stroke-dasharray:none;stroke-dashoffset:0;stroke-opacity:1;-inkscape-stroke:none;stop-color:#000000;stop-opacity:1"
         x="13.778605"
         y="46.253918"
         id="text118971-9"><tspan
           sodipodi:role="line"
           id="tspan118969-809"
           x="13.778605"
           y="46.253918"
           style="font-weight:bold;font-family:Raleway;-inkscape-font-specification:Raleway;font-variation-settings:normal;vector-effect:none;fill:#cbe1fb;fill-opacity:1;stroke-width:0.125564;stroke-linecap:butt;stroke-linejoin:miter;stroke-miterlimit:4;stroke-dasharray:none;stroke-dashoffset:0;stroke-opacity:1;-inkscape-stroke:none;stop-color:#000000;stop-opacity:1">欢迎</tspan></text><text
         xml:space="preserve"
         style="font-size:5.02259px;line-height:1.25;font-family:'Roboto Condensed';-inkscape-font-specification:'Roboto Condensed, ';font-variation-settings:normal;vector-effect:none;fill:#cbe1fb;fill-opacity:1;stroke-width:0.125564;stroke-linecap:butt;stroke-linejoin:miter;stroke-miterlimit:4;stroke-dasharray:none;stroke-dashoffset:0;stroke-opacity:1;-inkscape-stroke:none;stop-color:#000000;stop-opacity:1"
         x="27.727831"
         y="57.49229"
         id="text115541-67"><tspan
           sodipodi:role="line"
           x="27.727831"
           y="57.49229"
           style="font-weight:bold;font-family:Raleway;-inkscape-font-specification:Raleway;font-variation-settings:normal;vector-effect:none;fill:#cbe1fb;fill-opacity:1;stroke-width:0.125564;stroke-linecap:butt;stroke-linejoin:miter;stroke-miterlimit:4;stroke-dasharray:none;stroke-dashoffset:0;stroke-opacity:1;-inkscape-stroke:none;stop-color:#000000;stop-opacity:1"
           id="tspan4231-2">Let's set up a few things...</tspan></text></g><g
       inkscape:groupmode="layer"
       id="layer3-14"
       inkscape:label="zh_TW"
       transform="translate(2726.8794,-24.23873)"
       style="font-variation-settings:normal;vector-effect:none;fill:#cbe1fb;fill-opacity:1;stroke-width:0.125564;stroke-linecap:butt;stroke-linejoin:miter;stroke-miterlimit:4;stroke-dasharray:none;stroke-dashoffset:0;stroke-opacity:1;-inkscape-stroke:none;stop-color:#000000;stop-opacity:1"><text
         xml:space="preserve"
         style="font-size:16.2879px;line-height:1.25;font-family:'Roboto Condensed';-inkscape-font-specification:'Roboto Condensed, ';font-variation-settings:normal;vector-effect:none;fill:#cbe1fb;fill-opacity:1;stroke-width:0.125564;stroke-linecap:butt;stroke-linejoin:miter;stroke-miterlimit:4;stroke-dasharray:none;stroke-dashoffset:0;stroke-opacity:1;-inkscape-stroke:none;stop-color:#000000;stop-opacity:1"
         x="12.474214"
         y="45.397297"
         id="text118971-48"><tspan
           sodipodi:role="line"
           id="tspan118969-49"
           x="12.474214"
           y="45.397297"
           style="font-weight:bold;font-family:Raleway;-inkscape-font-specification:Raleway;font-variation-settings:normal;vector-effect:none;fill:#cbe1fb;fill-opacity:1;stroke-width:0.125564;stroke-linecap:butt;stroke-linejoin:miter;stroke-miterlimit:4;stroke-dasharray:none;stroke-dashoffset:0;stroke-opacity:1;-inkscape-stroke:none;stop-color:#000000;stop-opacity:1">歡迎</tspan></text><text
         xml:space="preserve"
         style="font-size:5.02259px;line-height:1.25;font-family:'Roboto Condensed';-inkscape-font-specification:'Roboto Condensed, ';font-variation-settings:normal;vector-effect:none;fill:#cbe1fb;fill-opacity:1;stroke-width:0.125564;stroke-linecap:butt;stroke-linejoin:miter;stroke-miterlimit:4;stroke-dasharray:none;stroke-dashoffset:0;stroke-opacity:1;-inkscape-stroke:none;stop-color:#000000;stop-opacity:1"
         x="27.251535"
         y="57.118832"
         id="text115541-84"><tspan
           sodipodi:role="line"
           x="27.251535"
           y="57.118832"
           style="font-weight:bold;font-family:Raleway;-inkscape-font-specification:Raleway;font-variation-settings:normal;vector-effect:none;fill:#cbe1fb;fill-opacity:1;stroke-width:0.125564;stroke-linecap:butt;stroke-linejoin:miter;stroke-miterlimit:4;stroke-dasharray:none;stroke-dashoffset:0;stroke-opacity:1;-inkscape-stroke:none;stop-color:#000000;stop-opacity:1"
           id="tspan4231-4">Let's set up a few things...</tspan></text></g><g
       inkscape:groupmode="layer"
       id="layer3-19"
       inkscape:label="ca"
       style="font-variation-settings:normal;display:inline;vector-effect:none;fill:#cbe1fb;fill-opacity:1;stroke-width:0.125564;stroke-linecap:butt;stroke-linejoin:miter;stroke-miterlimit:4;stroke-dasharray:none;stroke-dashoffset:0;stroke-opacity:1;-inkscape-stroke:none;stop-color:#000000"
       transform="translate(2916.6607,-28.944013)"><text
         xml:space="preserve"
         style="font-size:12.4857px;line-height:1.25;font-family:'Roboto Condensed';-inkscape-font-specification:'Roboto Condensed, ';font-variation-settings:normal;vector-effect:none;fill:#cbe1fb;fill-opacity:1;stroke-width:0.125564;stroke-linecap:butt;stroke-linejoin:miter;stroke-miterlimit:4;stroke-dasharray:none;stroke-dashoffset:0;stroke-opacity:1;-inkscape-stroke:none;stop-color:#000000;stop-opacity:1"
         x="17.54244"
         y="45.922436"
         id="text118971-68"><tspan
           sodipodi:role="line"
           x="17.54244"
           y="45.922436"
           style="font-style:normal;font-variant:normal;font-weight:bold;font-stretch:normal;font-family:Raleway;-inkscape-font-specification:Raleway;font-variation-settings:normal;vector-effect:none;fill:#cbe1fb;fill-opacity:1;stroke-width:0.125564;stroke-linecap:butt;stroke-linejoin:miter;stroke-miterlimit:4;stroke-dasharray:none;stroke-dashoffset:0;stroke-opacity:1;-inkscape-stroke:none;stop-color:#000000;stop-opacity:1"
           id="tspan27">Benvinguda</tspan></text><text
         xml:space="preserve"
         style="font-size:5.02259px;line-height:1.25;font-family:'Roboto Condensed';-inkscape-font-specification:'Roboto Condensed, ';font-variation-settings:normal;vector-effect:none;fill:#cbe1fb;fill-opacity:1;stroke-width:0.125564;stroke-linecap:butt;stroke-linejoin:miter;stroke-miterlimit:4;stroke-dasharray:none;stroke-dashoffset:0;stroke-opacity:1;-inkscape-stroke:none;stop-color:#000000;stop-opacity:1"
         x="34.357765"
         y="60.836632"
         id="text115541-36"><tspan
           sodipodi:role="line"
           id="tspan115539-3"
           x="34.357765"
           y="60.836632"
           style="font-style:normal;font-variant:normal;font-weight:bold;font-stretch:normal;font-family:Raleway;-inkscape-font-specification:Raleway;font-variation-settings:normal;vector-effect:none;fill:#cbe1fb;fill-opacity:1;stroke-width:0.125564;stroke-linecap:butt;stroke-linejoin:miter;stroke-miterlimit:4;stroke-dasharray:none;stroke-dashoffset:0;stroke-opacity:1;-inkscape-stroke:none;stop-color:#000000;stop-opacity:1">Anem a configurar</tspan><tspan
           sodipodi:role="line"
           x="34.357765"
           y="67.320374"
           style="font-style:normal;font-variant:normal;font-weight:bold;font-stretch:normal;font-family:Raleway;-inkscape-font-specification:Raleway;font-variation-settings:normal;vector-effect:none;fill:#cbe1fb;fill-opacity:1;stroke-width:0.125564;stroke-linecap:butt;stroke-linejoin:miter;stroke-miterlimit:4;stroke-dasharray:none;stroke-dashoffset:0;stroke-opacity:1;-inkscape-stroke:none;stop-color:#000000;stop-opacity:1"
           id="tspan25">    unes quantes coses...</tspan></text></g><g
       inkscape:groupmode="layer"
       id="layer3-8"
       inkscape:label="sl"
       style="font-variation-settings:normal;display:inline;vector-effect:none;fill:#cbe1fb;fill-opacity:1;stroke-width:0.125564;stroke-linecap:butt;stroke-linejoin:miter;stroke-miterlimit:4;stroke-dasharray:none;stroke-dashoffset:0;stroke-opacity:1;-inkscape-stroke:none;stop-color:#000000"
       transform="translate(3306.4893,-30.444607)"><text
         xml:space="preserve"
         style="font-size:15.457px;line-height:1.25;font-family:'Roboto Condensed';-inkscape-font-specification:'Roboto Condensed, ';font-variation-settings:normal;vector-effect:none;fill:#cbe1fb;fill-opacity:1;stroke-width:0.125564;stroke-linecap:butt;stroke-linejoin:miter;stroke-miterlimit:4;stroke-dasharray:none;stroke-dashoffset:0;stroke-opacity:1;-inkscape-stroke:none;stop-color:#000000;stop-opacity:1"
         x="19.188025"
         y="49.933647"
         id="text118971-95"><tspan
           sodipodi:role="line"
           id="tspan118969-01"
           x="19.188025"
           y="49.933647"
           style="font-style:normal;font-variant:normal;font-weight:bold;font-stretch:normal;font-family:Raleway;-inkscape-font-specification:Raleway;font-variation-settings:normal;vector-effect:none;fill:#cbe1fb;fill-opacity:1;stroke-width:0.125564;stroke-linecap:butt;stroke-linejoin:miter;stroke-miterlimit:4;stroke-dasharray:none;stroke-dashoffset:0;stroke-opacity:1;-inkscape-stroke:none;stop-color:#000000;stop-opacity:1">Dobrodošli!</tspan></text><text
         xml:space="preserve"
         style="font-size:5.02259px;line-height:1.25;font-family:'Roboto Condensed';-inkscape-font-specification:'Roboto Condensed, ';font-variation-settings:normal;vector-effect:none;fill:#cbe1fb;fill-opacity:1;stroke-width:0.125564;stroke-linecap:butt;stroke-linejoin:miter;stroke-miterlimit:4;stroke-dasharray:none;stroke-dashoffset:0;stroke-opacity:1;-inkscape-stroke:none;stop-color:#000000;stop-opacity:1"
         x="34.246937"
         y="61.789772"
         id="text115541-71"><tspan
           sodipodi:role="line"
           id="tspan115539-9"
           x="34.246937"
           y="61.789772"
           style="font-style:normal;font-variant:normal;font-weight:bold;font-stretch:normal;font-family:Raleway;-inkscape-font-specification:Raleway;font-variation-settings:normal;vector-effect:none;fill:#cbe1fb;fill-opacity:1;stroke-width:0.125564;stroke-linecap:butt;stroke-linejoin:miter;stroke-miterlimit:4;stroke-dasharray:none;stroke-dashoffset:0;stroke-opacity:1;-inkscape-stroke:none;stop-color:#000000;stop-opacity:1">Nastavimo nekaj zadev …</tspan></text></g><g
       id="g19"
       inkscape:label="ro"
       transform="translate(-1.2458164,-0.50195466)"
       inkscape:groupmode="layer"><text
         xml:space="preserve"
         style="font-size:15.1694px;font-variation-settings:normal;display:inline;vector-effect:none;fill:#cbe1fb;fill-opacity:1;stroke-width:0.0332221;stroke-linecap:butt;stroke-linejoin:miter;stroke-miterlimit:4;stroke-dasharray:none;stroke-dashoffset:0;stroke-opacity:1;-inkscape-stroke:none;stop-color:#000000"
         x="3520.511"
         y="21.845337"
         id="text2936"><tspan
           sodipodi:role="line"
           id="tspan2934"
           style="font-style:normal;font-variant:normal;font-weight:800;font-stretch:normal;font-size:15.1694px;font-family:Raleway;-inkscape-font-specification:'Raleway Ultra-Bold';fill:#cbe1fb;fill-opacity:1;stroke-width:0.0332221"
           x="3520.511"
           y="21.845337">Bun venit!</tspan></text><text
         xml:space="preserve"
         style="font-style:normal;font-variant:normal;font-weight:normal;font-stretch:normal;font-size:4.93889px;font-family:Raleway;-inkscape-font-specification:Raleway;font-variation-settings:normal;display:inline;vector-effect:none;fill:#cbe1fb;fill-opacity:1;stroke-width:0.0332221;stroke-linecap:butt;stroke-linejoin:miter;stroke-miterlimit:4;stroke-dasharray:none;stroke-dashoffset:0;stroke-opacity:1;-inkscape-stroke:none;stop-color:#000000"
         x="3531.7195"
         y="33.138874"
         id="text6046"><tspan
           sodipodi:role="line"
           id="tspan6044"
           style="font-style:normal;font-variant:normal;font-weight:800;font-stretch:normal;font-size:4.93889px;font-family:Raleway;-inkscape-font-specification:'Raleway Ultra-Bold';fill:#cbe1fb;fill-opacity:1;stroke-width:0.0332221"
           x="3531.7195"
           y="33.138874">Să stabilim mai întâi unele lucruri...</tspan></text></g></g></svg>
