<?xml version="1.0" encoding="UTF-8" standalone="no"?>
<!-- Created with Inkscape (http://www.inkscape.org/) -->

<svg
   xmlns:dc="http://purl.org/dc/elements/1.1/"
   xmlns:cc="http://creativecommons.org/ns#"
   xmlns:rdf="http://www.w3.org/1999/02/22-rdf-syntax-ns#"
   xmlns:svg="http://www.w3.org/2000/svg"
   xmlns="http://www.w3.org/2000/svg"
   xmlns:xlink="http://www.w3.org/1999/xlink"
   xmlns:sodipodi="http://sodipodi.sourceforge.net/DTD/sodipodi-0.dtd"
   xmlns:inkscape="http://www.inkscape.org/namespaces/inkscape"
   width="210mm"
   height="297mm"
   viewBox="0 0 210 297"
   version="1.1"
   id="svg8"
   inkscape:version="0.92.4 (45b59e76f6, 2019-03-20)"
   sodipodi:docname="name_tag.svg"
   style="enable-background:new"
   inkscape:export-xdpi="600.04474"
   inkscape:export-ydpi="600.04474">
  <defs
     id="defs2">
    <linearGradient
       inkscape:collect="always"
       id="linearGradient3514">
      <stop
         id="stop3504"
         offset="0"
         style="stop-color:#020606;stop-opacity:1" />
      <stop
         style="stop-color:#707070;stop-opacity:1"
         offset="0.06554395"
         id="stop3506" />
      <stop
         style="stop-color:#a6a6a6;stop-opacity:1"
         offset="0.50013709"
         id="stop3508" />
      <stop
         id="stop3510"
         offset="0.9096694"
         style="stop-color:#a8a9a9;stop-opacity:1" />
      <stop
         id="stop3512"
         offset="1"
         style="stop-color:#040404;stop-opacity:1" />
    </linearGradient>
    <linearGradient
       inkscape:collect="always"
       id="linearGradient8533">
      <stop
         style="stop-color:#2dc1b7;stop-opacity:1"
         offset="0"
         id="stop8529" />
      <stop
         id="stop8548"
         offset="0.39257491"
         style="stop-color:#4acdc4;stop-opacity:1;" />
      <stop
         id="stop8546"
         offset="0.87431586"
         style="stop-color:#95e4de;stop-opacity:1" />
      <stop
         style="stop-color:#72ded6;stop-opacity:1"
         offset="1"
         id="stop8531" />
    </linearGradient>
    <linearGradient
       gradientUnits="userSpaceOnUse"
       id="WhiteTransparent">
      <stop
         id="stop7"
         offset="0"
         style="stop-color:white;stop-opacity:1" />
      <stop
         id="stop9"
         offset="1"
         style="stop-color:white;stop-opacity:0" />
    </linearGradient>
    <linearGradient
       gradientUnits="userSpaceOnUse"
       id="BlackTransparent">
      <stop
         id="stop12"
         offset="0"
         style="stop-color:black;stop-opacity:1" />
      <stop
         id="stop14"
         offset="1"
         style="stop-color:black;stop-opacity:0" />
    </linearGradient>
    <linearGradient
       gradientUnits="userSpaceOnUse"
       y2="64"
       x2="0"
       y1="128"
       x1="0"
       xlink:href="#BlackTransparent"
       id="liquidShade" />
    <linearGradient
       gradientUnits="userSpaceOnUse"
       y2="76"
       x2="0"
       y1="128"
       x1="0"
       xlink:href="#WhiteTransparent"
       id="liquidSpecular" />
    <linearGradient
       gradientUnits="userSpaceOnUse"
       y2="40"
       x2="60"
       y1="20"
       x1="80"
       xlink:href="#WhiteTransparent"
       id="sideSpecular" />
    <linearGradient
       gradientUnits="userSpaceOnUse"
       y2="50"
       x2="90"
       y1="20"
       x1="60"
       xlink:href="#WhiteTransparent"
       id="IcecapTip" />
    <linearGradient
       gradientUnits="userSpaceOnUse"
       y2="60"
       x2="58"
       y1="35"
       x1="33"
       xlink:href="#WhiteTransparent"
       id="shinySpecular" />
    <clipPath
       id="clipoutline1"
       clipPathUnits="userSpaceOnUse">
      <path
         d="M 54.1,12.5 12.9,54.7 C -2.7,70.3 23,69 32.3,74.9 36.6,77.7 18.5,81.3 22.2,85 c 3.6,3.7 21.7,7.1 25.3,10.7 3.6,3.7 -7.3,7.6 -3.7,11.3 3.5,3.7 11.9,0.2 13.4,8.6 1.1,6.2 15.4,3.1 21.8,-2.2 4,-3.4 -6.9,-3.4 -3.3,-7.1 9,-9.1 17,-4.1 20.3,-12.5 1.8,-4.5 -13.6,-7.7 -9.5,-10.6 9.8,-6.9 45.8,-10.4 29.2,-27 L 73,12.5 c -5.3,-5 -14,-5 -18.9,0 z m -9.9,64.7 c 0.9,0 30.8,4 19.3,7.1 -4.4,1.2 -24.6,-7.1 -19.3,-7.1 z m 57.2,16.6 c 0,2.1 16.3,3.3 15.4,-0.5 -1.3,-6.4 -13.6,-5.9 -15.4,0.5 z m -69.5,11.1 c 3.7,3.2 9.3,-0.7 11.1,-5.2 -3.6,-4.7 -16.9,0.3 -11.1,5.2 z m 67.5,-6.7 c -4.6,4.2 0.8,8.6 5.3,5.7 1.2,-0.8 -0.1,-4.7 -5.3,-5.7 z"
         id="outline1"
         inkscape:connector-curvature="0" />
    </clipPath>
    <filter
       y="0"
       x="0"
       filterUnits="userSpaceOnUse"
       id="ShadowBlur">
      <feGaussianBlur
         id="feGaussianBlur24"
         result="blur"
         stdDeviation="3"
         in="SourceAlpha" />
    </filter>
    <linearGradient
       id="linearGradient5785"
       gradientUnits="userSpaceOnUse">
      <stop
         style="stop-color:#c0cdf9;stop-opacity:1"
         offset="0"
         id="stop5787" />
      <stop
         style="stop-color:#07092d;stop-opacity:0.28804347"
         offset="1"
         id="stop5789" />
    </linearGradient>
    <clipPath
       id="clipPath9086"
       clipPathUnits="userSpaceOnUse">
      <use
         transform="translate(1.009546e-6)"
         height="300"
         width="400"
         y="0"
         x="0"
         style="fill:#ffffff;fill-opacity:1"
         class="low-specularity"
         xlink:href="#outline1"
         id="use9088" />
    </clipPath>
    <linearGradient
       gradientTransform="matrix(1.009184,0,0,1.009184,-0.3890738,-0.3831933)"
       id="shinySpecular-4"
       xlink:href="#WhiteTransparent"
       x1="33"
       y1="35"
       x2="58"
       y2="60"
       gradientUnits="userSpaceOnUse" />
    <linearGradient
       gradientTransform="matrix(1.009184,0,0,1.009184,-0.3890738,-0.3831933)"
       id="shinySpecular-4-1"
       xlink:href="#WhiteTransparent"
       x1="33"
       y1="35"
       x2="58"
       y2="60"
       gradientUnits="userSpaceOnUse" />
    <linearGradient
       id="IcecapTip-6"
       xlink:href="#WhiteTransparent"
       x1="60"
       y1="20"
       x2="90"
       y2="50"
       gradientUnits="userSpaceOnUse" />
    <clipPath
       clipPathUnits="userSpaceOnUse"
       id="clipPath8524">
      <rect
         y="257.00467"
         x="0.0046631726"
         height="10.867514"
         width="74.990669"
         id="rect8526"
         style="opacity:1;vector-effect:none;fill:#ff2a2a;fill-opacity:1;stroke:none;stroke-width:0.27399999;stroke-linecap:round;stroke-linejoin:bevel;stroke-miterlimit:4;stroke-dasharray:0.548, 1.644;stroke-dashoffset:0;stroke-opacity:1;marker:none;paint-order:markers fill stroke" />
    </clipPath>
    <mask
       maskUnits="userSpaceOnUse"
       id="mask15779">
      <use
         x="0"
         y="0"
         xlink:href="#path15768"
         id="use15781"
         width="100%"
         height="100%"
         transform="translate(80.314489,287.84928)" />
    </mask>
    <clipPath
       clipPathUnits="userSpaceOnUse"
       id="clipPath1650">
      <rect
         y="256.99536"
         x="-7.1000002e-05"
         height="40"
         width="75"
         id="rect1652"
         style="opacity:1;vector-effect:none;fill:#ff0000;fill-opacity:1;stroke:#ade8e5;stroke-width:0.35299999;stroke-linecap:butt;stroke-linejoin:round;stroke-miterlimit:4;stroke-dasharray:none;stroke-dashoffset:0;stroke-opacity:1;marker:none;paint-order:stroke markers fill" />
    </clipPath>
    <linearGradient
       inkscape:collect="always"
       xlink:href="#linearGradient8533"
       id="linearGradient3102"
       gradientUnits="userSpaceOnUse"
       gradientTransform="matrix(-0.26458333,0,0,0.26458333,75.004651,256.99535)"
       x1="3.5355325"
       y1="152.69633"
       x2="280.82242"
       y2="2.1836023" />
    <linearGradient
       inkscape:collect="always"
       xlink:href="#linearGradient3514"
       id="linearGradient1148"
       gradientUnits="userSpaceOnUse"
       gradientTransform="matrix(0.07000434,0,0,0.07000434,-80.314489,37.148639)"
       x1="6.6256456"
       y1="-432.50412"
       x2="1070.3401"
       y2="-438.23096" />
  </defs>
  <sodipodi:namedview
     id="base"
     pagecolor="#ffffff"
     bordercolor="#666666"
     borderopacity="1.0"
     inkscape:pageopacity="0.0"
     inkscape:pageshadow="2"
     inkscape:zoom="1.979899"
     inkscape:cx="246.21128"
     inkscape:cy="961.53"
     inkscape:document-units="mm"
     inkscape:current-layer="g1968"
     showgrid="false"
     inkscape:snap-bbox="true"
     inkscape:bbox-nodes="true"
     inkscape:object-paths="false"
     inkscape:snap-page="true"
     inkscape:snap-global="false"
     inkscape:window-width="1280"
     inkscape:window-height="964"
     inkscape:window-x="0"
     inkscape:window-y="0"
     inkscape:window-maximized="1"
     inkscape:snap-nodes="true"
     inkscape:snap-others="false" />
  <metadata
     id="metadata5">
    <rdf:RDF>
      <cc:Work
         rdf:about="">
        <dc:format>image/svg+xml</dc:format>
        <dc:type
           rdf:resource="http://purl.org/dc/dcmitype/StillImage" />
        <dc:title />
      </cc:Work>
    </rdf:RDF>
  </metadata>
  <g
     inkscape:label="Ebene 1"
     inkscape:groupmode="layer"
     id="layer1"
     style="display:inline">
    <path
       style="opacity:1;vector-effect:none;fill:url(#linearGradient1148);fill-opacity:1;stroke:none;stroke-width:0.27399999;stroke-linecap:round;stroke-linejoin:bevel;stroke-miterlimit:4;stroke-dasharray:0.548, 1.644;stroke-dashoffset:0;stroke-opacity:1;marker:none;paint-order:markers fill stroke"
       d="m -80.309839,4.5604388 v 4.59042 h 74.9954202 v -4.59042 z"
       id="path15768"
       inkscape:connector-curvature="0" />
    <g
       transform="matrix(1.000062,0,0,1,29.995385,-248.49768)"
       clip-path="url(#clipPath1650)"
       id="g1968"
       inkscape:tile-cx="49.895056"
       inkscape:tile-cy="40.823513"
       inkscape:tile-w="74.999997"
       inkscape:tile-h="39.999999"
       inkscape:tile-x0="4.8561202"
       inkscape:tile-y0="5.3767212">
      <g
         id="g1662"
         transform="translate(-8.0181566,-4.6818667)">
        <path
           style="opacity:0.103;fill:#000000;stroke-width:0.20687391"
           d="m 59.811855,260.48713 c -2.327849,-0.005 -4.632986,0.84093 -6.303491,2.55074 l -27.79107,28.4391 c -9.390007,11.62838 6.389976,10.2752 13.154753,13.62449 2.426632,2.48042 -9.300631,4.31141 -6.873999,6.7939 2.426631,2.48042 14.673614,4.77909 17.104381,7.25951 2.426632,2.48041 -4.967044,5.11136 -2.540413,7.59178 2.426632,2.48042 8.038966,0.13074 9.089885,5.857 0.748885,4.09197 10.114005,1.75818 14.694194,-1.59318 2.426632,-2.48249 -4.642516,-2.24849 -2.215885,-4.72891 6.034511,-6.17105 11.653425,-2.2429 13.718027,-8.42636 1.019887,-3.05552 -8.883089,-4.71036 -6.45232,-7.19077 6.981995,-4.07749 31.113873,-6.73137 19.6634,-18.18184 l -28.80703,-29.44472 c -1.761529,-1.69119 -4.112585,-2.54609 -6.440432,-2.55074 z m 0.249598,2.70629 c 1.661972,0.009 3.318205,0.6305 4.510833,1.83865 l 10.995198,11.16728 c 1.042643,1.0654 1.028316,3.13007 0.444934,3.7238 l -5.459617,-4.36718 -1.073319,6.46679 -4.561996,-2.40812 -7.304464,4.61574 -2.418456,-9.72964 -3.92431,6.78977 h -5.999115 c -2.44525,0 -2.732908,-3.10292 -0.51108,-5.32474 3.880953,-4.1892 8.334989,-8.45949 10.755416,-10.9337 1.216417,-1.24331 2.884001,-1.84744 4.545976,-1.83865 z m 30.896822,51.26251 c -2.398977,-0.0606 -4.873979,1.09903 -5.526796,3.39927 0,1.41088 10.395233,2.33588 10.395233,-0.3328 -0.694322,-2.00926 -2.751696,-3.01299 -4.868437,-3.06647 z m -48.084921,6.11228 c -3.257939,-0.0302 -7.080276,2.35014 -4.270026,4.78421 2.4618,2.12873 6.264326,-0.52934 7.404201,-3.50005 -0.670854,-0.89136 -1.85933,-1.27233 -3.134175,-1.28416 z m 41.254845,0.18552 c -3.173444,2.84659 0.355576,5.73448 3.48351,3.89537 0.697164,-0.70751 -0.01836,-3.18786 -3.48351,-3.89537 z"
           id="path1658"
           inkscape:connector-curvature="0" />
        <path
           id="path1660"
           d="m 46.857614,306.64081 c 0.742677,0.46133 11.97593,2.74315 14.721147,3.19827 0.95162,0.20067 0.277211,1.18125 -1.03437,1.84325 -2.958297,0.78612 -17.30707,-5.04152 -13.686777,-5.04152 z"
           inkscape:connector-curvature="0"
           style="fill:#ffffff;stroke-width:0.20687389" />
      </g>
      <path
         style="opacity:1;vector-effect:none;fill:url(#linearGradient3102);fill-opacity:1;stroke:none;stroke-width:0.27399999;stroke-linecap:round;stroke-linejoin:bevel;stroke-miterlimit:4;stroke-dasharray:0.54799999, 1.64399998;stroke-dashoffset:0;stroke-opacity:1;marker:none;paint-order:markers fill stroke"
         d="m 75,257 v 10.86755 H 0.00922861 V 257 Z m 0,35.40507 v 4.59042 H 0.00457988 v -4.59042 z"
         id="path1664"
         inkscape:connector-curvature="0" />
      <text
         id="text1668"
         y="267.07162"
         x="0.7734127"
         style="font-style:normal;font-variant:normal;font-weight:normal;font-stretch:normal;font-size:2.30700326px;line-height:0%;font-family:'Euphoria Script';-inkscape-font-specification:'Euphoria Script';letter-spacing:0px;word-spacing:0px;opacity:0.111;fill:#000000;fill-opacity:1;stroke:none;stroke-width:0.09587985px;stroke-linecap:butt;stroke-linejoin:miter;stroke-opacity:1;"
         xml:space="preserve"
         clip-path="url(#clipPath8524)"
         transform="translate(-7.1e-5,-0.00465)"><tspan
           style="font-style:normal;font-variant:normal;font-weight:normal;font-stretch:normal;font-size:18.40892601px;line-height:1;font-family:'Euphoria Script';-inkscape-font-specification:'Euphoria Script';fill:#000000;fill-opacity:1;stroke-width:0.09587985px;"
           y="267.07162"
           x="0.7734127"
           id="tspan1666"
           sodipodi:role="line">Draw Freely.</tspan></text>
      <circle
         style="opacity:1;vector-effect:none;fill:#4ad0c7;fill-opacity:1;stroke:#ade8e5;stroke-width:0.38215557;stroke-linecap:round;stroke-linejoin:round;stroke-miterlimit:4;stroke-dasharray:none;stroke-dashoffset:0;stroke-opacity:1;marker:none;paint-order:markers fill stroke"
         id="circle1670"
         cx="6.7664456"
         cy="262.43378"
         r="4.1879544" />
      <g
         id="g1678"
         transform="matrix(0.01730867,0,0,0.01730867,3.3615392,259.05747)">
        <path
           id="path1672"
           d="M 163.15,27.83 28.81,165.3 C -16.58,221.51 59.7,214.97 92.4,231.16 104.13,243.15 47.44,252 59.17,264 c 11.73,11.99 70.93,23.1 82.68,35.09 11.73,11.99 -24.01,24.71 -12.28,36.7 11.73,11.99 38.86,0.63 43.94,28.31 3.62,19.78 48.89,8.5 71.03,-7.7 11.73,-12 -22.44,-10.87 -10.71,-22.86 29.17,-29.83 56.33,-10.84 66.31,-40.73 4.93,-14.77 -42.94,-22.77 -31.19,-34.76 33.75,-19.71 150.4,-32.54 95.05,-87.89 L 224.75,27.83 c -17.03,-16.35 -45.45,-16.53 -61.6,0 z m 154.31,264.98 c 0,6.82 50.25,11.29 50.25,-1.61 -7.16,-20.72 -44.31,-19.32 -50.25,1.61 z M 91.1,329.05 c 11.9,10.29 30.28,-2.56 35.79,-16.92 -11.53,-15.32 -54.69,0.55 -35.79,16.92 z m 220.06,-22.23 c -15.34,13.76 1.72,27.72 16.84,18.83 3.37,-3.42 -0.09,-15.41 -16.84,-18.83 z"
           inkscape:connector-curvature="0" />
        <path
           id="path1674"
           d="m 131,238.6 c 3.59,2.23 57.89,13.26 71.16,15.46 4.6,0.97 1.34,5.71 -5,8.91 -14.3,3.8 -83.66,-24.37 -66.16,-24.37 z"
           inkscape:connector-curvature="0"
           style="fill:#ffffff" />
        <path
           id="path1676"
           d="m 216.63,37.47 53.15,53.98 c 5.04,5.15 4.97,15.13 2.15,18 L 245.54,88.34 240.35,119.6 218.3,107.96 182.99,130.27 171.3,83.24 152.33,116.06 h -29 c -11.82,0 -13.21,-15 -2.47,-25.74 18.76,-20.25 40.29,-40.89 51.99,-52.85 11.76,-12.02 32.25,-11.68 43.78,0 z"
           inkscape:connector-curvature="0"
           style="fill:#ffffff" />
      </g>
      <text
         xml:space="preserve"
         style="font-style:normal;font-variant:normal;font-weight:normal;font-stretch:normal;font-size:6.30183935px;line-height:1;font-family:'Linux Libertine Display O';-inkscape-font-specification:'Linux Libertine Display O';letter-spacing:0px;word-spacing:0px;fill:#000000;fill-opacity:1;stroke:#000000;stroke-width:0.058;stroke-miterlimit:4;stroke-dasharray:none;stroke-opacity:1;paint-order:stroke markers fill"
         x="12.675494"
         y="264.47559"
         id="text1682"><tspan
           sodipodi:role="line"
           id="tspan1680"
           x="12.675494"
           y="264.47559"
           style="font-style:normal;font-variant:normal;font-weight:normal;font-stretch:normal;font-family:'Linux Libertine Display O';-inkscape-font-specification:'Linux Libertine Display O';fill:#000000;fill-opacity:1;stroke:#000000;stroke-width:0.058;stroke-miterlimit:4;stroke-dasharray:none;stroke-opacity:1;paint-order:stroke markers fill">INKSCAPE </tspan></text>
      <text
         xml:space="preserve"
         style="font-style:normal;font-variant:normal;font-weight:normal;font-stretch:normal;font-size:2.66980314px;line-height:1;font-family:Ubuntu;-inkscape-font-specification:Ubuntu;text-align:end;letter-spacing:0px;word-spacing:0px;text-anchor:end;fill:#fcfcfc;fill-opacity:1;stroke:none;stroke-width:0.06674509"
         x="72.254906"
         y="261.79837"
         id="text1688"><tspan
           sodipodi:role="line"
           id="tspan1684"
           x="72.254906"
           y="261.79837"
           style="font-style:normal;font-variant:normal;font-weight:normal;font-stretch:normal;font-family:Ubuntu;-inkscape-font-specification:Ubuntu;text-align:end;text-anchor:end;fill:#fcfcfc;fill-opacity:1;stroke-width:0.06674509">Open Source</tspan><tspan
           sodipodi:role="line"
           x="72.254906"
           y="264.46817"
           style="font-style:normal;font-variant:normal;font-weight:normal;font-stretch:normal;font-family:Ubuntu;-inkscape-font-specification:Ubuntu;text-align:end;text-anchor:end;fill:#fcfcfc;fill-opacity:1;stroke-width:0.06674509"
           id="tspan1686">Vector Graphics</tspan></text>
      <g
         id="g1962"
         style="fill:#f5f5f5;fill-opacity:1"
         mask="url(#mask15779)"
         transform="translate(-7.1e-5,-0.00465)">
        <g
           style="fill:#f5f5f5;fill-opacity:1"
           id="g1960">
          <g
             inkscape:label="00149"
             id="g1696"
             transform="matrix(0.13116334,0,0,0.13116334,19.572526,167.1668)"
             style="fill:#f5f5f5;fill-opacity:1">
            <path
               style="opacity:0;fill:#f5f5f5;fill-opacity:1"
               d="m 285,960.36218 h 24 v 24 h -24 z"
               id="path1690"
               inkscape:connector-curvature="0" />
            <path
               inkscape:connector-curvature="0"
               id="path1692"
               d="m 297,966.3622 -3.7188,1.4687 c 0.014,-0.018 -0.029,-0.042 -0.4062,0.031 -6,1.1662 -6.375,2.4859 -6.375,4.5 v 7.5 c 0,0.831 0.669,1.5 1.5,1.5 0.831,0 2,-0.169 2,-1 v -10 c 7,11 0,0.016 7.1875,11.625 0.5755,0.8523 1.5948,1.1547 2.2812,0.6562 l 7.4688,-5.4062 c 0.6864,-0.4985 0.763,-1.5852 0.1875,-2.4375 L 303,968.7056 v 2.1563 1.5 c 0,0.554 -0.446,1 -1,1 h -4 c -0.554,0 -1,-0.446 -1,-1 v -0.5 -4.5 -1 z"
               style="opacity:1;fill:#f5f5f5;fill-opacity:1" />
            <path
               style="opacity:1;fill:#f5f5f5;fill-opacity:1"
               d="m 299,960.36218 h 2 c 0.554,0 1,0.446 1,1 v 10 c 0,0.554 -0.446,1 -1,1 h -2 c -0.554,0 -1,-0.446 -1,-1 v -10 c 0,-0.554 0.446,-1 1,-1 z"
               id="path1694"
               inkscape:connector-curvature="0" />
          </g>
          <g
             id="g1706"
             inkscape:label="00145"
             transform="matrix(0.13116334,0,0,0.13116334,23.098424,175.28832)"
             style="fill:#f5f5f5;fill-opacity:1">
            <path
               style="opacity:0;fill:#f5f5f5;fill-opacity:1"
               d="m 285.07831,898.44312 h 24 v 24 h -24 z"
               id="path1698"
               inkscape:connector-curvature="0" />
            <path
               style="opacity:1;fill:#f5f5f5;fill-opacity:1"
               d="m 286,899.3622 v 22.1562 h 22.1562 v -22.1562 z m 1,1 h 19.9687 v 19.9687 H 287 Z"
               id="path1700"
               inkscape:connector-curvature="0" />
            <path
               id="path1702"
               transform="translate(0,512.3622)"
               d="m 288,389 v 18 l 8.625,-8.625 -4.375,-3.4063 h -3.3438 v -4 h 4 v 3.2188 l 4.4375,3.4687 L 306,389 Z"
               style="opacity:1;fill:#f5f5f5;fill-opacity:1"
               inkscape:connector-curvature="0" />
            <path
               inkscape:connector-curvature="0"
               style="opacity:0.5;fill:#f5f5f5;fill-opacity:1"
               d="m 306,919.3622 v -18 l -8.625,8.625 4.375,3.4062 h 3.3437 v 4 h -4 v -3.2187 l -4.4375,-3.4688 -8.6562,8.6563 z"
               id="path1704" />
          </g>
          <g
             id="g1718"
             inkscape:label="00147"
             transform="matrix(0.13116334,0,0,0.13116314,30.181041,171.23306)"
             style="fill:#f5f5f5;fill-opacity:1">
            <g
               transform="matrix(1.5,0,0,1.495868,13.49969,664.5935)"
               id="g1716"
               inkscape:label="stock-tool-color-picker"
               style="fill:#f5f5f5;fill-opacity:1">
              <path
                 transform="translate(241.0002,217)"
                 style="opacity:0;fill:#f5f5f5;fill-opacity:1"
                 d="m -60,-40 h 16 v 16 h -16 z"
                 id="path1708"
                 inkscape:connector-curvature="0" />
              <path
                 inkscape:connector-curvature="0"
                 d="m 191.6122,182.4047 -4.2202,5.6634 -1.6941,1.4926 -0.6977,-0.5607 0.9963,-2.0533 4.2202,-5.6634 z"
                 id="path1710"
                 style="opacity:1;fill:#f5f5f5;fill-opacity:1" />
              <path
                 inkscape:connector-curvature="0"
                 d="m 185.0002,189.5745 c 0,0 -1.4772,0.6685 -1.4654,2.0797 0.0147,1.758 2.6601,1.8435 2.7433,0.2845 0.0475,-0.891 -1.2779,-2.3642 -1.2779,-2.3642 z"
                 id="path1712"
                 style="opacity:1;fill:#f5f5f5;fill-opacity:1" />
              <path
                 inkscape:connector-curvature="0"
                 d="m 187.6465,181.4304 4.6492,3.5274 0.7045,-0.9258 -1.3947,-1.0581 c 2.8037,-0.7933 4.7199,-4.1749 2.8602,-5.5859 -1.8596,-1.4109 -4.7057,1.2652 -4.7199,4.1749 l -1.3948,-1.0582 z"
                 id="path1714"
                 style="opacity:1;fill:#f5f5f5;fill-opacity:1" />
            </g>
          </g>
          <g
             inkscape:label="00139"
             id="g1726"
             transform="matrix(0.13095912,0,0,0.13116334,5.4860492,187.49712)"
             style="fill:#f5f5f5;fill-opacity:1">
            <path
               style="opacity:0;fill:#f5f5f5;fill-opacity:1"
               d="m 285,805.36218 h 24 v 24 h -24 z"
               id="path1720"
               inkscape:connector-curvature="0" />
            <path
               id="path1722"
               d="m 285,805.3622 v 0.5 c 6.7457,2.1875 -0.9774,11.4623 0.8919,19 2.1081,8.5 6.286,2 6.286,2 0,0 -0.1779,-2.5 -0.4216,-1.5 0,0 -2.7563,4 -3.7563,-1 -1.6756,-8.3781 12.5995,-19 -3,-19 z"
               style="opacity:1;fill:#f5f5f5;fill-opacity:1"
               inkscape:connector-curvature="0" />
            <path
               inkscape:connector-curvature="0"
               id="path1724"
               d="m 309,809.3622 0.0374,3.4451 -5.0824,-5.4624 1.7099,-1.8525 m -2.7074,2.9449 2.0425,2.185 0.9975,1.0925 2.0424,2.185 -1.045,1.0925 c -1.0131,1.0911 -0.9818,1.0951 -1.9949,4.3699 -4.0529,4.3646 -8.1224,4.3699 -8.1224,4.3699 l -0.9975,1.0925 c 0,0 -1.0293,1.0911 -2.0425,0 l 6.0799,-6.5549 0.095,-0.1424 c 0.8018,0.4211 1.7564,0.289 2.4225,-0.4275 0.8395,-0.9042 0.8389,-2.3747 0,-3.2775 -0.8389,-0.9028 -2.2004,-0.9041 -3.0399,0 -0.666,0.7168 -0.7715,1.7967 -0.38,2.66 l -0.095,0.095 -6.0799,6.5549 c -1.0132,-1.0912 0,-2.185 0,-2.185 l 0.9974,-1.0925 c 0,0 -0.0154,-4.3753 4.0375,-8.7398 3.0401,-1.0925 3.0717,-1.0938 4.0849,-2.185 z"
               style="opacity:1;fill:#f5f5f5;fill-opacity:1" />
          </g>
          <g
             id="g1740"
             style="fill:#f5f5f5;fill-opacity:1">
            <path
               inkscape:connector-curvature="0"
               id="path1728"
               d="m 73.126389,293.52485 a 0.06533617,0.06554408 0 0 0 -0.03266,0.11878 l 0.628797,0.50382 v 1.01583 a 0.06533617,0.06554408 0 1 0 0.130652,0 v -1.04861 a 0.06533617,0.06554408 0 0 0 -0.02449,-0.0491 l -0.653299,-0.5243 a 0.06533617,0.06554408 0 0 0 -0.049,-0.0164 z"
               style="opacity:1;fill:#f5f5f5;fill-opacity:1;stroke-width:0.13116324" />
            <path
               inkscape:connector-curvature="0"
               id="path1730"
               d="m 72.211367,294.31163 a 0.06576559,0.06172414 20.549977 0 0 -0.05998,0.0359 l -0.396808,0.79038 a 0.06633579,0.0622593 20.549977 1 0 0.119266,0.0579 l 0.396809,-0.79037 a 0.06576559,0.06172414 20.549977 0 0 -0.05929,-0.0938 z"
               style="opacity:1;fill:#f5f5f5;fill-opacity:1;stroke-width:0.13116324" />
            <path
               inkscape:connector-curvature="0"
               id="path1732"
               d="m 71.885741,293.26229 h 1.049133 v 0.91803 h -1.049133 z"
               style="opacity:1;fill:#f5f5f5;fill-opacity:1;stroke-width:0.13116324" />
            <path
               style="opacity:1;fill:#f5f5f5;fill-opacity:1;stroke-width:0.13116324"
               d="m 71.230098,295.3609 h 1.049133 v 0.91803 h -1.049133 z"
               id="path1734"
               inkscape:connector-curvature="0" />
            <path
               style="opacity:1;fill:#f5f5f5;fill-opacity:1;stroke-width:0.13116324"
               d="m 73.197548,295.36101 h 1.049133 v 0.91803 h -1.049133 z"
               id="path1736"
               inkscape:connector-curvature="0" />
            <path
               style="opacity:0;fill:#f5f5f5;fill-opacity:1;stroke-width:0.13116324"
               d="m 71.098761,293.13112 h 3.14792 v 3.14791 h -3.14792 z"
               id="path1738"
               inkscape:connector-curvature="0" />
          </g>
          <g
             id="g1750"
             inkscape:label="00219"
             transform="matrix(0.13116334,0,0,0.13611808,-31.922269,208.56819)"
             style="fill:#f5f5f5;fill-opacity:1">
            <path
               style="opacity:0;fill:#f5f5f5;fill-opacity:1"
               d="m 408,621.24683 h 24 v 23.12638 h -24 z"
               id="path1742"
               inkscape:connector-curvature="0" />
            <path
               d="m 410.54813,637.09422 10.83653,-3.96438 v -10.97813 l -10.77603,4.04027 z"
               style="opacity:1;fill:#f5f5f5;fill-opacity:1"
               id="path1744"
               inkscape:connector-curvature="0" />
            <path
               d="m 410.99979,637.75762 10.81221,-3.98252 7.63932,6.11252 -10.78585,3.74639 z"
               style="opacity:0.75;fill:#f5f5f5;fill-opacity:1"
               id="path1746"
               inkscape:connector-curvature="0" />
            <path
               d="m 422.22593,633.12984 7.6847,6.12984 -0.0196,-11.12059 -7.6651,-5.99201 z"
               style="opacity:0.5;fill:#f5f5f5;fill-opacity:1"
               id="path1748"
               inkscape:connector-curvature="0" />
          </g>
          <g
             inkscape:label="00129"
             id="g1756"
             transform="matrix(0.13116334,0,0,0.13116334,-12.253007,207.69628)"
             style="fill:#f5f5f5;fill-opacity:1">
            <path
               style="opacity:0;fill:#f5f5f5;fill-opacity:1"
               d="m 285,651.36218 h 24 v 24 h -24 z"
               id="path1752"
               inkscape:connector-curvature="0" />
            <path
               inkscape:connector-curvature="0"
               id="path1754"
               d="m 297,652.3622 c -6.0751,0 -11,4.9249 -11,11 0,6.0751 4.9249,11 11,11 6.0751,0 11,-4.9249 11,-11 0,-6.0751 -4.9249,-11 -11,-11 z m 0,1.8333 c 5.0626,0 9.1667,4.1041 9.1667,9.1667 0,5.0626 -4.1041,9.1666 -9.1667,9.1666 -5.0626,0 -9.1667,-4.104 -9.1667,-9.1666 0,-5.0626 4.1041,-9.1667 9.1667,-9.1667 z"
               style="opacity:1;fill:#f5f5f5;fill-opacity:1" />
          </g>
          <g
             id="g1768"
             inkscape:label="00151"
             transform="matrix(0.13116334,0,0,0.13116314,16.036356,163.10094)"
             style="fill:#f5f5f5;fill-opacity:1">
            <path
               style="opacity:0;fill:#f5f5f5;fill-opacity:1"
               d="m 285,991.36218 h 24 v 24.00002 h -24 z"
               id="path1758"
               inkscape:connector-curvature="0" />
            <path
               id="path1760"
               d="m 301.7344,992.8622 c -0.1183,0.0242 -0.2393,0.1044 -0.3282,0.1875 l -6.4218,6 6.0468,6.5153 6.2344,-5.8122 c 0.3555,-0.3322 0.2676,-1.0242 -0.1875,-1.5469 l -4.1719,-4.8281 c -0.3413,-0.392 -0.817,-0.5881 -1.1718,-0.5156 z"
               style="opacity:1;fill:#f5f5f5;fill-opacity:1"
               inkscape:connector-curvature="0" />
            <path
               id="path1762"
               d="m 293.25,1000.69 -3.5156,3.282 c -0.3555,0.332 -0.3145,1.024 0.1406,1.546 l 4.2187,4.829 c 0.4551,0.522 1.0977,0.66 1.4532,0.328 l 3.7031,-3.469 z"
               style="opacity:1;fill:#f5f5f5;fill-opacity:1"
               inkscape:connector-curvature="0" />
            <path
               style="opacity:1;fill:#f5f5f5;fill-opacity:1"
               d="m 298.05,1012.362 c -0.5817,0 -1.05,0.446 -1.05,1 0,0.554 0.4683,1 1.05,1 h 2.1 6.3 1.05 v -1 -1 h -1.05 -6.3 z"
               id="path1764"
               inkscape:connector-curvature="0" />
            <path
               inkscape:connector-curvature="0"
               id="path1766"
               d="m 290.7167,1012.362 c 0.7109,0 1.2833,0.446 1.2833,1 0,0.554 -0.5724,1 -1.2833,1 -3.85,0 -3.6667,0 -4.2167,0 v -1 -1 c 0,0 0.3667,0 4.2167,0 z"
               style="opacity:1;fill:#f5f5f5;fill-opacity:1" />
          </g>
          <g
             id="g1780"
             inkscape:label="00135"
             transform="matrix(0.13116314,0,0,0.13011842,-1.64468,196.40661)"
             style="fill:#f5f5f5;fill-opacity:1">
            <g
               transform="matrix(1.500002,0,0,1.507293,163.5014,476.6427)"
               id="g1776"
               inkscape:label="stock-tool-pencil"
               style="fill:#f5f5f5;fill-opacity:1">
              <path
                 inkscape:connector-curvature="0"
                 id="path1770"
                 transform="translate(241.0002,217)"
                 d="m -146.8437,-39 -1.875,2 c 1.3287,0.02586 2.6651,1.21157 2.7187,2.4375 l 2,-2 c -0.0554,-1.26532 -1.4744,-2.4884 -2.8437,-2.4375 z"
                 style="opacity:1;fill:#f5f5f5;fill-opacity:1" />
              <path
                 style="opacity:0;fill:#f5f5f5;fill-opacity:1"
                 d="m 81.000198,177 h 16 v 16 h -16 z"
                 id="path1772"
                 inkscape:connector-curvature="0" />
              <path
                 inkscape:connector-curvature="0"
                 id="path1774"
                 d="m 83.63056,189.036 7.52022,-8.0345 c 1.36935,-0.0509 2.79406,1.1635 2.84942,2.4288 l -7.49004,7.794 L 82.0002,193 Z"
                 style="opacity:1;fill:#f5f5f5;fill-opacity:1" />
            </g>
            <path
               style="opacity:1;fill:#f5f5f5;fill-opacity:1;stroke-linecap:round"
               d="m 291.78516,743.42969 c -1.44922,-0.24244 -2.9001,0.15823 -3.90039,0.72265 -0.47842,0.26997 -1.05872,0.70003 -1.54102,1.31055 -0.4823,0.61052 -0.86942,1.43966 -0.7793,2.39453 0.13134,1.39258 1.08638,2.54159 2.02149,3.29102 0.38268,0.30677 0.87444,0.72729 1.11914,1.07422 0.12235,0.17346 0.17019,0.31495 0.17578,0.37304 0.006,0.0581 0.024,0.0505 -0.0664,0.15235 -0.12419,0.13984 -0.57117,0.34899 -1.125,0.4707 -0.55382,0.12171 -1.15554,0.17793 -1.67187,0.3125 -0.25817,0.0673 -0.54524,0.0838 -0.8418,0.49805 -0.14828,0.20713 -0.20801,0.56105 -0.13867,0.80468 0.0693,0.24364 0.19131,0.39012 0.3125,0.51563 0.48477,0.50202 1.22542,0.8763 2.69336,1.57422 a 0.76879815,0.76879815 0 1 0 0.66015,-1.38867 c -0.80441,-0.38246 -0.89621,-0.48231 -1.26953,-0.70704 0.22142,-0.038 0.34302,-0.0564 0.58399,-0.10937 0.66558,-0.14627 1.4028,-0.34031 1.94531,-0.95117 0.33128,-0.37299 0.48979,-0.87819 0.44727,-1.32031 -0.0425,-0.44213 -0.23217,-0.80361 -0.44922,-1.11133 -0.4341,-0.61545 -1.02395,-1.07399 -1.41406,-1.38672 -0.68849,-0.55178 -1.38826,-1.54851 -1.45313,-2.23633 -0.0441,-0.46702 0.13673,-0.89584 0.45508,-1.29883 0.31835,-0.40298 0.77221,-0.74349 1.09179,-0.92383 0.68051,-0.38397 1.9196,-0.70768 2.89258,-0.54492 0.56032,0.0937 1.18511,0.30905 1.70118,0.54883 0.51606,0.23979 0.94702,0.54215 1.02929,0.625 a 0.76856777,0.76856777 0 1 0 1.08985,-1.08398 c -0.36013,-0.36265 -0.85113,-0.64676 -1.47266,-0.93555 -0.62153,-0.28879 -1.35062,-0.54527 -2.0957,-0.66992 z"
               id="path1778"
               inkscape:connector-curvature="0" />
          </g>
          <g
             id="g1798"
             inkscape:label="00137"
             transform="matrix(0.13116334,0,0,0.13186807,1.8916766,191.01864)"
             style="fill:#f5f5f5;fill-opacity:1">
            <path
               inkscape:connector-curvature="0"
               style="opacity:1;fill:#f5f5f5;fill-opacity:1"
               d="m 299.3105,788.8172 -1.5844,4.509 c -0.4193,1.2247 1.2997,1.8792 1.7357,0.6094 l 1.7599,-4.4746 z"
               id="path1782" />
            <path
               inkscape:connector-curvature="0"
               id="path1784"
               d="m 298.3053,782.7608 0.7935,1.1812 5.9242,2.4229 1.5611,-0.5092 1.9892,-5.5024 c -2.5,0 -0.5,-6 -7,-6 z"
               style="opacity:1;fill:#f5f5f5;fill-opacity:1" />
            <path
               inkscape:connector-curvature="0"
               style="opacity:1;fill:#f5f5f5;fill-opacity:1"
               d="m 299,785.3622 -0.7016,2 5,1.8992 0.7016,-1.8992 z"
               id="path1786" />
            <path
               style="opacity:0;fill:#f5f5f5;fill-opacity:1"
               d="m 285,774.36218 h 24 v 23.86286 h -24 z"
               id="path1788"
               inkscape:connector-curvature="0" />
            <path
               style="opacity:1;fill:#f5f5f5;fill-opacity:1;stroke-linecap:butt"
               d="m 286.46094,775.36133 0.64844,0.78515 c 0,0 3.30496,4.00341 5.14257,8.18164 0.91881,2.08912 1.44462,4.21021 1.09375,5.81641 -0.35086,1.6062 -1.47269,2.80093 -4.26758,3.26563 l 0.15821,0.94531 c 3.03577,-0.50475 4.61908,-2.04944 5.04687,-4.00781 0.4278,-1.95838 -0.19599,-4.22733 -1.15429,-6.40625 -1.62373,-3.69192 -3.91734,-6.6468 -4.69336,-7.6211 h 10.08593 v -0.95898 z"
               id="path1790"
               inkscape:connector-curvature="0" />
            <path
               inkscape:connector-curvature="0"
               id="path1792"
               style="opacity:1;fill:#f5f5f5;fill-opacity:1"
               d="m 286,793.3622 h 4 v 4 h -4 z" />
            <path
               style="opacity:1;fill:#f5f5f5;fill-opacity:1;stroke-linecap:butt"
               d="m 287,795.32031 v 1.11719 h 9 v -1.11719 z"
               id="path1794"
               inkscape:connector-curvature="0" />
            <path
               transform="translate(0,512.3622)"
               style="opacity:1;fill:#f5f5f5;fill-opacity:1"
               d="m 286,262 h 4 v 4 h -4 z"
               id="path1796"
               inkscape:connector-curvature="0" />
          </g>
          <g
             inkscape:label="00131"
             id="g1808"
             transform="matrix(0.13099296,0,0,0.13116314,-8.6682765,203.63035)"
             style="fill:#f5f5f5;fill-opacity:1">
            <g
               transform="matrix(1.152542,0,0,1.167743,-234.553,477.0869)"
               id="g1802"
               style="fill:#f5f5f5;fill-opacity:1">
              <path
                 inkscape:connector-curvature="0"
                 id="path1800"
                 transform="matrix(0.8676476,0,0,0.856353,202.6658,29.35174)"
                 d="M 294.5,171 286,177.6562 289,188 h 1.9375 l 1.0777,-2.0366 c -0.5545,-0.01 -0.9759,0.041 -1.5291,0.081 l -2.558,-7.6907 6.6237,-5.2651 4.9785,3.9116 1.3447,-1 z"
                 style="opacity:1;fill:#f5f5f5;fill-opacity:1" />
            </g>
            <path
               style="opacity:0;fill:#f5f5f5;fill-opacity:1"
               d="m 285,682.36218 h 24 v 24 h -24 z"
               id="path1804"
               inkscape:connector-curvature="0" />
            <path
               inkscape:connector-curvature="0"
               id="path1806"
               transform="translate(0,512.3622)"
               d="m 302.5937,174.0312 -5.125,4.7813 -6.625,-1.7188 2.8438,6.4063 -3.6875,5.9062 6.9062,-0.8125 4.3125,5.4063 1.4063,-7 6.4062,-1.7045 L 302.9687,181 Z m -1.2651,3.4549 0.25,4.4201 4.0678,2.7027 -4.154,0.9987 -1.013,5.1714 -2.7607,-3.5473 -4.9839,0.3728 3.15,-3.9924 -2.5433,-4.4558 4.6638,1.3071 z"
               style="opacity:1;fill:#f5f5f5;fill-opacity:1" />
          </g>
          <g
             id="g1814"
             inkscape:label="00133"
             transform="matrix(0.13116334,0,0,0.13116314,-5.180665,199.69546)"
             style="fill:#f5f5f5;fill-opacity:1">
            <path
               style="opacity:0;fill:#f5f5f5;fill-opacity:1"
               d="m 285,712.36218 h 24 v 24.00002 h -24 z"
               id="path1810"
               inkscape:connector-curvature="0" />
            <path
               style="opacity:1;fill:#f5f5f5;fill-opacity:1;stroke-linecap:round"
               d="m 298.24805,713.9668 c -4.41918,-0.64126 -9.06491,1.39688 -11.38086,5.73437 -2.67088,5.00245 -1.29439,11.70232 3.61719,14.59375 4.16364,2.45101 9.7888,1.06281 12.06835,-3.51758 1.87772,-3.77285 0.79581,-8.77796 -3.0039,-10.80078 -3.01479,-1.60484 -7.05533,-0.51497 -8.50195,2.88477 -0.54027,1.26988 -0.59942,2.69957 -0.20313,3.98828 0.39629,1.2887 1.29332,2.46691 2.66406,3.01758 0.93748,0.37654 1.9858,0.36557 2.91602,-0.0234 0.93022,-0.38901 1.75207,-1.23019 1.99609,-2.38477 0.14447,-0.68359 0.0472,-1.35985 -0.29101,-2.0039 -0.1691,-0.32203 -0.41697,-0.64329 -0.79688,-0.8711 -0.37991,-0.2278 -0.90008,-0.31557 -1.37109,-0.20507 a 1.0001,1.0001 0 0 0 0.37109,1.96289 c 0.0114,0.0132 0.004,0.002 0.0254,0.043 0.0866,0.16499 0.1284,0.55164 0.10547,0.66015 -0.10608,0.50192 -0.38749,0.77816 -0.81055,0.95508 -0.42305,0.17692 -0.97951,0.17998 -1.39843,0.0117 -0.74386,-0.29883 -1.24471,-0.92616 -1.49805,-1.75 -0.25334,-0.82385 -0.21138,-1.81277 0.13086,-2.61719 0.98338,-2.31106 3.67924,-2.9901 5.72266,-1.90234 2.69549,1.43498 3.57418,5.29158 2.15429,8.14453 -1.76964,3.55581 -6.05567,4.57514 -9.26562,2.68555 -3.86543,-2.27557 -5.04831,-7.84258 -2.86719,-11.92774 2.55686,-4.78867 8.44487,-6.13795 12.8125,-3.42969 5.02495,3.11571 6.50945,10.39923 3.55664,15.71289 -0.009,0.0166 -0.0182,0.0349 -0.0293,0.0547 a 1.0001,1.0001 0 1 0 1.7461,0.97461 c 0.01,-0.0178 0.0194,-0.0373 0.0312,-0.0586 3.46198,-6.22994 1.78869,-14.63732 -4.25196,-18.38282 -1.32819,-0.82358 -2.77499,-1.33507 -4.24804,-1.54882 z"
               id="path1812"
               inkscape:connector-curvature="0" />
          </g>
          <g
             id="g1826"
             inkscape:label="00141"
             transform="matrix(0.13116334,0,0,0.13116334,8.9640163,183.43106)"
             style="fill:#f5f5f5;fill-opacity:1">
            <path
               style="opacity:0;fill:#f5f5f5;fill-opacity:1"
               d="m 285,836.36218 h 24 v 24 h -24 z"
               id="path1816"
               inkscape:connector-curvature="0" />
            <path
               inkscape:connector-curvature="0"
               id="path1818"
               d="m 291.1071,838.3622 -6.0714,20 H 289 c 0,0 0,0 1.4573,-5 h 6.5854 l 1.993,5 H 303 l -6.6071,-20 z m 2.6429,4.5 2.6721,7.5 h -5.2858 z"
               style="opacity:1;fill:#f5f5f5;fill-opacity:1" />
            <path
               inkscape:connector-curvature="0"
               id="path1820"
               d="m 304,858.3622 h 4 v 1 h -1 l -1,-1 -1,1 h -1 z"
               style="opacity:1;fill:#f5f5f5;fill-opacity:1" />
            <path
               inkscape:connector-curvature="0"
               id="path1822"
               d="m 304,837.3622 h 1 l 1,1 1,-1 h 1 v 1 h -4 z"
               style="opacity:1;fill:#f5f5f5;fill-opacity:1" />
            <path
               style="opacity:1;fill:#f5f5f5;fill-opacity:1"
               d="m 305,838.36218 h 2 v 20 h -2 z"
               id="path1824"
               inkscape:connector-curvature="0" />
          </g>
          <g
             id="g1852"
             style="fill:#f5f5f5;fill-opacity:1">
            <path
               style="opacity:0;fill:#f5f5f5;fill-opacity:1;stroke-width:0.13116334"
               d="m 64.026417,293.13112 h 3.14792 v 3.14792 h -3.14792 z"
               id="path1828"
               inkscape:connector-curvature="0" />
            <path
               style="opacity:1;fill:#f5f5f5;fill-opacity:1;stroke-width:0.13116334"
               d="m 64.15758,293.26228 h 0.655817 v 0.65581 H 64.15758 Z"
               id="path1830"
               inkscape:connector-curvature="0" />
            <path
               style="opacity:1;fill:#f5f5f5;fill-opacity:1;stroke-width:0.13116334"
               d="m 66.387357,293.26228 h 0.655817 v 0.65582 h -0.655817 z"
               id="path1832"
               inkscape:connector-curvature="0" />
            <path
               style="opacity:1;fill:#f5f5f5;fill-opacity:1;stroke-width:0.13116334"
               d="m 64.15758,295.49206 h 0.655817 v 0.65582 H 64.15758 Z"
               id="path1834"
               inkscape:connector-curvature="0" />
            <path
               style="opacity:1;fill:#f5f5f5;fill-opacity:1;stroke-width:0.13116334"
               d="m 66.387357,295.49206 h 0.655817 v 0.65582 h -0.655817 z"
               id="path1836"
               inkscape:connector-curvature="0" />
            <path
               style="fill:#f5f5f5;fill-opacity:1;stroke-width:0.13116334"
               id="path1838"
               d="m 65.075724,293.46005 v 0.0646 h 0.131163 v -0.0548 c -0.04147,-0.006 -0.08534,-0.009 -0.131163,-0.01 z m 0,0.0646 H 64.94456 v 0.13116 h 0.131164 z m -0.131164,0.13116 h -0.131163 v 0.13117 h 0.131163 z m -0.131163,0.13117 h -0.131163 v 0.13116 h 0.131163 z m -0.131163,0.13116 h -0.09402 c 0.0097,0.046 0.0163,0.0894 0.02075,0.13116 h 0.07327 z m 0,-0.13116 v -0.13117 H 64.55107 v 0.11656 c 0.0014,0.005 0.0037,0.01 0.0051,0.0146 z m -0.131164,-0.13117 v -0.0892 c -0.0223,0.008 -0.04233,0.014 -0.06558,0.0236 0.0096,0.0233 0.01517,0.0433 0.02357,0.0656 z m 0.131164,0 h 0.131163 v -0.13116 h -0.131163 z m 0,-0.13116 v -0.005 c -0.0046,10e-4 -0.01,0.004 -0.0146,0.005 z m 0.131163,0 h 0.131163 v -0.0579 c -0.04173,0.004 -0.08516,0.011 -0.131163,0.0208 z"
               inkscape:connector-curvature="0" />
            <path
               id="path1840"
               d="m 65.33805,293.49669 v 0.0279 h 0.09146 c -0.02968,-0.0103 -0.06031,-0.0194 -0.09146,-0.0279 z m 0,0.0279 h -0.131163 v 0.13116 h 0.131163 z m 0,0.13116 v 0.13117 h 0.131164 v -0.13117 z m 0.131164,0 h 0.131163 v -0.0656 c -0.04324,-0.0178 -0.08688,-0.035 -0.131163,-0.0515 z m 0.131163,0 v 0.13117 h 0.131163 v -0.13117 z m 0.131163,0 h 0.03971 c -0.01328,-0.005 -0.02663,-0.009 -0.03971,-0.0141 z m -0.131163,0.13117 h -0.131163 v 0.13116 h 0.131163 z m -0.131163,0.13116 H 65.33805 v 0.13116 h 0.131164 z m -0.131164,0.13116 h -0.131163 v 0.13117 h 0.131163 z m -0.131163,0.13117 h -0.131163 v 0.13116 h 0.131163 z m -0.131163,0.13116 H 64.94456 v 0.13116 h 0.131164 z m -0.131164,0.13116 h -0.131163 v 0.13117 h 0.131163 z m -0.131163,0.13117 h -0.131163 v 0.13116 h 0.131163 z m -0.131163,0.13116 H 64.55107 v 0.13116 h 0.131164 z m -0.131164,0.13116 h -0.117073 c -0.0049,0.0131 -0.0095,0.0264 -0.01409,0.0397 v 0.0915 h 0.131163 z m -0.131163,0.13117 h -0.02792 c -0.0114,0.0417 -0.02032,0.0855 -0.0269,0.13116 h 0.05482 z m 0.131163,-0.26233 v -0.13116 h -0.01409 c -0.01652,0.0443 -0.03369,0.0879 -0.05149,0.13116 z m 0,-0.13116 h 0.131164 v -0.13117 h -0.10324 c -0.0085,0.0312 -0.0176,0.0618 -0.02792,0.0915 z m 0.131164,-0.13117 h 0.131163 v -0.13116 h -0.131163 z m 0,-0.13116 v -0.13116 h -0.06661 c -6.56e-4,0.0458 -0.0038,0.0897 -0.0097,0.13116 z m 0,-0.13116 h 0.131163 v -0.13117 h -0.131163 z m 0.131163,-0.13117 h 0.131163 v -0.13116 h -0.131163 z m 0.131163,-0.13116 h 0.131164 v -0.13116 H 64.94456 Z m 0.131164,-0.13116 h 0.131163 v -0.13117 h -0.131163 z m 0.131163,0 v 0.13116 h 0.131163 v -0.13116 z m 0,0.13116 h -0.131163 v 0.13116 h 0.131163 z m -0.131163,0.13116 H 64.94456 v 0.13117 h 0.131164 z m -0.131164,0.13117 h -0.131163 v 0.13116 h 0.131163 z"
               style="opacity:0.75;fill:#f5f5f5;fill-opacity:1;stroke-width:0.13116334"
               inkscape:connector-curvature="0" />
            <path
               id="path1842"
               d="m 66.649684,293.61376 c -0.03965,0.0149 -0.07973,0.0306 -0.116561,0.042 h 0.116561 z m -0.131164,0.0471 c -0.04645,0.014 -0.08882,0.0231 -0.131163,0.032 v 0.094 h 0.131163 z m -0.131163,0.12604 h -0.131163 v 0.13116 h 0.131163 z m -0.131163,0.13116 H 66.12503 v 0.13116 h 0.131164 z m -0.131164,0.13116 h -0.131163 v 0.13117 h 0.131163 z m -0.131163,0.13117 h -0.131163 v 0.13116 h 0.131163 z m -0.131163,0.13116 H 65.73154 v 0.13116 h 0.131164 z m -0.131164,0.13116 h -0.131163 v 0.13117 h 0.131163 z m -0.131163,0.13117 h -0.131163 v 0.13116 h 0.131163 z m -0.131163,0.13116 H 65.33805 v 0.13116 h 0.131164 z m -0.131164,0.13116 h -0.131163 v 0.13117 h 0.131163 z m -0.131163,0.13117 h -0.131163 v 0.13116 h 0.131163 z m -0.131163,0.13116 H 64.94456 v 0.13116 h 0.131164 z m -0.131164,0.13116 h -0.131163 v 0.13117 h 0.131163 z m -0.131163,0.13117 h -0.131163 v 0.13116 h 0.131163 z m -0.131163,0.13116 H 64.55107 v 0.13116 h 0.131164 z m -0.131164,0.13116 h -0.131163 v 0.0146 c 0.01145,0.0368 0.02708,0.0769 0.04201,0.11657 h 0.08915 z m -0.131163,0 v -0.13116 h -0.03714 c 0.009,0.0423 0.01798,0.0847 0.03202,0.13116 z m 0,-0.13116 h 0.131163 v -0.13116 h -0.131163 z m 0,-0.13116 v -0.13117 h -0.06456 c -5.25e-4,0.0415 0.0018,0.0853 0.0067,0.13117 z m 0,-0.13117 h 0.131163 v -0.13116 h -0.131163 z m 0.131163,-0.13116 h 0.131164 v -0.13116 H 64.55107 Z m 0.131164,-0.13116 h 0.131163 v -0.13117 h -0.131163 z m 0.131163,-0.13117 h 0.131163 v -0.13116 h -0.131163 z m 0.131163,-0.13116 h 0.131164 v -0.13116 H 64.94456 Z m 0.131164,-0.13116 h 0.131163 v -0.13117 h -0.131163 z m 0.131163,-0.13117 h 0.131163 v -0.13116 h -0.131163 z m 0.131163,-0.13116 h 0.131164 v -0.13116 H 65.33805 Z m 0.131164,-0.13116 h 0.131163 v -0.13117 h -0.131163 z m 0.131163,-0.13117 h 0.131163 v -0.13116 h -0.131163 z m 0.131163,-0.13116 h 0.131164 V 293.7869 H 65.73154 Z m 0.131164,-0.13116 h 0.131163 v -0.0763 c -0.04565,-0.007 -0.08941,-0.0155 -0.131163,-0.0269 z m 0.131163,0 v 0.13116 h 0.131163 v -0.13116 z m 0.131163,0 h 0.131164 v -0.0733 c -0.04587,0.005 -0.08969,0.007 -0.131164,0.007 z m -0.131163,0.13116 h -0.131163 v 0.13116 h 0.131163 z m -0.131163,0.13116 H 65.73154 v 0.13117 h 0.131164 z m -0.131164,0.13117 h -0.131163 v 0.13116 h 0.131163 z m -0.131163,0.13116 h -0.131163 v 0.13116 h 0.131163 z m -0.131163,0.13116 H 65.33805 v 0.13117 h 0.131164 z m -0.131164,0.13117 h -0.131163 v 0.13116 h 0.131163 z m -0.131163,0.13116 h -0.131163 v 0.13116 h 0.131163 z m -0.131163,0.13116 H 64.94456 v 0.13117 h 0.131164 z m -0.131164,0.13117 h -0.131163 v 0.13116 h 0.131163 z m -0.131163,0.13116 h -0.131163 v 0.13116 h 0.131163 z m -0.131163,0.13116 H 64.55107 v 0.13117 h 0.131164 z"
               style="opacity:0.65;fill:#f5f5f5;fill-opacity:1;stroke-width:0.13116334"
               inkscape:connector-curvature="0" />
            <path
               id="path1844"
               d="m 66.649684,293.65577 v 0.13117 h 0.131163 v -0.0146 c -0.01145,-0.0368 -0.02707,-0.0769 -0.04201,-0.11656 z m 0.131163,0.13117 v 0.13116 h 0.03715 c -0.009,-0.0423 -0.01798,-0.0847 -0.03202,-0.13116 h -0.0051 z m 0,0.13116 h -0.131163 v 0.13116 h 0.131163 z m 0,0.13116 v 0.13117 h 0.06456 c 5.25e-4,-0.0415 -0.0018,-0.0853 -0.0067,-0.13117 z m 0,0.13117 h -0.131163 v 0.13116 h 0.131163 z m -0.131163,0.13116 H 66.51852 v 0.13116 h 0.131164 z m -0.131164,0.13116 h -0.131163 v 0.13117 h 0.131163 z m -0.131163,0.13117 h -0.131163 v 0.13116 h 0.131163 z m -0.131163,0.13116 H 66.12503 v 0.13116 h 0.131164 z m -0.131164,0.13116 h -0.131163 v 0.13117 h 0.131163 z m -0.131163,0.13117 h -0.131163 v 0.13116 h 0.131163 z m -0.131163,0.13116 H 65.73154 v 0.13116 h 0.131164 z m -0.131164,0.13116 h -0.131163 v 0.13117 h 0.131163 z m -0.131163,0.13117 h -0.131163 v 0.13116 h 0.131163 z m -0.131163,0.13116 H 65.33805 v 0.13116 h 0.131164 z m -0.131164,0.13116 h -0.131163 v 0.0763 c 0.04565,0.007 0.08941,0.0155 0.131163,0.0269 z m -0.131163,0 v -0.13116 h -0.131163 v 0.13116 z m -0.131163,0 H 64.94456 v 0.0733 c 0.04588,-0.005 0.0897,-0.007 0.131164,-0.007 z m -0.131164,0 v -0.13116 h -0.131163 v 0.13116 z m -0.131163,0 h -0.131163 v 0.12604 c 0.04645,-0.014 0.08882,-0.0231 0.131163,-0.032 z m 0.131163,-0.13116 h 0.131164 V 295.3609 H 64.94456 Z m 0.131164,-0.13116 h 0.131163 v -0.13117 h -0.131163 z m 0.131163,-0.13117 h 0.131163 v -0.13116 h -0.131163 z m 0.131163,-0.13116 h 0.131164 v -0.13116 H 65.33805 Z m 0.131164,-0.13116 h 0.131163 v -0.13117 h -0.131163 z m 0.131163,-0.13117 h 0.131163 v -0.13116 h -0.131163 z m 0.131163,-0.13116 h 0.131164 v -0.13116 H 65.73154 Z m 0.131164,-0.13116 h 0.131163 v -0.13117 h -0.131163 z m 0.131163,-0.13117 h 0.131163 v -0.13116 h -0.131163 z m 0.131163,-0.13116 h 0.131164 v -0.13116 H 66.12503 Z m 0.131164,-0.13116 h 0.131163 v -0.13117 h -0.131163 z m 0.131163,-0.13117 h 0.131163 v -0.13116 h -0.131163 z m 0.131163,-0.13116 h 0.131164 v -0.13116 H 66.51852 Z m 0,0.13116 v 0.13117 h 0.131164 v -0.13117 z m 0,0.13117 h -0.131163 v 0.13116 h 0.131163 z m -0.131163,0.13116 h -0.131163 v 0.13116 h 0.131163 z m -0.131163,0.13116 H 66.12503 v 0.13117 h 0.131164 z m -0.131164,0.13117 h -0.131163 v 0.13116 h 0.131163 z m -0.131163,0.13116 h -0.131163 v 0.13116 h 0.131163 z m -0.131163,0.13116 H 65.73154 v 0.13117 h 0.131164 z m -0.131164,0.13117 h -0.131163 v 0.13116 h 0.131163 z m -0.131163,0.13116 h -0.131163 v 0.13116 h 0.131163 z m -0.131163,0.13116 H 65.33805 v 0.13117 h 0.131164 z m -0.131164,0.13117 h -0.131163 v 0.13116 h 0.131163 z m -0.78698,0.39349 v 0.042 c 0.03966,-0.0149 0.07973,-0.0306 0.116561,-0.042 z"
               style="opacity:0.55;fill:#f5f5f5;fill-opacity:1;stroke-width:0.13116334"
               inkscape:connector-curvature="0" />
            <path
               id="path1846"
               d="m 66.780847,294.31159 v 0.11989 h -0.09402 v 0.13116 h 0.08403 c 0.0286,-0.078 0.05175,-0.16044 0.06481,-0.25105 z m -0.262327,0.26233 v 0.13116 h 0.131164 v -0.13116 z m 0,0.13116 h -0.131163 v 0.13116 h 0.131163 z m 0,0.13116 v 0.13117 h 0.10324 c 0.0085,-0.0311 0.0176,-0.0618 0.02792,-0.0915 v -0.0397 z m 0,0.13117 h -0.131163 v 0.13116 h 0.131163 z m 0,0.13116 v 0.13116 h 0.06661 c 6.55e-4,-0.0458 0.0038,-0.0897 0.0097,-0.13116 z m 0,0.13116 h -0.131163 v 0.13117 h 0.131163 z m -0.131163,0.13117 h -0.131163 v 0.13116 h 0.131163 z m -0.131163,0.13116 H 66.12503 v 0.13116 h 0.131164 z m -0.131164,0.13116 h -0.131163 v 0.13117 h 0.131163 z m -0.131163,0.13117 h -0.131163 v 0.13116 h 0.131163 z m -0.131163,0.13116 h -0.09146 c 0.02968,0.0103 0.06031,0.0194 0.09146,0.0279 z m 0,-0.13116 v -0.13117 H 65.73154 v 0.13117 z m -0.131164,0 h -0.131163 v 0.0656 c 0.04324,0.0178 0.08689,0.035 0.131163,0.0515 z m -0.131163,0 v -0.13117 h -0.131163 v 0.13117 z m -0.131163,0 h -0.03971 c 0.01328,0.005 0.02663,0.009 0.03971,0.0141 z m 0.131163,-0.13117 h 0.131163 v -0.13116 h -0.131163 z m 0.131163,-0.13116 h 0.131164 V 295.3609 H 65.73154 Z m 0.131164,-0.13116 h 0.131163 v -0.13117 h -0.131163 z m 0.131163,-0.13117 h 0.131163 v -0.13116 h -0.131163 z m 0.131163,-0.13116 h 0.131164 v -0.13116 H 66.12503 Z m 0.131164,-0.13116 h 0.131163 v -0.13117 h -0.131163 z m 0,0.13116 v 0.13116 h 0.131163 v -0.13116 z m 0,0.13116 H 66.12503 v 0.13117 h 0.131164 z m -0.131164,0.13117 h -0.131163 v 0.13116 h 0.131163 z m -0.131163,0.13116 h -0.131163 v 0.13116 h 0.131163 z m 0.692962,-0.79825 v 0.082 c 0.01097,-0.0274 0.02186,-0.0548 0.03305,-0.082 z"
               style="opacity:0.35;fill:#f5f5f5;fill-opacity:1;stroke-width:0.13116334"
               inkscape:connector-curvature="0" />
            <path
               id="path1848"
               d="m 66.51852,295.3609 v 0.13116 h 0.09402 c -0.0097,-0.046 -0.01629,-0.0894 -0.02075,-0.13116 z m 0,0.13116 h -0.131163 v 0.13116 h 0.131163 z m 0,0.13116 v 0.13117 h 0.131164 v -0.11657 c -0.0014,-0.005 -0.0037,-0.01 -0.0051,-0.0146 z m 0.131164,0.13117 v 0.0892 c 0.0223,-0.008 0.04233,-0.014 0.06558,-0.0236 -0.0096,-0.0233 -0.01517,-0.0433 -0.02357,-0.0656 z m -0.131164,0 h -0.131163 v 0.13116 h 0.131163 z m 0,0.13116 v 0.005 c 0.0046,-0.001 0.01,-0.004 0.0146,-0.005 z m -0.131163,0 h -0.131163 v 0.0579 c 0.04173,-0.004 0.08516,-0.011 0.131163,-0.0208 z m -0.131163,0 v -0.13116 H 66.12503 v 0.13116 z m -0.131164,0 h -0.131163 v 0.0548 c 0.04147,0.006 0.08534,0.009 0.131163,0.01 z m 0.131164,-0.13116 h 0.131163 v -0.13117 h -0.131163 z"
               style="opacity:0.2;fill:#f5f5f5;fill-opacity:1;stroke-width:0.13116334"
               inkscape:connector-curvature="0" />
            <path
               style="opacity:1;fill:#f5f5f5;fill-opacity:1;stroke-width:0.13116334;stroke-linecap:butt"
               d="m 65.152833,293.39831 c -0.184907,-0.0151 -0.406355,0.0135 -0.692194,0.13117 l -0.06071,0.0251 0.02485,0.0605 c 0.223675,0.54321 0.114768,0.78647 0,1.06519 -0.114768,0.27872 -0.235396,0.59291 0,1.16459 l 0.02511,0.0607 0.06046,-0.0249 c 0.543211,-0.22367 0.786468,-0.11477 1.06519,0 0.278722,0.11477 0.592909,0.2354 1.164587,0 l 0.06071,-0.0251 -0.02485,-0.0605 c -0.223675,-0.54321 -0.114768,-0.78647 0,-1.06519 0.114768,-0.27872 0.235396,-0.59291 0,-1.16459 l -0.02511,-0.0607 -0.06046,0.0248 c -0.543211,0.22367 -0.786468,0.11477 -1.06519,0 -0.139361,-0.0574 -0.287485,-0.11609 -0.472393,-0.13117 z m -0.01076,0.12553 c 0.163495,0.0136 0.294093,0.0697 0.433454,0.12707 0.266348,0.10967 0.571557,0.21591 1.096443,0.0205 0.190096,0.49948 0.09282,0.74112 -0.01742,1.00883 -0.109672,0.26635 -0.215912,0.57156 -0.02049,1.09644 -0.499481,0.1901 -0.741117,0.0928 -1.008831,-0.0174 -0.266347,-0.10967 -0.571557,-0.21591 -1.096443,-0.0205 -0.190096,-0.49948 -0.09282,-0.74112 0.01742,-1.00883 0.109673,-0.26635 0.215912,-0.57156 0.02049,-1.09644 0.239471,-0.0911 0.424797,-0.12219 0.575377,-0.10965 z"
               id="path1850"
               inkscape:connector-curvature="0" />
          </g>
          <g
             inkscape:label="00336"
             id="g1874"
             transform="matrix(0.13116334,0,0,0.13116334,-22.802116,175.30062)"
             style="fill:#f5f5f5;fill-opacity:1">
            <path
               style="opacity:0;fill:#f5f5f5;fill-opacity:1"
               d="m 284.54709,898.3493 h 24 v 24 h -24 z"
               id="path1854"
               inkscape:connector-curvature="0" />
            <path
               inkscape:connector-curvature="0"
               id="path1856"
               d="m 290.6066,900.4247 v 20.9959 h 11.9246 v -17.1209 c 0,-1.8792 -1.1179,-3.875 -3.6875,-3.875 z m 2,2 h 6.1216 c 1.3125,0 1.8125,0.8107 1.8125,1.9375 v 15.0312 h -7.9341 z"
               style="opacity:1;fill:#f5f5f5;fill-opacity:1" />
            <path
               style="opacity:1;fill:#f5f5f5;fill-opacity:1"
               d="m 292.65979,903.36218 h 3.25001 c 0.277,0 0.5,0.223 0.5,0.5 0,0.277 -0.223,0.5 -0.5,0.5 h -3.25001 c -0.277,0 -0.5,-0.223 -0.5,-0.5 0,-0.277 0.223,-0.5 0.5,-0.5 z"
               id="path1858"
               inkscape:connector-curvature="0" />
            <path
               style="opacity:1;fill:#f5f5f5;fill-opacity:1"
               d="m 292.65979,911.36218 h 3.25001 c 0.277,0 0.5,0.223 0.5,0.5 0,0.277 -0.223,0.5 -0.5,0.5 h -3.25001 c -0.277,0 -0.5,-0.223 -0.5,-0.5 0,-0.277 0.223,-0.5 0.5,-0.5 z"
               id="path1860"
               inkscape:connector-curvature="0" />
            <path
               style="opacity:1;fill:#f5f5f5;fill-opacity:1"
               d="m 292.72229,917.36218 h 1.18751 c 0.277,0 0.5,0.223 0.5,0.5 0,0.277 -0.223,0.5 -0.5,0.5 h -1.18751 c -0.277,0 -0.5,-0.223 -0.5,-0.5 0,-0.277 0.223,-0.5 0.5,-0.5 z"
               id="path1862"
               inkscape:connector-curvature="0" />
            <path
               style="opacity:1;fill:#f5f5f5;fill-opacity:1"
               d="m 292.72229,915.36218 h 1.18751 c 0.277,0 0.5,0.223 0.5,0.5 0,0.277 -0.223,0.5 -0.5,0.5 h -1.18751 c -0.277,0 -0.5,-0.223 -0.5,-0.5 0,-0.277 0.223,-0.5 0.5,-0.5 z"
               id="path1864"
               inkscape:connector-curvature="0" />
            <path
               style="opacity:1;fill:#f5f5f5;fill-opacity:1"
               d="m 292.72229,913.36218 h 1.18751 c 0.277,0 0.5,0.223 0.5,0.5 0,0.277 -0.223,0.5 -0.5,0.5 h -1.18751 c -0.277,0 -0.5,-0.223 -0.5,-0.5 0,-0.277 0.223,-0.5 0.5,-0.5 z"
               id="path1866"
               inkscape:connector-curvature="0" />
            <path
               style="opacity:1;fill:#f5f5f5;fill-opacity:1"
               d="m 292.72229,909.36218 h 1.18751 c 0.277,0 0.5,0.223 0.5,0.5 0,0.277 -0.223,0.5 -0.5,0.5 h -1.18751 c -0.277,0 -0.5,-0.223 -0.5,-0.5 0,-0.277 0.223,-0.5 0.5,-0.5 z"
               id="path1868"
               inkscape:connector-curvature="0" />
            <path
               style="opacity:1;fill:#f5f5f5;fill-opacity:1"
               d="m 292.72229,907.36218 h 1.18751 c 0.277,0 0.5,0.223 0.5,0.5 0,0.277 -0.223,0.5 -0.5,0.5 h -1.18751 c -0.277,0 -0.5,-0.223 -0.5,-0.5 0,-0.277 0.223,-0.5 0.5,-0.5 z"
               id="path1870"
               inkscape:connector-curvature="0" />
            <path
               style="opacity:1;fill:#f5f5f5;fill-opacity:1"
               d="m 292.72229,905.36218 h 1.18751 c 0.277,0 0.5,0.223 0.5,0.5 0,0.277 -0.223,0.5 -0.5,0.5 h -1.18751 c -0.277,0 -0.5,-0.223 -0.5,-0.5 0,-0.277 0.223,-0.5 0.5,-0.5 z"
               id="path1872"
               inkscape:connector-curvature="0" />
          </g>
          <g
             id="g1888"
             inkscape:label="00123"
             transform="matrix(0.13116334,0,0,0.13116334,-33.470037,220.28288)"
             style="fill:#f5f5f5;fill-opacity:1">
            <path
               style="opacity:0;fill:#f5f5f5;fill-opacity:1"
               d="m 285,555.40088 h 24 v 24 h -24 z"
               id="path1876"
               inkscape:connector-curvature="0" />
            <path
               style="opacity:1;fill:#f5f5f5;fill-opacity:1;stroke-linecap:butt"
               d="m 307.03125,557.40234 c -8.09103,-0.50569 -12.86216,1.44333 -15.9043,4.22657 -3.46182,3.16727 -4.6306,7.74437 -4.12695,15.80273 l 1,-0.0625 c -0.49635,-7.94164 0.60776,-12.07882 3.80273,-15.00195 2.83286,-2.59177 7.25705,-4.46111 15.16602,-3.9668 z"
               id="path1878"
               inkscape:connector-curvature="0" />
            <path
               style="opacity:1;fill:#f5f5f5;fill-opacity:1"
               d="m 289,559.36218 h 4 v 4 h -4 z"
               id="path1880"
               inkscape:connector-curvature="0" />
            <path
               style="opacity:1;fill:#f5f5f5;fill-opacity:1"
               d="m 286,575.36218 h 3 v 3 h -3 z"
               id="path1882"
               inkscape:connector-curvature="0" />
            <path
               inkscape:connector-curvature="0"
               id="path1884"
               d="m 294,564.3622 7.8,14.0387 5.2,-5.2646 z"
               style="opacity:1;fill:#f5f5f5;fill-opacity:1" />
            <path
               style="opacity:1;fill:#f5f5f5;fill-opacity:1"
               d="m 304.99987,556.36182 h 3 v 3 h -3 z"
               id="use1886"
               inkscape:connector-curvature="0" />
          </g>
          <g
             id="g1894"
             inkscape:label="00121"
             transform="matrix(0.13116334,0,0,0.13116334,-37.002118,223.96464)"
             style="fill:#f5f5f5;fill-opacity:1">
            <path
               style="opacity:0;fill:#f5f5f5;fill-opacity:1"
               d="m 284.96881,527.33087 h 24 v 24 h -24 z"
               id="path1890"
               inkscape:connector-curvature="0" />
            <path
               inkscape:connector-curvature="0"
               id="path1892"
               d="m 291,530.7715 v 15.118 h 1.2962 l 2.5925,-5.2529 5.1113,8.7256 h 4 l -6.5188,-9.9266 h 6.1177 V 537.818 L 291,529.3622 Z"
               style="opacity:1;fill:#f5f5f5;fill-opacity:1" />
          </g>
          <g
             inkscape:label="00153"
             id="g1940"
             transform="matrix(0.13116334,0,0,0.13116334,12.500186,159.0347)"
             style="fill:#f5f5f5;fill-opacity:1">
            <path
               id="path1896"
               d="m 285,1022.362 h 24 v 24 h -24 z"
               style="opacity:0;fill:#f5f5f5;fill-opacity:1"
               inkscape:connector-curvature="0" />
            <path
               inkscape:connector-curvature="0"
               style="opacity:1;fill:#f5f5f5;fill-opacity:1"
               d="m 303,1029.362 v -2 c -0.5069,-1.555 -3,-1 -3,0 v 2 z"
               id="path1898" />
            <path
               inkscape:connector-curvature="0"
               id="path1900"
               d="M 306.9558,1035.246 306,1034.362 h -9 l -0.9712,1.413 -0.029,6.587 c 2.8952,1.823 3.7348,4.575 11,2 z"
               style="opacity:1;fill:#f5f5f5;fill-opacity:1" />
            <path
               inkscape:connector-curvature="0"
               style="opacity:1;fill:#f5f5f5;fill-opacity:1"
               d="m 306,1033.362 -2,-3 h -5 l -2,3 z"
               id="path1902" />
            <g
               id="g1938"
               transform="translate(-0.0829471,-0.7236201)"
               style="fill:#f5f5f5;fill-opacity:1">
              <path
                 transform="matrix(0.4357219,0,0,0.4357219,206.8329,803.6419)"
                 style="opacity:1;fill:#f5f5f5;fill-opacity:1"
                 d="m 207.51497,518.42187 a 0.92537308,0.92537308 0 0 1 -0.92537,0.92538 0.92537308,0.92537308 0 0 1 -0.92537,-0.92538 0.92537308,0.92537308 0 0 1 0.92537,-0.92537 0.92537308,0.92537308 0 0 1 0.92537,0.92537 z"
                 id="path1904"
                 inkscape:connector-curvature="0" />
              <path
                 style="opacity:1;fill:#f5f5f5;fill-opacity:1;stroke-width:0.46127525"
                 d="m 296.50981,1030.6588 a 0.4268517,0.4268517 0 0 1 -0.42685,0.4269 0.4268517,0.4268517 0 0 1 -0.42685,-0.4269 0.4268517,0.4268517 0 0 1 0.42685,-0.4269 0.4268517,0.4268517 0 0 1 0.42685,0.4269 z"
                 id="use1906"
                 inkscape:connector-curvature="0" />
              <path
                 inkscape:connector-curvature="0"
                 id="use1908"
                 d="m 296.50981,1028.4506 a 0.4268517,0.4268517 0 0 1 -0.42685,0.4269 0.4268517,0.4268517 0 0 1 -0.42685,-0.4269 0.4268517,0.4268517 0 0 1 0.42685,-0.4269 0.4268517,0.4268517 0 0 1 0.42685,0.4269 z"
                 style="opacity:1;fill:#f5f5f5;fill-opacity:1;stroke-width:0.46127525" />
              <path
                 inkscape:connector-curvature="0"
                 id="use1910"
                 d="m 295.28336,1031.5221 a 0.58746276,0.58746276 0 0 1 -0.58746,0.5875 0.58746276,0.58746276 0 0 1 -0.58746,-0.5875 0.58746276,0.58746276 0 0 1 0.58746,-0.5876 0.58746276,0.58746276 0 0 1 0.58746,0.5876 z"
                 style="opacity:1;fill:#f5f5f5;fill-opacity:1;stroke-width:0.63483882" />
              <path
                 style="opacity:1;fill:#f5f5f5;fill-opacity:1;stroke-width:0.63483882"
                 d="m 294.95156,1027.5499 a 0.58746276,0.58746276 0 0 1 -0.58746,0.5875 0.58746276,0.58746276 0 0 1 -0.58746,-0.5875 0.58746276,0.58746276 0 0 1 0.58746,-0.5876 0.58746276,0.58746276 0 0 1 0.58746,0.5876 z"
                 id="use1912"
                 inkscape:connector-curvature="0" />
              <path
                 transform="matrix(0.6348389,0,0,0.6348389,162.5891,700.4153)"
                 style="opacity:1;fill:#f5f5f5;fill-opacity:1"
                 d="m 207.51497,518.42187 a 0.92537308,0.92537308 0 0 1 -0.92537,0.92538 0.92537308,0.92537308 0 0 1 -0.92537,-0.92538 0.92537308,0.92537308 0 0 1 0.92537,-0.92537 0.92537308,0.92537308 0 0 1 0.92537,0.92537 z"
                 id="path1914"
                 inkscape:connector-curvature="0" />
              <path
                 style="opacity:1;fill:#f5f5f5;fill-opacity:1;stroke-width:0.95303911"
                 d="m 293.62374,1032.5132 a 0.88191672,0.88191672 0 0 1 -0.88191,0.882 0.88191672,0.88191672 0 0 1 -0.88192,-0.882 0.88191672,0.88191672 0 0 1 0.88192,-0.8821 0.88191672,0.88191672 0 0 1 0.88191,0.8821 z"
                 id="use1916"
                 inkscape:connector-curvature="0" />
              <path
                 inkscape:connector-curvature="0"
                 id="use1918"
                 d="m 293.00083,1026.6236 a 0.88191672,0.88191672 0 0 1 -0.88191,0.882 0.88191672,0.88191672 0 0 1 -0.88191,-0.882 0.88191672,0.88191672 0 0 1 0.88191,-0.8821 0.88191672,0.88191672 0 0 1 0.88191,0.8821 z"
                 style="opacity:1;fill:#f5f5f5;fill-opacity:1;stroke-width:0.95303911" />
              <path
                 style="opacity:1;fill:#f5f5f5;fill-opacity:1;stroke-width:0.95303923"
                 d="m 292.31144,1029.5301 a 0.88191682,0.88191682 0 0 1 -0.88192,0.8819 0.88191682,0.88191682 0 0 1 -0.88191,-0.8819 0.88191682,0.88191682 0 0 1 0.88191,-0.8819 0.88191682,0.88191682 0 0 1 0.88192,0.8819 z"
                 id="use1920"
                 inkscape:connector-curvature="0" />
              <path
                 inkscape:connector-curvature="0"
                 id="use1922"
                 d="m 290.97885,1034.2025 a 1.3102134,1.3102134 0 0 1 -1.3102,1.3103 1.3102134,1.3102134 0 0 1 -1.31022,-1.3103 1.3102134,1.3102134 0 0 1 1.31022,-1.3105 1.3102134,1.3102134 0 0 1 1.3102,1.3105 z"
                 style="opacity:1;fill:#f5f5f5;fill-opacity:1;stroke-width:1.41587591" />
              <path
                 style="opacity:1;fill:#f5f5f5;fill-opacity:1;stroke-width:1.41587591"
                 d="m 290.25893,1025.5151 a 1.3102134,1.3102134 0 0 1 -1.3102,1.3103 1.3102134,1.3102134 0 0 1 -1.3102,-1.3103 1.3102134,1.3102134 0 0 1 1.3102,-1.3105 1.3102134,1.3102134 0 0 1 1.3102,1.3105 z"
                 id="use1924"
                 inkscape:connector-curvature="0" />
              <path
                 inkscape:connector-curvature="0"
                 id="use1926"
                 d="m 289.28264,1029.5306 a 1.3102136,1.3102136 0 0 1 -1.31021,1.3102 1.3102136,1.3102136 0 0 1 -1.31021,-1.3102 1.3102136,1.3102136 0 0 1 1.31021,-1.3102 1.3102136,1.3102136 0 0 1 1.31021,1.3102 z"
                 style="opacity:1;fill:#f5f5f5;fill-opacity:1;stroke-width:1.41587603" />
              <path
                 style="opacity:1;fill:#f5f5f5;fill-opacity:1;stroke-width:0.4357219"
                 d="m 293.0159,1028.2263 a 0.40320532,0.40320532 0 0 1 -0.4032,0.4032 0.40320532,0.40320532 0 0 1 -0.40321,-0.4032 0.40320532,0.40320532 0 0 1 0.40321,-0.4032 0.40320532,0.40320532 0 0 1 0.4032,0.4032 z"
                 id="use1928"
                 inkscape:connector-curvature="0" />
              <path
                 inkscape:connector-curvature="0"
                 id="use1930"
                 d="m 293.46392,1030.9144 a 0.40320532,0.40320532 0 0 1 -0.4032,0.4032 0.40320532,0.40320532 0 0 1 -0.40321,-0.4032 0.40320532,0.40320532 0 0 1 0.40321,-0.4032 0.40320532,0.40320532 0 0 1 0.4032,0.4032 z"
                 style="opacity:1;fill:#f5f5f5;fill-opacity:1;stroke-width:0.4357219" />
              <path
                 inkscape:connector-curvature="0"
                 id="use1932"
                 d="m 290.227,1027.5499 a 0.58746276,0.58746276 0 0 1 -0.58746,0.5875 0.58746276,0.58746276 0 0 1 -0.58746,-0.5875 0.58746276,0.58746276 0 0 1 0.58746,-0.5876 0.58746276,0.58746276 0 0 1 0.58746,0.5876 z"
                 style="opacity:1;fill:#f5f5f5;fill-opacity:1;stroke-width:0.63483882" />
              <path
                 style="opacity:1;fill:#f5f5f5;fill-opacity:1;stroke-width:0.63483882"
                 d="m 290.91939,1031.6635 a 0.58746276,0.58746276 0 0 1 -0.58746,0.5875 0.58746276,0.58746276 0 0 1 -0.58746,-0.5875 0.58746276,0.58746276 0 0 1 0.58746,-0.5876 0.58746276,0.58746276 0 0 1 0.58746,0.5876 z"
                 id="use1934"
                 inkscape:connector-curvature="0" />
              <path
                 inkscape:connector-curvature="0"
                 id="use1936"
                 d="m 295.77498,1029.6146 a 0.4268517,0.4268517 0 0 1 -0.42685,0.4269 0.4268517,0.4268517 0 0 1 -0.42685,-0.4269 0.4268517,0.4268517 0 0 1 0.42685,-0.4269 0.4268517,0.4268517 0 0 1 0.42685,0.4269 z"
                 style="opacity:1;fill:#f5f5f5;fill-opacity:1;stroke-width:0.46127525" />
            </g>
          </g>
          <g
             inkscape:label="00155"
             id="g1946"
             transform="matrix(0.13116334,0,0,0.13116334,-29.933865,154.96862)"
             style="fill:#f5f5f5;fill-opacity:1">
            <path
               style="opacity:0;fill:#f5f5f5;fill-opacity:1"
               d="m 285,1053.3621 h 24 v 24 h -24 z"
               id="path1942"
               inkscape:connector-curvature="0" />
            <path
               inkscape:connector-curvature="0"
               id="path1944"
               d="m 299.1929,1056.371 c -1.0952,-0.05 -2.1049,0.13 -2.7404,0.528 -5.4824,3.44 -2.3872,12.059 -10.4395,10.501 l -0.044,9.025 h 21.0312 l 0.044,-9.025 c -5.4826,1.244 -7.7633,-0.221 -8.8391,-2.661 -0.9536,-2.163 -0.193,-4.085 1.0834,-4.316 2.5235,-0.459 2.2613,1.245 3.7602,1.673 1.4248,0.407 1.8586,-0.955 0.8603,-3.083 -0.8381,-1.786 -2.8906,-2.557 -4.716,-2.642 z"
               style="opacity:1;fill:#f5f5f5;fill-opacity:1" />
          </g>
          <g
             id="g1952"
             inkscape:label="00125"
             transform="matrix(0.13116334,0,0,0.13116334,-26.397693,215.8284)"
             style="fill:#f5f5f5;fill-opacity:1">
            <path
               style="opacity:0;fill:#f5f5f5;fill-opacity:1"
               d="m 285,589.36218 h 24 v 24 h -24 z"
               id="path1948"
               inkscape:connector-curvature="0" />
            <path
               inkscape:connector-curvature="0"
               style="opacity:1;fill:#f5f5f5;fill-opacity:1"
               d="m 296.4611,591.3622 c -5.2682,0 -9.5389,4.1724 -9.5389,9.299 0,5.1268 4.2707,9.26 9.5389,9.26 1.8739,0 3.6132,-0.5373 5.0874,-1.4455 L 305,612.3622 c 0.6588,0.6397 1.6958,0.6101 2.345,-0.039 l 0.3179,-0.3126 c 0.6492,-0.6492 0.6588,-1.7046 0,-2.3442 l -3.372,-3.7695 c 1.0675,-1.499 1.7091,-3.2737 1.7091,-5.2357 0,-5.1267 -4.2707,-9.2989 -9.5389,-9.2989 z m 0,2.5006 c 3.8633,0 6.9952,3.0787 6.9952,6.8766 0,3.7978 -3.1319,6.8766 -6.9952,6.8766 -3.8633,0 -6.9952,-3.0788 -6.9952,-6.8766 0,-3.7979 3.1319,-6.8766 6.9952,-6.8766 z"
               id="path1950" />
          </g>
          <g
             id="g1958"
             inkscape:label="00127"
             transform="matrix(0.13116334,0,0,0.13116334,-19.32535,211.76234)"
             style="fill:#f5f5f5;fill-opacity:1">
            <path
               style="opacity:0;fill:#f5f5f5;fill-opacity:1"
               d="m 285,620.36218 h 24 v 24 h -24 z"
               id="path1954"
               inkscape:connector-curvature="0" />
            <path
               id="path1956"
               transform="translate(0,512.3622)"
               d="m 287,110 v 20 h 20 v -20 z m 2,2 h 16 v 16 h -16 z"
               style="opacity:1;fill:#f5f5f5;fill-opacity:1"
               inkscape:connector-curvature="0" />
          </g>
        </g>
      </g>
      <rect
         style="opacity:1;vector-effect:none;fill:#23847e;fill-opacity:1;stroke:none;stroke-width:0.16273303;stroke-linecap:butt;stroke-linejoin:round;stroke-miterlimit:4;stroke-dasharray:none;stroke-dashoffset:0;stroke-opacity:1;marker:none;paint-order:stroke markers fill"
         id="rect1964"
         width="74.990768"
         height="0.56801939"
         x="0.0046157837"
         y="291.86905" />
      <rect
         y="267.41388"
         x="0.0046157837"
         height="0.56801939"
         width="74.990768"
         id="rect1966"
         style="opacity:1;vector-effect:none;fill:#23847e;fill-opacity:1;stroke:none;stroke-width:0.16273303;stroke-linecap:butt;stroke-linejoin:round;stroke-miterlimit:4;stroke-dasharray:none;stroke-dashoffset:0;stroke-opacity:1;marker:none;paint-order:stroke markers fill" />
    </g>
    <use
       x="0"
       y="0"
       inkscape:tiled-clone-of="#g1968"
       xlink:href="#g1968"
       id="use3074"
       transform="translate(7.0679774e-5,160.00464)"
       width="100%"
       height="100%" />
    <use
       x="0"
       y="0"
       inkscape:tiled-clone-of="#g1968"
       xlink:href="#g1968"
       transform="translate(7.0679774e-5,120.00464)"
       id="use3076"
       width="100%"
       height="100%" />
    <use
       x="0"
       y="0"
       inkscape:tiled-clone-of="#g1968"
       xlink:href="#g1968"
       transform="translate(-3.2022582e-7,80)"
       id="use3078"
       width="100%"
       height="100%" />
    <use
       x="0"
       y="0"
       inkscape:tiled-clone-of="#g1968"
       xlink:href="#g1968"
       transform="translate(-3.2022582e-7,40)"
       id="use3080"
       width="100%"
       height="100%" />
    <use
       x="0"
       y="0"
       inkscape:tiled-clone-of="#g1968"
       xlink:href="#g1968"
       transform="translate(75.000075,0.00463863)"
       id="use3082"
       width="100%"
       height="100%" />
    <use
       x="0"
       y="0"
       inkscape:tiled-clone-of="#g1968"
       xlink:href="#g1968"
       transform="translate(75.000075,40.004639)"
       id="use3084"
       width="100%"
       height="100%" />
    <use
       x="0"
       y="0"
       inkscape:tiled-clone-of="#g1968"
       xlink:href="#g1968"
       transform="translate(75.000075,120.00464)"
       id="use3086"
       width="100%"
       height="100%" />
    <use
       x="0"
       y="0"
       inkscape:tiled-clone-of="#g1968"
       xlink:href="#g1968"
       transform="translate(75.000075,80.004639)"
       id="use3088"
       width="100%"
       height="100%" />
    <use
       x="0"
       y="0"
       xlink:href="#g1968"
       id="use3090"
       transform="translate(75.000075,160.00464)"
       width="100%"
       height="100%" />
    <use
       x="0"
       y="0"
       xlink:href="#g1968"
       id="use3092"
       transform="translate(7.0679774e-5,200.00464)"
       width="100%"
       height="100%" />
    <use
       x="0"
       y="0"
       xlink:href="#g1968"
       id="use3094"
       transform="translate(75.000075,200.00464)"
       width="100%"
       height="100%" />
    <use
       x="0"
       y="0"
       xlink:href="#g1968"
       id="use3096"
       transform="translate(7.0679774e-5,240.00464)"
       width="100%"
       height="100%" />
    <use
       x="0"
       y="0"
       xlink:href="#g1968"
       id="use3098"
       transform="translate(75.000075,240.00464)"
       width="100%"
       height="100%" />
    <g
       id="g1144">
      <g
         transform="translate(0.246394)"
         id="g1099">
        <g
           id="g1061">
          <path
             inkscape:connector-curvature="0"
             id="path230"
             d="m 24.244676,8.7476827 h 3.96875"
             style="fill:none;stroke:#000000;stroke-width:0.5;stroke-linecap:butt;stroke-linejoin:miter;stroke-opacity:1" />
          <path
             inkscape:connector-curvature="0"
             id="path1039"
             d="m 24.244676,48.676915 h 3.96875"
             style="fill:none;stroke:#000000;stroke-width:0.5;stroke-linecap:butt;stroke-linejoin:miter;stroke-opacity:1" />
          <path
             inkscape:connector-curvature="0"
             id="path1041"
             d="m 24.244676,88.606148 h 3.96875"
             style="fill:none;stroke:#000000;stroke-width:0.5;stroke-linecap:butt;stroke-linejoin:miter;stroke-opacity:1" />
          <path
             inkscape:connector-curvature="0"
             id="path1043"
             d="m 24.244676,128.53538 h 3.96875"
             style="fill:none;stroke:#000000;stroke-width:0.5;stroke-linecap:butt;stroke-linejoin:miter;stroke-opacity:1" />
          <path
             inkscape:connector-curvature="0"
             id="path1045"
             d="m 24.244676,168.46461 h 3.96875"
             style="fill:none;stroke:#000000;stroke-width:0.5;stroke-linecap:butt;stroke-linejoin:miter;stroke-opacity:1" />
          <path
             inkscape:connector-curvature="0"
             id="path1047"
             d="m 24.244676,208.39385 h 3.96875"
             style="fill:none;stroke:#000000;stroke-width:0.5;stroke-linecap:butt;stroke-linejoin:miter;stroke-opacity:1" />
          <path
             inkscape:connector-curvature="0"
             id="path1049"
             d="m 24.244676,288.25232 h 3.96875"
             style="fill:none;stroke:#000000;stroke-width:0.5;stroke-linecap:butt;stroke-linejoin:miter;stroke-opacity:1" />
          <path
             inkscape:connector-curvature="0"
             id="path1051"
             d="m 24.244676,248.32309 h 3.96875"
             style="fill:none;stroke:#000000;stroke-width:0.5;stroke-linecap:butt;stroke-linejoin:miter;stroke-opacity:1" />
        </g>
        <g
           id="g1079"
           transform="translate(157.04911)">
          <path
             style="fill:none;stroke:#000000;stroke-width:0.5;stroke-linecap:butt;stroke-linejoin:miter;stroke-opacity:1"
             d="m 24.244676,8.7476827 h 3.96875"
             id="path1063"
             inkscape:connector-curvature="0" />
          <path
             style="fill:none;stroke:#000000;stroke-width:0.5;stroke-linecap:butt;stroke-linejoin:miter;stroke-opacity:1"
             d="m 24.244676,48.676915 h 3.96875"
             id="path1065"
             inkscape:connector-curvature="0" />
          <path
             style="fill:none;stroke:#000000;stroke-width:0.5;stroke-linecap:butt;stroke-linejoin:miter;stroke-opacity:1"
             d="m 24.244676,88.606148 h 3.96875"
             id="path1067"
             inkscape:connector-curvature="0" />
          <path
             style="fill:none;stroke:#000000;stroke-width:0.5;stroke-linecap:butt;stroke-linejoin:miter;stroke-opacity:1"
             d="m 24.244676,128.53538 h 3.96875"
             id="path1069"
             inkscape:connector-curvature="0" />
          <path
             style="fill:none;stroke:#000000;stroke-width:0.5;stroke-linecap:butt;stroke-linejoin:miter;stroke-opacity:1"
             d="m 24.244676,168.46461 h 3.96875"
             id="path1071"
             inkscape:connector-curvature="0" />
          <path
             style="fill:none;stroke:#000000;stroke-width:0.5;stroke-linecap:butt;stroke-linejoin:miter;stroke-opacity:1"
             d="m 24.244676,208.39385 h 3.96875"
             id="path1073"
             inkscape:connector-curvature="0" />
          <path
             style="fill:none;stroke:#000000;stroke-width:0.5;stroke-linecap:butt;stroke-linejoin:miter;stroke-opacity:1"
             d="m 24.244676,288.25232 h 3.96875"
             id="path1075"
             inkscape:connector-curvature="0" />
          <path
             style="fill:none;stroke:#000000;stroke-width:0.5;stroke-linecap:butt;stroke-linejoin:miter;stroke-opacity:1"
             d="m 24.244676,248.32309 h 3.96875"
             id="path1077"
             inkscape:connector-curvature="0" />
        </g>
      </g>
      <g
         transform="translate(0,0.2443068)"
         id="g1120">
        <path
           style="display:inline;fill:none;stroke:#000000;stroke-width:0.5;stroke-linecap:butt;stroke-linejoin:miter;stroke-opacity:1;enable-background:new"
           d="m 105,2.9710964 v 3.96875"
           id="path1039-3"
           inkscape:connector-curvature="0" />
        <path
           inkscape:connector-curvature="0"
           id="path1116"
           d="m 105,289.57154 v 3.96875"
           style="display:inline;fill:none;stroke:#000000;stroke-width:0.5;stroke-linecap:butt;stroke-linejoin:miter;stroke-opacity:1;enable-background:new" />
      </g>
    </g>
  </g>
  <g
     inkscape:groupmode="layer"
     id="layer2"
     inkscape:label="Cover"
     sodipodi:insensitive="true"
     style="display:none"
     transform="translate(0,257)">
    <path
       style="opacity:1;vector-effect:none;fill:#b3b3b3;fill-opacity:1;stroke:none;stroke-width:3.03846979;stroke-linecap:round;stroke-linejoin:bevel;stroke-miterlimit:4;stroke-dasharray:6.07693958, 18.23081885;stroke-dashoffset:0;stroke-opacity:1;marker:none;paint-order:markers fill stroke"
       d="m -124.54297,-270.69727 v 692.5918 h 532.56836 v -692.5918 z M 0.01757813,0.01757813 H 283.46484 V 151.18164 H 0.01757813 Z"
       id="rect14992"
       transform="scale(0.26458333)"
       inkscape:connector-curvature="0" />
  </g>
  <style
     id="style26"
     type="text/css">
	.specularity {opacity:0.5;}
	.low-specularity {opacity:0.25;}
	.full-specularity {opacity:1;}
	.black {fill:#000000;}
	.white {fill:#ffffff;}
	.outline-big {stroke-width:16;stroke:none;opacity:0.1;fill:none;}
	.outline-small {stroke-width:8;stroke:none;opacity:0.2;fill:none;}
	.stroke-highlight {fill:none;stroke:none;opacity:0.2;}
       	.base-shadow 	{fill:black;opacity:75;}
	</style>
</svg>
