<?xml version="1.0" encoding="UTF-8" standalone="no"?>
<!-- Created with Inkscape (http://www.inkscape.org/) -->

<svg
   xmlns:dc="http://purl.org/dc/elements/1.1/"
   xmlns:cc="http://creativecommons.org/ns#"
   xmlns:rdf="http://www.w3.org/1999/02/22-rdf-syntax-ns#"
   xmlns:svg="http://www.w3.org/2000/svg"
   xmlns="http://www.w3.org/2000/svg"
   xmlns:sodipodi="http://sodipodi.sourceforge.net/DTD/sodipodi-0.dtd"
   xmlns:inkscape="http://www.inkscape.org/namespaces/inkscape"
   width="750"
   height="625"
   id="svg2"
   version="1.1"
   inkscape:version="0.48.4 r9939"
   sodipodi:docname="Splash.svg"
   inkscape:export-filename="C:\Users\kally\Pictures\Splash.png"
   inkscape:export-xdpi="90"
   inkscape:export-ydpi="90">
  <sodipodi:namedview
     id="base"
     pagecolor="#ffffff"
     bordercolor="#666666"
     borderopacity="1.0"
     inkscape:pageopacity="0.0"
     inkscape:pageshadow="2"
     inkscape:zoom="2.8284271"
     inkscape:cx="360.67319"
     inkscape:cy="167.04489"
     inkscape:document-units="px"
     inkscape:current-layer="layer1"
     showgrid="false"
     showguides="false"
     inkscape:guide-bbox="true"
     inkscape:window-width="1440"
     inkscape:window-height="847"
     inkscape:window-x="-8"
     inkscape:window-y="-8"
     inkscape:window-maximized="1">
    <sodipodi:guide
       id="guide4010"
       orientation="625.0,0"
       position="0.0,0" />
    <sodipodi:guide
       id="guide4012"
       orientation="625.0,0"
       position="75.0,0" />
    <sodipodi:guide
       id="guide4014"
       orientation="625.0,0"
       position="150.0,0" />
    <sodipodi:guide
       id="guide4016"
       orientation="625.0,0"
       position="225.0,0" />
    <sodipodi:guide
       id="guide4018"
       orientation="625.0,0"
       position="300.0,0" />
    <sodipodi:guide
       id="guide4020"
       orientation="625.0,0"
       position="375.0,0" />
    <sodipodi:guide
       id="guide4022"
       orientation="625.0,0"
       position="450.0,0" />
    <sodipodi:guide
       id="guide4024"
       orientation="625.0,0"
       position="525.0,0" />
    <sodipodi:guide
       id="guide4026"
       orientation="625.0,0"
       position="600.0,0" />
    <sodipodi:guide
       id="guide4028"
       orientation="625.0,0"
       position="675.0,0" />
    <sodipodi:guide
       id="guide4030"
       orientation="625.0,0"
       position="750.0,0" />
    <sodipodi:guide
       id="guide4032"
       orientation="0,750.0"
       position="0,0.0" />
    <sodipodi:guide
       id="guide4034"
       orientation="0,750.0"
       position="0,62.5" />
    <sodipodi:guide
       id="guide4036"
       orientation="0,750.0"
       position="0,125.0" />
    <sodipodi:guide
       id="guide4038"
       orientation="0,750.0"
       position="0,187.5" />
    <sodipodi:guide
       id="guide4040"
       orientation="0,750.0"
       position="0,250.0" />
    <sodipodi:guide
       id="guide4042"
       orientation="0,750.0"
       position="0,312.5" />
    <sodipodi:guide
       id="guide4044"
       orientation="0,750.0"
       position="0,375.0" />
    <sodipodi:guide
       id="guide4046"
       orientation="0,750.0"
       position="0,437.5" />
    <sodipodi:guide
       id="guide4048"
       orientation="0,750.0"
       position="0,500.0" />
    <sodipodi:guide
       id="guide4050"
       orientation="0,750.0"
       position="0,562.5" />
    <sodipodi:guide
       id="guide4052"
       orientation="0,750.0"
       position="0,625.0" />
  </sodipodi:namedview>
  <defs
     id="defs4" />
  <metadata
     id="metadata7">
    <rdf:RDF>
      <cc:Work
         rdf:about="">
        <dc:format>image/svg+xml</dc:format>
        <dc:type
           rdf:resource="http://purl.org/dc/dcmitype/StillImage" />
        <dc:title />
      </cc:Work>
    </rdf:RDF>
  </metadata>
  <g
     transform="translate(0,-427.36218)"
     id="layer1"
     inkscape:groupmode="layer"
     inkscape:label="Layer 1">
    <path
       sodipodi:nodetypes="sssss"
       inkscape:connector-curvature="0"
       id="path4141"
       d="m 605.25248,739.86701 c 0,139.32596 -90.92355,252.27198 -230.24951,252.27198 -139.32598,0 -252.27198,-112.94601 -252.27198,-252.27198 0,-139.32596 111.5696,-235.75513 250.89556,-235.75513 139.32598,0 231.62593,96.42917 231.62593,235.75513 z"
       style="fill:#ffffff;fill-opacity:1;stroke:none" />
    <path
       style="fill:#ff6a0e;fill-opacity:1;stroke:none"
       d="M 373.625 76.75 C 363.14994 76.75 352.8444 77.307597 342.71875 78.375 L 342.71875 96.59375 L 398.8125 96.59375 L 398.8125 77.84375 C 390.6017 77.125217 382.20287 76.75 373.625 76.75 z M 400.25 77.96875 L 400.25 96.59375 L 456.34375 96.59375 L 456.34375 89.5625 C 438.85899 83.751088 420.11534 79.81191 400.25 77.96875 z M 341.28125 78.53125 C 321.77469 80.686735 302.99132 84.781341 285.1875 90.65625 L 285.1875 96.59375 L 341.28125 96.59375 L 341.28125 78.53125 z M 457.78125 90 L 457.78125 96.59375 L 474.84375 96.59375 C 469.29631 94.193118 463.61978 91.982516 457.78125 90 z M 283.75 91.125 C 278.74917 92.806979 273.83855 94.633905 269 96.59375 L 283.75 96.59375 L 283.75 91.125 z M 265.53125 98.03125 C 252.22137 103.64992 239.56112 110.30019 227.6875 117.9375 L 227.6875 154.125 L 283.75 154.125 L 283.75 98.03125 L 265.53125 98.03125 z M 285.1875 98.03125 L 285.1875 154.125 L 341.28125 154.125 L 341.28125 98.03125 L 285.1875 98.03125 z M 342.71875 98.03125 L 342.71875 154.125 L 398.8125 154.125 L 398.8125 98.03125 L 342.71875 98.03125 z M 400.25 98.03125 L 400.25 154.125 L 456.34375 154.125 L 456.34375 98.03125 L 400.25 98.03125 z M 457.78125 98.03125 L 457.78125 154.125 L 513.875 154.125 L 513.875 118.5625 C 502.80179 110.67072 490.85415 103.79845 478.09375 98.03125 L 457.78125 98.03125 z M 226.25 118.875 C 210.73061 129.01387 196.56517 140.82333 184.03125 154.125 L 226.25 154.125 L 226.25 118.875 z M 515.3125 119.59375 L 515.3125 154.125 L 552.3125 154.125 C 541.45743 141.12672 529.0689 129.57621 515.3125 119.59375 z M 182.6875 155.5625 C 178.29962 160.301 174.12193 165.24179 170.15625 170.34375 L 170.15625 211.65625 L 226.25 211.65625 L 226.25 155.5625 L 182.6875 155.5625 z M 227.6875 155.5625 L 227.6875 211.65625 L 283.75 211.65625 L 283.75 155.5625 L 227.6875 155.5625 z M 285.1875 155.5625 L 285.1875 211.65625 L 341.28125 211.65625 L 341.28125 155.5625 L 285.1875 155.5625 z M 342.71875 155.5625 L 342.71875 211.65625 L 398.8125 211.65625 L 398.8125 155.5625 L 342.71875 155.5625 z M 400.25 155.5625 L 400.25 211.65625 L 456.34375 211.65625 L 456.34375 155.5625 L 400.25 155.5625 z M 457.78125 155.5625 L 457.78125 211.65625 L 513.875 211.65625 L 513.875 155.5625 L 457.78125 155.5625 z M 515.3125 155.5625 L 515.3125 211.65625 L 571.375 211.65625 L 571.375 181.0625 C 565.99319 172.06408 560.01474 163.54466 553.46875 155.5625 L 515.3125 155.5625 z M 168.71875 172.1875 C 159.44221 184.38408 151.40527 197.57567 144.75 211.65625 L 168.71875 211.65625 L 168.71875 172.1875 z M 572.8125 183.5 L 572.8125 211.65625 L 586.59375 211.65625 C 582.59983 201.81978 577.99763 192.43238 572.8125 183.5 z M 144.09375 213.09375 C 136.01277 230.51074 130.03551 249.27566 126.5 269.1875 L 168.71875 269.1875 L 168.71875 213.09375 L 144.09375 213.09375 z M 170.15625 213.09375 L 170.15625 269.1875 L 226.25 269.1875 L 226.25 213.09375 L 170.15625 213.09375 z M 227.6875 213.09375 L 227.6875 269.1875 L 283.75 269.1875 L 283.75 213.09375 L 227.6875 213.09375 z M 285.1875 213.09375 L 285.1875 269.1875 L 341.28125 269.1875 L 341.28125 213.09375 L 285.1875 213.09375 z M 342.71875 213.09375 L 342.71875 269.1875 L 398.8125 269.1875 L 398.8125 213.09375 L 342.71875 213.09375 z M 400.25 213.09375 L 400.25 269.1875 L 456.34375 269.1875 L 456.34375 213.09375 L 400.25 213.09375 z M 457.78125 213.09375 L 457.78125 269.1875 L 513.875 269.1875 L 513.875 213.09375 L 457.78125 213.09375 z M 515.3125 213.09375 L 515.3125 269.1875 L 571.375 269.1875 L 571.375 213.09375 L 515.3125 213.09375 z M 572.8125 213.09375 L 572.8125 269.1875 L 602.09375 269.1875 C 599.12633 249.27686 594.09327 230.50984 587.15625 213.09375 L 572.8125 213.09375 z M 126.25 270.625 C 123.9445 284.08914 122.71875 298.05383 122.71875 312.5 C 122.71875 317.2572 122.86509 321.99526 123.125 326.6875 L 168.71875 326.6875 L 168.71875 270.625 L 126.25 270.625 z M 170.15625 270.625 L 170.15625 326.6875 L 226.25 326.6875 L 226.25 270.625 L 170.15625 270.625 z M 227.6875 270.625 L 227.6875 326.6875 L 283.75 326.6875 L 283.75 270.625 L 227.6875 270.625 z M 285.1875 270.625 L 285.1875 326.6875 L 341.28125 326.6875 L 341.28125 270.625 L 285.1875 270.625 z M 342.71875 270.625 L 342.71875 326.6875 L 398.8125 326.6875 L 398.8125 270.625 L 342.71875 270.625 z M 400.25 270.625 L 400.25 326.6875 L 456.34375 326.6875 L 456.34375 270.625 L 400.25 270.625 z M 457.78125 270.625 L 457.78125 326.6875 L 513.875 326.6875 L 513.875 270.625 L 457.78125 270.625 z M 515.3125 270.625 L 515.3125 326.6875 L 571.375 326.6875 L 571.375 270.625 L 515.3125 270.625 z M 572.8125 270.625 L 572.8125 326.6875 L 604.9375 326.6875 C 605.14783 321.99501 605.25 317.25745 605.25 312.5 C 605.25 298.05412 604.24656 284.0889 602.3125 270.625 L 572.8125 270.625 z M 123.21875 328.125 C 124.40216 347.49719 127.78146 366.27167 133.09375 384.21875 L 168.71875 384.21875 L 168.71875 328.125 L 123.21875 328.125 z M 170.15625 328.125 L 170.15625 384.21875 L 226.25 384.21875 L 226.25 328.125 L 170.15625 328.125 z M 227.6875 328.125 L 227.6875 384.21875 L 283.75 384.21875 L 283.75 328.125 L 227.6875 328.125 z M 285.1875 328.125 L 285.1875 384.21875 L 341.28125 384.21875 L 341.28125 328.125 L 285.1875 328.125 z M 342.71875 328.125 L 342.71875 384.21875 L 398.8125 384.21875 L 398.8125 328.125 L 342.71875 328.125 z M 400.25 328.125 L 400.25 384.21875 L 456.34375 384.21875 L 456.34375 328.125 L 400.25 328.125 z M 457.78125 328.125 L 457.78125 384.21875 L 513.875 384.21875 L 513.875 328.125 L 457.78125 328.125 z M 515.3125 328.125 L 515.3125 384.21875 L 571.375 384.21875 L 571.375 328.125 L 515.3125 328.125 z M 572.8125 328.125 L 572.8125 384.21875 L 596.75 384.21875 C 601.14902 366.27214 603.88558 347.49664 604.84375 328.125 L 572.8125 328.125 z M 133.5 385.65625 C 139.50443 405.50613 147.91079 424.29954 158.34375 441.75 L 168.71875 441.75 L 168.71875 385.65625 L 133.5 385.65625 z M 170.15625 385.65625 L 170.15625 441.75 L 226.25 441.75 L 226.25 385.65625 L 170.15625 385.65625 z M 227.6875 385.65625 L 227.6875 441.75 L 283.75 441.75 L 283.75 385.65625 L 227.6875 385.65625 z M 285.1875 385.65625 L 285.1875 441.75 L 341.28125 441.75 L 341.28125 385.65625 L 285.1875 385.65625 z M 342.71875 385.65625 L 342.71875 441.75 L 398.8125 441.75 L 398.8125 385.65625 L 342.71875 385.65625 z M 400.25 385.65625 L 400.25 441.75 L 456.34375 441.75 L 456.34375 385.65625 L 400.25 385.65625 z M 457.78125 385.65625 L 457.78125 441.75 L 513.875 441.75 L 513.875 385.65625 L 457.78125 385.65625 z M 515.3125 385.65625 L 515.3125 441.75 L 571.375 441.75 L 571.375 385.65625 L 515.3125 385.65625 z M 572.8125 385.65625 L 572.8125 441.75 L 575.53125 441.75 C 584.41723 424.30183 591.43144 405.5031 596.40625 385.65625 L 572.8125 385.65625 z M 159.1875 443.1875 C 162.19753 448.14751 165.38412 452.99052 168.71875 457.71875 L 168.71875 443.1875 L 159.1875 443.1875 z M 170.15625 443.1875 L 170.15625 459.75 C 180.5094 474.12724 192.3227 487.39392 205.40625 499.28125 L 226.25 499.28125 L 226.25 443.1875 L 170.15625 443.1875 z M 227.6875 443.1875 L 227.6875 499.28125 L 283.75 499.28125 L 283.75 443.1875 L 227.6875 443.1875 z M 285.1875 443.1875 L 285.1875 499.28125 L 341.28125 499.28125 L 341.28125 443.1875 L 285.1875 443.1875 z M 342.71875 443.1875 L 342.71875 499.28125 L 398.8125 499.28125 L 398.8125 443.1875 L 342.71875 443.1875 z M 400.25 443.1875 L 400.25 499.28125 L 456.34375 499.28125 L 456.34375 443.1875 L 400.25 443.1875 z M 457.78125 443.1875 L 457.78125 499.28125 L 513.875 499.28125 L 513.875 443.1875 L 457.78125 443.1875 z M 515.3125 443.1875 L 515.3125 499.28125 L 534.625 499.28125 C 548.89498 484.63587 561.19501 467.90917 571.375 449.5625 L 571.375 443.1875 L 515.3125 443.1875 z M 572.8125 443.1875 L 572.8125 446.9375 C 573.48466 445.69089 574.15999 444.44872 574.8125 443.1875 L 572.8125 443.1875 z M 207.03125 500.71875 C 213.17296 506.20365 219.59047 511.37981 226.25 516.25 L 226.25 500.71875 L 207.03125 500.71875 z M 227.6875 500.71875 L 227.6875 517.28125 C 244.88159 529.67185 263.68947 539.96309 283.75 547.75 L 283.75 500.71875 L 227.6875 500.71875 z M 285.1875 500.71875 L 285.1875 548.3125 C 293.84974 551.61354 302.75432 554.46891 311.84375 556.8125 L 341.28125 556.8125 L 341.28125 500.71875 L 285.1875 500.71875 z M 342.71875 500.71875 L 342.71875 556.8125 L 398.8125 556.8125 L 398.8125 500.71875 L 342.71875 500.71875 z M 400.25 500.71875 L 400.25 556.8125 L 436.71875 556.8125 C 443.42875 555.00051 449.96769 552.85711 456.34375 550.46875 L 456.34375 500.71875 L 400.25 500.71875 z M 457.78125 500.71875 L 457.78125 549.9375 C 478.33959 542.06899 497.13293 531.2647 513.875 518 L 513.875 500.71875 L 457.78125 500.71875 z M 515.3125 500.71875 L 515.3125 516.84375 C 521.56395 511.80269 527.52299 506.42643 533.1875 500.71875 L 515.3125 500.71875 z M 317.78125 558.25 C 325.48349 560.03636 333.32649 561.46835 341.28125 562.53125 L 341.28125 558.25 L 317.78125 558.25 z M 342.71875 558.25 L 342.71875 562.71875 C 353.29103 564.06945 364.06056 564.78125 375 564.78125 C 383.10137 564.78125 391.04679 564.37174 398.8125 563.625 L 398.8125 558.25 L 342.71875 558.25 z M 400.25 558.25 L 400.25 563.5 C 410.84847 562.41677 421.10042 560.65232 431.03125 558.25 L 400.25 558.25 z "
       transform="translate(0,427.36218)"
       id="path4121" />
    <path
       id="path4117"
       transform="translate(0,427.36218)"
       d="M 375 60.21875 C 235.67405 60.21875 122.71875 173.17402 122.71875 312.5 C 122.71875 451.82596 235.67405 564.78125 375 564.78125 C 514.32596 564.78125 627.28125 451.82596 627.28125 312.5 C 627.28125 173.17402 514.32596 60.21875 375 60.21875 z M 354.375 107.03125 C 477.73745 107.03125 577.71875 207.04379 577.71875 330.40625 C 577.71875 453.76872 477.73745 553.75 354.375 553.75 C 323.94207 553.75 294.90863 547.67758 268.46875 536.65625 C 271.74326 536.15957 274.81833 535.39857 278.4375 534.25 C 282.7841 532.87074 289.53304 530.10442 294.125 527.8125 C 300.46746 524.64684 303.44233 522.71566 307.21875 519.34375 C 308.41178 518.27852 308.50626 518.11464 308.15625 517.6875 C 307.44191 516.81603 303.69653 514.17402 300.03125 511.96875 C 294.7168 508.7714 293.0625 507.02727 293.0625 504.625 C 293.0625 502.26013 295.56535 498.8819 300.3125 494.8125 C 305.02063 490.77641 308.34703 488.54712 313.25 486.125 C 318.55985 483.50202 322.41794 482.14209 334.6875 478.625 C 348.10233 474.77981 348.93258 474.45586 352 471.6875 C 356.30281 467.80398 359.875 461.66401 359.875 458.1875 C 359.875 456.81295 358.28992 454.68959 355.4375 452.3125 C 352.42111 449.79875 349.51419 447.90725 342.15625 443.5625 C 338.73685 441.54338 335.00973 439.18319 333.84375 438.34375 C 331.38756 436.57525 329.03982 434.14742 328.4375 432.75 C 327.5265 430.63608 328.13277 427.66025 329.8125 426 C 332.57247 423.27206 342.20984 419.3345 366.71875 410.96875 C 367.13875 409.51687 367.75681 408.12121 368.53125 406.8125 C 369.80258 404.66289 371.44184 403.25367 373.4375 402.53125 C 374.04968 402.30966 374.61588 402.27663 375.15625 402.46875 C 375.70443 402.64421 376.07273 402.97902 376.25 403.46875 C 376.39183 403.86054 376.35029 404.22562 376.15625 404.53125 C 375.97892 404.84471 375.64598 405.07273 375.15625 405.25 C 375.04606 405.2899 374.7317 405.38965 374.1875 405.53125 L 373.0625 405.84375 C 371.74023 406.32241 370.70619 407.27476 369.96875 408.71875 C 369.74964 409.15083 369.57365 409.60239 369.40625 410.0625 C 369.69606 409.96411 369.925 409.88082 370.21875 409.78125 C 395.7037 401.1427 406.11382 397.04593 414.09375 392.59375 C 424.41275 386.83684 432.31794 379.7282 434.59375 374.09375 C 436.98828 368.16555 435.24816 358.52334 430.8125 353.03125 C 424.41009 345.10417 393.33537 312.82504 328.1875 246.4375 C 294.51775 212.12705 286.27502 204.03584 280.71875 199.875 C 278.56164 198.25963 272.72903 195.24238 269.96875 194.3125 C 268.02184 193.65664 263.18424 193.35161 258.28125 193.40625 C 254.46782 193.44875 250.60335 193.69908 248.03125 194.1875 C 243.24637 195.09608 239.37021 196.807 235.40625 199.71875 C 232.45002 201.89027 217.4055 216.8947 186.21875 248.8125 C 166.43342 269.06162 147.89563 288.18614 132.5 304.1875 C 145.47579 193.17445 239.87911 107.03125 354.375 107.03125 z M 164.03125 311.65625 C 165.58972 311.65629 166.37499 312.46197 166.375 314.09375 L 166.375 349.8125 L 166.34375 349.8125 C 166.16039 351.22429 165.38803 351.9375 164.03125 351.9375 C 162.47277 351.9375 161.6875 351.13181 161.6875 349.5 L 161.6875 314.09375 C 161.6875 312.46197 162.47277 311.65629 164.03125 311.65625 z M 203.34375 312.0625 C 204.81054 312.06254 205.57541 312.80907 205.59375 314.3125 L 205.59375 337.1875 C 206.34548 336.67414 207.20282 336.04592 208.15625 335.3125 C 209.64137 334.17575 211.09569 332.88598 212.5625 331.4375 C 213.99261 330.02573 215.7073 327.56451 217.6875 324.0625 C 217.98084 323.40247 218.47242 323.06253 219.1875 323.0625 C 220.30591 323.06253 220.87498 323.64451 220.875 324.78125 L 220.75 325.46875 C 219.1915 328.65906 216.73028 331.59894 213.375 334.3125 C 215.0618 336.01767 216.54195 337.71944 217.84375 339.40625 C 218.83382 340.68971 219.72991 341.95365 220.5 343.21875 C 222.09512 345.89566 222.87498 347.8728 222.875 349.15625 L 222.875 349.28125 C 222.87498 350.78472 222.14136 351.53125 220.65625 351.53125 C 219.48279 351.53125 218.775 350.9676 218.5 349.8125 C 217.74825 346.78723 216.46598 344.15604 214.6875 341.9375 C 213.51405 340.50738 212.08014 338.91642 210.375 337.15625 C 209.42157 337.85299 208.54381 338.46288 207.71875 339.03125 C 206.71032 339.74633 205.99711 340.24332 205.59375 340.5 L 205.59375 349.28125 C 205.59374 350.78472 204.82888 351.53125 203.34375 351.53125 C 201.85861 351.53125 201.125 350.78472 201.125 349.28125 L 201.125 314.3125 C 201.125 312.80907 201.85861 312.06254 203.34375 312.0625 z M 236.15625 323.0625 C 239.19984 323.06253 241.41902 323.50037 242.8125 324.34375 C 243.54588 324.78382 244.02247 325.07959 244.1875 325.28125 C 244.73753 325.70298 244.99998 326.27205 245 326.96875 C 244.99998 328.36223 244.27386 329.06252 242.84375 329.0625 C 242.23868 329.06252 241.73419 328.85923 241.3125 328.4375 C 240.46907 327.68579 239.53966 327.07048 238.53125 326.59375 C 237.50448 326.1354 236.44384 325.90628 235.34375 325.90625 C 234.04196 325.90628 232.90925 326.30537 231.9375 327.09375 C 230.96574 327.88218 230.46874 328.79326 230.46875 329.875 C 230.46874 330.86511 230.68495 331.62456 231.125 332.15625 C 231.74838 332.94467 232.88651 333.55248 234.5 333.9375 C 235.16005 334.0842 235.69037 334.18959 236.09375 334.28125 C 236.7538 334.42795 237.15289 334.55168 237.28125 334.625 C 240.08649 335.1384 242.20777 336.0549 243.65625 337.375 C 245.10469 338.71347 245.81248 340.48189 245.8125 342.71875 C 245.81248 345.30399 244.84974 347.47693 242.90625 349.21875 C 240.96272 350.94224 238.51442 351.8125 235.5625 351.8125 C 232.90392 351.8125 230.50727 351.04014 228.34375 349.5 C 226.3269 348.10654 225.3125 346.68555 225.3125 345.21875 C 225.3125 344.79705 225.46955 344.4442 225.78125 344.1875 C 226.09294 343.89415 226.48662 343.75001 227 343.75 C 227.44004 343.75001 227.9112 343.92747 228.40625 344.3125 C 228.91962 344.67921 229.607 345.36658 230.46875 346.375 C 231.03713 347.07173 231.79657 347.61497 232.75 348 C 233.68507 348.42171 234.68656 348.65625 235.75 348.65625 C 237.45514 348.65625 238.91488 348.17967 240.125 347.28125 C 241.33509 346.38284 241.93748 345.30929 241.9375 344.0625 C 241.93748 343.18243 241.72127 342.46173 241.28125 341.875 C 240.47449 340.82992 238.9556 340.03173 236.71875 339.5 C 236.59039 339.46334 236.31503 339.4171 235.875 339.34375 C 235.45328 339.27042 234.68842 339.10045 233.625 338.84375 C 231.36979 338.33038 229.60886 337.43971 228.34375 336.15625 C 227.0603 334.87282 226.4375 333.31518 226.4375 331.5 C 226.4375 328.98813 227.354 326.97766 229.1875 325.4375 C 230.98432 323.86072 233.29598 323.06253 236.15625 323.0625 z M 263.4375 323.0625 C 265.87604 323.06253 268.01565 323.59285 269.8125 324.65625 C 271.59097 325.71971 272.46873 326.98906 272.46875 328.4375 C 272.46873 329.07925 272.22669 329.6354 271.75 330.09375 C 271.27327 330.55215 270.72254 330.78127 270.0625 330.78125 C 269.1824 330.78127 268.40462 330.39509 267.78125 329.625 C 266.99283 328.50659 266.47542 327.81921 266.21875 327.5625 C 265.39366 326.66411 264.34593 326.18753 263.0625 326.1875 C 260.91729 326.18753 259.19511 326.85449 257.875 328.15625 C 256.75656 329.27471 255.91962 330.81943 255.40625 332.78125 C 255.00287 334.37641 254.81249 336.16317 254.8125 338.125 C 254.81249 341.07694 255.61068 343.49942 257.1875 345.40625 C 258.78263 347.29476 260.83184 348.21875 263.34375 348.21875 C 264.4255 348.21875 265.57112 348.00254 266.78125 347.5625 C 267.973 347.12246 268.85076 346.60506 269.4375 346 C 269.80418 345.61497 270.2291 345.20838 270.6875 344.75 C 271.40254 344.08995 271.91995 343.75001 272.25 343.75 L 272.90625 343.84375 C 273.25459 344.02711 273.43747 344.38746 273.4375 344.9375 C 273.43747 346.16595 272.4489 347.55361 270.46875 349.09375 C 268.14019 350.90891 265.47567 351.8125 262.46875 351.8125 C 258.78341 351.8125 255.7198 350.51731 253.28125 347.96875 C 250.84269 345.42019 249.625 342.23078 249.625 338.34375 C 249.625 334.03504 250.92226 330.40237 253.5625 327.46875 C 256.22107 324.53518 259.5138 323.06253 263.4375 323.0625 z M 351.96875 323.0625 C 354.81065 323.06253 357.12773 323.72407 358.90625 325.0625 C 360.68472 326.40098 361.59372 328.16191 361.59375 330.34375 C 361.59372 331.90224 361.28711 333.13285 360.71875 334.03125 C 359.82031 335.44306 358.05938 336.66076 355.4375 337.6875 C 352.15552 339.00763 347.52678 340.06827 341.53125 340.875 C 341.53124 343.13021 342.48107 344.95572 344.40625 346.3125 C 346.14806 347.54095 348.26185 348.15625 350.71875 348.15625 C 352.11219 348.15625 353.75481 347.74424 355.625 346.9375 C 357.23846 346.05743 358.94773 345.08927 360.78125 344.0625 L 361.15625 344 C 361.39458 344.00001 361.55163 344.08499 361.625 344.25 C 361.69831 344.43336 361.74997 344.6754 361.75 344.96875 L 361.75 345.25 C 361.74997 346.51512 360.63767 347.88237 358.4375 349.3125 C 355.88892 350.98098 352.97487 351.8125 349.65625 351.8125 C 345.67755 351.8125 342.44397 350.62063 339.96875 348.21875 C 337.51186 345.81687 336.28125 342.65536 336.28125 338.75 C 336.28125 334.22127 337.74848 330.47029 340.71875 327.5 C 343.68901 324.54809 347.43999 323.06253 351.96875 323.0625 z M 174.65625 323.34375 C 176.14138 323.34378 176.87499 324.07739 176.875 325.5625 L 176.875 327.40625 C 179.49689 324.72937 182.37012 323.40628 185.46875 323.40625 C 188.60401 323.40628 190.96733 324.44109 192.5625 326.53125 C 194.17595 328.6398 194.96872 331.72382 194.96875 335.8125 L 194.9375 349.3125 C 194.93747 350.79763 194.20386 351.53125 192.71875 351.53125 C 191.23359 351.53125 190.49998 350.79763 190.5 349.3125 L 190.46875 335.8125 C 190.46873 332.56723 189.91258 330.22974 188.8125 328.78125 C 187.82239 327.47949 186.3035 326.84377 184.25 326.84375 C 182.45316 326.84377 180.90844 327.23745 179.625 328.0625 C 177.8465 329.19929 176.93 331.0248 176.875 333.5 L 176.875 349.3125 C 176.87499 350.79763 176.14138 351.53125 174.65625 351.53125 C 173.17111 351.53125 172.40625 350.79763 172.40625 349.3125 L 172.40625 325.5625 C 172.40625 324.07739 173.17111 323.34378 174.65625 323.34375 z M 287.3125 323.34375 C 292.02458 323.34378 295.42813 324.45608 297.5 326.65625 C 299.57183 328.85647 300.59372 332.36 300.59375 337.21875 L 300.59375 348.65625 C 300.59372 350.06805 299.91177 350.78125 298.5 350.78125 L 298.03125 350.71875 C 296.78445 350.5354 296.14331 349.82762 296.125 348.5625 L 296.125 346.59375 C 294.71319 348.17056 293.29969 349.34202 291.90625 350.09375 C 290.09107 351.04717 288.01603 351.53125 285.6875 351.53125 C 283.04725 351.53125 280.84099 350.7718 279.0625 349.25 C 277.30234 347.70986 276.4375 345.80479 276.4375 343.53125 C 276.4375 339.99261 277.83808 337.35392 280.625 335.59375 C 283.7236 333.61359 288.65354 332.59377 295.4375 332.59375 C 295.12579 330.63193 294.25553 329.10554 292.84375 327.96875 C 291.45027 326.81367 289.67643 326.21878 287.53125 326.21875 C 286.70616 326.21878 286.03712 326.32959 285.46875 326.53125 C 284.88202 326.71462 283.97302 327.12121 282.78125 327.78125 C 281.79115 328.31299 281.14252 328.65293 280.8125 328.78125 C 280.48246 328.90962 280.12211 328.96877 279.71875 328.96875 C 279.26037 328.96877 278.90752 328.90962 278.6875 328.78125 C 278.26579 328.54292 278.0625 328.09758 278.0625 327.4375 C 278.0625 326.17241 278.89401 325.17093 280.5625 324.4375 C 282.23098 323.70413 284.47057 323.34378 287.3125 323.34375 z M 308.90625 323.34375 C 310.37304 323.34378 311.13791 324.07739 311.15625 325.5625 L 311.15625 326.875 C 312.62304 325.70159 313.99779 324.83133 315.28125 324.28125 C 316.7297 323.65789 318.24317 323.34378 319.875 323.34375 C 323.12027 323.34378 325.94726 324.46357 328.3125 326.71875 C 330.93438 329.21233 332.24997 332.55673 332.25 336.71875 C 332.24997 341.00915 330.99353 344.55142 328.5 347.375 C 326.00642 350.21692 322.85782 351.65625 319.0625 351.65625 L 318.5 351.65625 C 317.63824 351.65625 316.78632 351.5196 315.90625 351.28125 C 314.53112 350.93289 312.93473 350.27134 311.15625 349.28125 L 311.15625 349.3125 L 311.15625 361.03125 C 311.15624 362.53471 310.39138 363.28124 308.90625 363.28125 C 307.42111 363.28124 306.6875 362.53471 306.6875 361.03125 L 306.6875 325.5625 C 306.72417 324.07739 307.45778 323.34378 308.90625 323.34375 z M 351.0625 325.65625 C 347.83553 325.65628 345.29474 327.12351 343.40625 330.09375 C 341.88444 332.47732 341.12499 335.08268 341.125 337.90625 C 345.67207 337.90626 349.28641 337.29096 352 336.0625 C 355.04359 334.70573 356.56248 332.78025 356.5625 330.25 C 356.56248 328.8749 356.08382 327.74968 355.09375 326.90625 C 354.10364 326.06287 352.7493 325.65628 351.0625 325.65625 z M 318.90625 326.6875 C 316.96273 326.68752 315.24804 327.06079 313.78125 327.8125 C 312.31444 328.56426 311.48293 329.5195 311.28125 330.65625 L 311.15625 345.625 C 313.20976 347.73353 315.78179 348.78125 318.84375 348.78125 C 321.33729 348.78125 323.3865 347.64854 325 345.375 C 326.61346 343.10147 327.43748 340.22074 327.4375 336.71875 C 327.43748 333.84017 326.61346 331.45102 325 329.5625 C 323.3865 327.65568 321.36312 326.68752 318.90625 326.6875 z M 296 335.125 C 290.90286 335.12502 287.15729 335.91029 284.71875 337.46875 C 282.62855 338.82555 281.56249 340.73604 281.5625 343.15625 C 281.56249 344.65973 282.09281 345.872 283.15625 346.84375 C 284.20134 347.79717 285.59442 348.28125 287.28125 348.28125 C 289.55477 348.28125 291.43401 347.71219 292.9375 346.59375 C 295.06434 345.01695 296.12498 342.50949 296.125 339.0625 L 296 335.125 z M 139.65625 392.25 C 145.05759 393.69278 149.5471 394.89039 150.8125 395.28125 C 159.22711 397.88001 162.08329 399.75872 162.46875 402.84375 C 162.70182 404.70926 162.4935 405.60927 161.46875 407.15625 C 160.088 409.24081 156.5119 411.62256 148.03125 416.15625 C 144.80033 408.39355 142.00729 400.42649 139.65625 392.25 z M 163.15625 445.9375 C 163.93609 446.20824 164.55583 446.43548 165.375 446.71875 C 195.14833 457.01785 201.80251 459.76136 207.21875 463.96875 C 211.43648 467.24524 212.41488 471.89163 209.9375 476.875 C 208.77074 479.22208 207.6082 480.72499 203.15625 485.75 C 201.33989 487.80004 199.9714 489.42312 198.90625 490.78125 C 195.81016 487.7799 192.79363 484.7061 189.875 481.53125 C 190.07907 481.12215 190.23185 480.73418 190.3125 480.40625 C 190.65483 479.01395 188.05045 476.90521 185.03125 476.09375 C 176.9352 466.6933 169.6157 456.60387 163.15625 445.9375 z M 220.09375 508.90625 C 224.03646 509.98769 226.63334 510.8602 228.25 511.625 C 231.7452 513.27851 234.67449 516.27299 236.96875 520.46875 C 231.16061 516.87427 225.53174 513.00215 220.09375 508.90625 z "
       style="fill:#1a1a1a;fill-opacity:1;stroke:none" />
    <path
       inkscape:connector-curvature="0"
       style="fill:#ffffff;fill-opacity:1"
       d="m 258.85544,632.17219 c 4.61447,-0.0158 5.42971,0.0553 7.55947,0.61293 4.49668,1.17732 7.31181,2.66668 11.00047,5.82821 4.1325,3.54194 11.48948,10.80055 26.64629,26.29144 24.21608,24.74983 29.21205,30.06242 29.85074,31.72179 0.90949,2.36312 1.40837,8.75103 0.77423,9.9359 -0.151,0.28211 -0.54964,0.5054 -0.88176,0.5054 -0.97016,0 -4.12527,-2.23957 -14.48449,-10.30151 -2.83856,-2.20908 -6.32344,-4.81962 -7.75302,-5.79595 -2.31033,-1.57785 -2.64661,-1.72993 -3.00013,-1.3764 -0.63569,0.63569 -1.56837,4.94519 -3.45176,15.98993 -0.96769,5.67483 -1.85957,10.6054 -1.98933,10.9467 -0.14613,0.38434 -0.45431,0.61293 -0.80649,0.61293 -0.59168,0 -5.02809,-2.04728 -14.29093,-6.60243 -2.98983,-1.4703 -5.67514,-2.67742 -5.96799,-2.67754 -0.98951,-3.4e-4 -5.07503,2.43796 -21.1622,12.6457 -4.92767,3.12675 -9.58422,5.97962 -10.34453,6.33361 -0.7603,0.35398 -1.49938,0.63523 -1.64523,0.63443 -1.01884,-0.006 -1.12167,-0.33473 -5.43034,-17.48461 -4.87322,-19.397 -6.56151,-25.19463 -7.32289,-25.19463 -0.25227,0 -0.63383,0.5094 -2.72054,3.5808 -2.55162,3.7557 -4.85136,7.57508 -10.64562,17.67818 -2.78836,4.86188 -5.2684,8.99012 -5.50561,9.17243 -0.32494,0.24974 -2.55997,0.32535 -9.0649,0.32259 -10.32275,-0.004 -18.4712,-0.37188 -21.04391,-0.95703 -1.69394,-0.38527 -2.02974,-0.57806 -3.37649,-1.92481 -1.93171,-1.93171 -2.49461,-3.47928 -2.48398,-6.79599 0.0125,-3.91274 1.15878,-7.05185 3.77436,-10.33377 8.47744,-10.63717 48.53267,-50.98534 58.63691,-59.06704 2.29348,-1.8344 3.95761,-2.64074 7.44117,-3.59155 2.29391,-0.6261 2.97996,-0.69357 7.6885,-0.70971 z"
       id="path4310" />
    <path
       inkscape:connector-curvature="0"
       style="fill:#ffffff;fill-opacity:1"
       d="m 195.08928,833.66468 c 1.61862,-0.003 5.95123,0.87322 17.90399,3.58078 7.06434,1.60024 20.96553,4.5947 30.88304,6.65621 19.51911,4.05733 24.43808,5.16007 24.95805,5.59164 1.19869,0.99479 0.94349,4.09476 -0.51615,6.2583 -1.05746,1.56744 -3.8746,3.52916 -6.60243,4.59161 -1.98635,0.77364 -3.68903,0.95143 -5.77444,0.61291 -7.02316,-1.14004 -9.51346,-1.6425 -13.71026,-2.76354 -18.02021,-4.81346 -41.675,-14.29684 -47.1633,-18.90404 -1.43778,-1.20696 -2.23528,-2.40887 -2.23666,-3.37648 -0.001,-0.88637 0.85454,-1.97631 1.72051,-2.19365 0.13478,-0.0338 0.30642,-0.0533 0.53765,-0.0537 z"
       id="path4256" />
    <path
       inkscape:connector-curvature="0"
       style="fill:#1d1d1d;fill-opacity:1"
       d="m 403.91538,874.42984 c -4.02151,0.001 -8.12979,0.37706 -10.30148,1.11833 -3.31073,1.13002 -5.76496,2.69981 -8.53803,5.47337 -2.85463,2.85507 -4.39211,5.17861 -4.12921,6.22605 0.50207,2.00022 6.21332,3.63759 15.79639,4.52709 7.28227,0.67592 18.50549,0.14862 22.73215,-1.07531 1.61435,-0.46753 4.45153,-2.34237 5.04321,-3.33351 0.62275,-1.04304 0.24135,-2.33173 -1.33339,-4.52706 -2.15868,-3.00947 -5.8004,-5.80267 -9.48424,-7.29063 -1.83248,-0.74023 -5.76386,-1.1194 -9.7854,-1.11833 z"
       id="path4222" />
    <path
       inkscape:connector-curvature="0"
       style="fill:#1d1d1d;fill-opacity:1"
       d="m 373.78508,903.3343 c -1.11543,-0.0354 -1.80431,0.48318 -2.76356,1.68826 -1.87156,2.35117 -2.90894,5.21997 -2.9141,8.07559 -0.005,2.50502 0.66124,3.69183 2.87109,5.14001 0.97325,0.63779 2.00948,1.25222 2.30117,1.36567 0.29169,0.11338 1.29941,0.48466 2.24739,0.82797 2.15266,0.7796 4.17928,0.80657 7.14009,0.0968 2.40581,-0.57671 4.40476,-1.53489 5.37657,-2.56998 2.8271,-3.01099 -4.13092,-11.37026 -11.64564,-13.98986 -1.12004,-0.39046 -1.94375,-0.61316 -2.61301,-0.63442 z"
       id="path4198" />
    <path
       inkscape:connector-curvature="0"
       style="fill:#1d1d1d;fill-opacity:1"
       d="m 373.73131,903.5816 c 0.61825,-0.004 1.3974,0.21025 2.58076,0.62372 5.7025,1.99231 11.32095,7.26348 12.08654,11.34455 0.39461,2.10335 -1.61287,3.74041 -5.74219,4.70988 -3.00059,0.70448 -4.9729,0.68166 -7.12935,-0.086 -3.67322,-1.30769 -6.1108,-2.9625 -6.79597,-4.60235 -0.4559,-1.09273 -0.458,-3.79375 0,-5.50561 0.52376,-1.95794 1.62197,-3.96353 2.9141,-5.31206 0.76837,-0.80192 1.29122,-1.16715 2.08611,-1.17211 z"
       id="path4194" />
    <path
       inkscape:connector-curvature="0"
       style="fill:#1d1d1d;fill-opacity:1"
       d="m 373.62378,903.94724 c -0.79905,0.0143 -1.28281,0.4655 -2.16138,1.53769 -1.94778,2.37701 -3.10692,6.14295 -2.70979,8.77456 0.24314,1.61098 1.40933,2.96918 3.52703,4.09697 1.42196,0.75723 3.73877,1.69098 4.9787,2.01082 0.97168,0.25065 4.37098,-0.11827 6.17231,-0.66669 2.08769,-0.63559 3.91002,-1.62254 4.29052,-2.33342 1.81586,-3.393 -5.1943,-10.90579 -12.16182,-13.02208 -0.85581,-0.25993 -1.45614,-0.40648 -1.93557,-0.39785 z"
       id="path4192" />
    <path
       sodipodi:type="arc"
       style="fill:#1a1a1a;fill-opacity:1;stroke:none"
       id="path4103"
       sodipodi:cx="843.57837"
       sodipodi:cy="40.456097"
       sodipodi:rx="64.346718"
       sodipodi:ry="64.346718"
       d="m 907.92509,40.456097 c 0,35.537711 -28.80901,64.346713 -64.34672,64.346713 -35.53771,0 -64.34672,-28.809002 -64.34672,-64.346713 0,-35.5377113 28.80901,-64.346718 64.34672,-64.346718 35.53771,0 64.34672,28.8090067 64.34672,64.346718 z"
       transform="matrix(0.88666744,0,0,0.88666744,-310.53604,585.53904)" />
    <text
       xml:space="preserve"
       style="font-size:60.28052902px;font-style:normal;font-variant:normal;font-weight:normal;font-stretch:normal;line-height:125%;letter-spacing:0px;word-spacing:0px;fill:#ffffff;fill-opacity:1;stroke:none;font-family:OptimusPrinceps;-inkscape-font-specification:OptimusPrinceps"
       x="395.59186"
       y="647.04858"
       id="text4105"
       sodipodi:linespacing="125%"><tspan
         sodipodi:role="line"
         id="tspan4107"
         x="395.59186"
         y="647.04858">0.91</tspan></text>
    <path
       inkscape:connector-curvature="0"
       id="path4449"
       d="m 375.00018,487.58538 c -135.50951,0 -246.02364,106.86162 -251.97849,240.90275 0.16616,-2.25318 0.28947,-4.5173 0.51615,-6.75298 0.41691,-4.11172 0.94151,-8.19922 1.55921,-12.24783 0.6177,-4.04861 1.32647,-8.06313 2.13988,-12.04353 0.8134,-3.98039 1.72729,-7.92137 2.7313,-11.82846 1.004,-3.90708 2.10095,-7.77397 3.29046,-11.60264 1.18951,-3.82867 2.46896,-7.62092 3.83887,-11.36608 1.36992,-3.74516 2.83131,-7.45145 4.37653,-11.108 1.54522,-3.65655 3.17726,-7.26558 4.89269,-10.82842 1.71542,-3.56283 3.51755,-7.07406 5.39807,-10.53808 1.88053,-3.46403 3.84145,-6.87689 5.88198,-10.237 2.04053,-3.36011 4.15967,-6.6633 6.35511,-9.9144 2.19543,-3.2511 4.4615,-6.45481 6.80674,-9.59181 2.34524,-3.13699 4.76842,-6.20841 7.25837,-9.2262 2.48995,-3.01778 5.04819,-5.97787 7.67775,-8.87134 2.62956,-2.89348 5.33305,-5.72017 8.09712,-8.48424 2.76406,-2.76406 5.59076,-5.46756 8.48423,-8.09712 2.89348,-2.62955 5.85356,-5.18779 8.87135,-7.67774 3.01778,-2.48995 6.0892,-4.91313 9.2262,-7.25838 3.13699,-2.34524 6.3407,-4.6113 9.5918,-6.80674 3.25111,-2.19544 6.55429,-4.31458 9.91441,-6.35511 3.36011,-2.04053 6.77297,-4.00144 10.23699,-5.88197 3.46403,-1.88053 6.97525,-3.68266 10.53809,-5.39808 3.56283,-1.71542 7.17187,-3.34746 10.82841,-4.89268 3.65655,-1.54522 7.36285,-3.00662 11.10801,-4.37653 3.74515,-1.36991 7.5374,-2.64936 11.36607,-3.83888 3.82867,-1.18951 7.69556,-2.28645 11.60265,-3.29046 3.90708,-1.004 7.84806,-1.91789 11.82846,-2.7313 3.9804,-0.8134 7.99491,-1.52217 12.04352,-2.13987 4.04862,-0.61771 8.13611,-1.14231 12.24784,-1.55921 4.11173,-0.4169 8.25014,-0.73528 12.41988,-0.94628 4.16975,-0.211 8.36928,-0.31184 12.59194,-0.31184 4.22266,0 8.42217,0.10084 12.59195,0.31184 4.16974,0.211 8.30814,0.52938 12.41987,0.94628 4.11172,0.4169 8.19923,0.9415 12.24781,1.55921 4.04862,0.6177 8.06314,1.32647 12.04353,2.13987 3.98042,0.81341 7.9214,1.7273 11.82846,2.7313 3.90709,1.00401 7.77399,2.10095 11.60266,3.29046 3.82867,1.18952 7.6209,2.46897 11.36606,3.83888 3.74519,1.36991 7.45147,2.83131 11.10802,4.37653 3.65655,1.54522 7.26558,3.17726 10.8284,4.89268 3.56285,1.71542 7.07409,3.51755 10.53809,5.39808 3.46402,1.88053 6.87688,3.84144 10.23699,5.88197 3.36014,2.04053 6.6633,4.15967 9.91444,6.35511 3.25109,2.19544 6.45481,4.4615 9.5918,6.80674 3.13696,2.34525 6.20841,4.76843 9.22617,7.25838 3.0178,2.48995 5.97789,5.04819 8.87136,7.67774 2.89348,2.62956 5.72016,5.33306 8.48425,8.09712 2.76406,2.76407 5.46756,5.59076 8.09711,8.48424 2.62954,2.89347 5.1878,5.85356 7.67774,8.87134 2.48995,3.01779 4.91314,6.08921 7.25836,9.2262 2.34525,3.137 4.61133,6.34071 6.80676,9.59181 2.19543,3.2511 4.31457,6.55429 6.35509,9.9144 2.04055,3.36011 4.00148,6.77297 5.88199,10.237 1.88051,3.46402 3.68267,6.97525 5.39808,10.53808 1.71541,3.56284 3.34748,7.17187 4.89266,10.82842 1.54522,3.65655 3.00665,7.36284 4.37655,11.108 1.3699,3.74516 2.64937,7.53741 3.83886,11.36608 1.18952,3.82867 2.28648,7.69556 3.2905,11.60264 1.00398,3.90709 1.91788,7.84807 2.73126,11.82846 0.81342,3.9804 1.5222,7.99492 2.13989,12.04353 0.6177,4.04861 1.14231,8.13611 1.55919,12.24783 0.41692,4.11173 0.73531,8.25014 0.94628,12.41989 0.211,4.16974 0.31186,8.36927 0.31186,12.59193 0,4.22267 -0.10086,8.42218 -0.31186,12.59195 -0.21097,4.16975 -0.52936,8.30814 -0.94628,12.41987 -0.41688,4.11173 -0.94149,8.19923 -1.55919,12.24782 -0.61769,4.04862 -1.32647,8.06314 -2.13989,12.04352 -0.81338,3.98042 -1.72728,7.92141 -2.73126,11.82847 -1.00402,3.90709 -2.10098,7.77399 -3.2905,11.60266 -1.18949,3.82867 -2.46896,7.6209 -3.83886,11.36606 -1.3699,3.74519 -2.83133,7.45146 -4.37655,11.10802 -1.54518,3.65655 -3.17725,7.26558 -4.89266,10.8284 -1.71541,3.56285 -3.51757,7.07409 -5.39808,10.53808 -1.88051,3.46403 -3.84144,6.87689 -5.88199,10.237 -2.04052,3.36014 -4.15966,6.6633 -6.35509,9.91443 -2.19543,3.2511 -4.46151,6.45482 -6.80676,9.59181 -2.34522,3.13696 -4.76841,6.2084 -7.25836,9.22617 -2.48994,3.01779 -5.0482,5.97788 -7.67774,8.87136 -2.62955,2.89347 -5.33305,5.72016 -8.09711,8.48425 -2.76409,2.76406 -5.59077,5.46755 -8.48425,8.0971 -2.89347,2.62955 -5.85356,5.1878 -8.87136,7.67775 -3.01776,2.48995 -6.08921,4.91314 -9.22617,7.25836 -3.13699,2.34525 -6.34071,4.61133 -9.5918,6.80676 -3.25114,2.19543 -6.5543,4.31458 -9.91444,6.35509 -3.36011,2.04056 -6.77297,4.00148 -10.23699,5.88199 -3.464,1.88051 -6.97524,3.68267 -10.53809,5.39808 -3.56282,1.71541 -7.17185,3.34748 -10.8284,4.89267 -3.65655,1.54521 -7.36283,3.00665 -11.10802,4.37654 -3.74516,1.3699 -7.53739,2.64937 -11.36606,3.83886 -3.82867,1.18952 -7.69557,2.28648 -11.60266,3.2905 -3.90706,1.00398 -7.84804,1.91788 -11.82846,2.73126 -3.98039,0.81342 -7.99491,1.5222 -12.04353,2.1399 -4.04858,0.61769 -8.13609,1.14231 -12.24781,1.55919 -4.11173,0.41691 -8.25013,0.7353 -12.41987,0.94627 -4.16978,0.211 -8.36929,0.31186 -12.59195,0.31186 -4.22266,0 -8.42219,-0.10086 -12.59194,-0.31186 -3.72938,-0.1887 -7.42481,-0.49585 -11.108,-0.84948 10.47336,1.32493 21.12531,2.08611 31.95835,2.08611 139.32596,0 252.26883,-112.94287 252.26883,-252.26883 0,-139.32598 -112.94287,-252.27958 -252.26883,-252.27958 z"
       style="fill:#333333;fill-opacity:1;stroke:none" />
    <g
       id="text3038"
       style="font-size:40px;font-style:normal;font-variant:normal;font-weight:normal;font-stretch:normal;line-height:125%;letter-spacing:0px;word-spacing:0px;fill:#000000;fill-opacity:1;stroke:none;font-family:inglobal;-inkscape-font-specification:inglobal">
      <path
         id="path3819"
         style="stroke:none"
         d="m 389.43788,726.55412 c 3.181,0.0399 6.16314,-1.45536 8.94644,-4.48573 1.51492,-1.64945 2.58871,-3.27092 3.22138,-4.86444 0.75535,-1.95813 0.88041,-3.89407 0.37519,-5.80784 -0.60978,-2.20421 -2.07981,-4.37647 -4.41011,-6.51679 -1.03572,-0.95123 -1.85997,-1.37236 -2.47275,-1.26339 -0.69522,0.12172 -1.71779,0.8886 -3.06771,2.30063 l -11.04502,12.0256 c -0.86964,1.00459 -1.27198,1.83725 -1.20703,2.498 0.0761,0.70635 0.7231,1.61883 1.94101,2.73743 2.41661,2.21956 4.98948,3.34507 7.7186,3.37653 z m 15.81185,-12.07616 c 0.23876,3.66681 -1.15679,7.14966 -4.18665,10.44855 -2.93303,3.19339 -6.28274,4.71347 -10.04913,4.56025 -3.62726,-0.13152 -7.17185,-1.78709 -10.63375,-4.96671 l -4.18595,-3.84461 c -0.82472,-0.75748 -0.85394,-1.55337 -0.0877,-2.38768 l 16.66001,-18.1391 c 0.72222,-0.78635 1.48935,-0.84199 2.30137,-0.16694 l 4.65947,4.25301 c 3.43312,3.15322 5.27388,6.56762 5.52229,10.24323 z" />
      <path
         id="path3821"
         style="stroke:none"
         d="m 415.04729,728.87456 c -0.0103,0.74018 -0.27108,1.41412 -0.78247,2.02183 -0.23477,0.27896 -0.47401,0.45203 -0.71772,0.5192 -0.31713,0.0735 -0.63011,-0.0197 -0.93893,-0.2796 l -0.22653,-0.21616 c -0.0813,-0.0854 -0.17624,-0.27592 -0.28483,-0.57154 -0.0987,-0.28722 -0.22404,-0.56291 -0.37613,-0.82706 -0.17047,-0.26256 -0.32544,-0.45253 -0.4649,-0.56991 -0.82691,-0.69585 -2.02757,-0.63411 -3.60197,0.18521 -1.13994,0.60637 -2.25199,1.48294 -3.33616,2.62973 l -0.0401,0.0173 -5.43271,6.45578 c -0.67909,0.80697 -1.43209,0.86252 -2.25898,0.16667 -0.81694,-0.68747 -0.88586,-1.4347 -0.20677,-2.24167 l 10.8277,-12.86672 c 0.67908,-0.80696 1.42709,-0.8667 2.24404,-0.17925 0.82688,0.69587 0.90078,1.44729 0.22171,2.25425 l -1.77318,2.10709 c 2.99377,-1.29263 5.13823,-1.394 6.43339,-0.30411 0.47819,0.40243 0.71637,0.96874 0.71454,1.69895 z" />
      <path
         id="path3823"
         style="stroke:none"
         d="m 415.77177,750.49142 c 1.8697,0.19869 3.63331,-0.60265 5.29085,-2.40401 l 1.83366,-2.10818 c -2.66374,-2.45102 -5.00749,-3.8556 -7.03125,-4.21376 -1.74476,-0.29604 -3.19903,0.18833 -4.36281,1.45312 -0.72297,0.7857 -1.04022,1.68815 -0.95175,2.70734 0.0877,1.0008 0.5723,1.90676 1.45383,2.71789 1.18812,1.09325 2.44395,1.70912 3.76747,1.8476 z m 11.98713,-8.23919 c 0.0247,2.14609 -1.13111,4.48871 -3.46748,7.02787 l -5.50156,5.97901 c -0.67889,0.73778 -1.38722,0.76724 -2.125,0.0884 l -0.21789,-0.25357 c -0.5634,-0.69535 -0.54572,-1.378 0.0531,-2.04795 l 0.93897,-1.02046 c -1.49604,0.14515 -2.78889,0.0791 -3.87858,-0.19808 -1.40706,-0.3746 -2.71903,-1.12175 -3.9359,-2.24145 -1.37977,-1.2696 -2.16849,-2.72964 -2.36613,-4.38013 -0.17926,-1.65126 0.27774,-3.07095 1.371,-4.25909 1.7016,-1.84927 3.70381,-2.56377 6.00663,-2.1435 2.5715,0.45518 5.62987,2.31384 9.17513,5.57597 0.78047,-1.17513 1.07513,-2.39916 0.88398,-3.67211 -0.17279,-1.2737 -0.8197,-2.42633 -1.94074,-3.45788 -0.4312,-0.39674 -0.8438,-0.67907 -1.2378,-0.84699 -0.3948,-0.18631 -1.06229,-0.39353 -2.00249,-0.62167 -0.77311,-0.19822 -1.27675,-0.34315 -1.51092,-0.43478 -0.2342,-0.0916 -0.45669,-0.23442 -0.66748,-0.42839 -0.23956,-0.22041 -0.38596,-0.41705 -0.43921,-0.58993 -0.10578,-0.32733 4e-5,-0.66348 0.31745,-1.00843 0.60833,-0.66113 1.5248,-0.78218 2.74942,-0.36315 1.22458,0.41905 2.57947,1.31186 4.06466,2.67842 2.46248,2.26587 3.70611,4.47184 3.73088,6.61792 z" />
      <path
         id="path3825"
         style="stroke:none"
         d="m 452.30572,767.52361 c 0.51402,0.68866 0.43194,1.28613 -0.24626,1.79241 -1.63823,1.22283 -4.47983,2.56404 -8.52479,4.02362 -5.64528,2.03664 -9.13357,2.60945 -10.46487,1.71842 -0.16123,-0.10715 -0.29636,-0.23376 -0.40539,-0.37983 -0.80226,-1.07475 -0.31806,-3.2885 1.45259,-6.64125 0.72967,-1.37335 1.65761,-2.89468 2.78381,-4.564 -0.96188,0.40927 -2.68685,0.85197 -5.1749,1.3281 -3.05079,0.57119 -4.97166,0.69703 -5.76259,0.37753 -0.29922,-0.11787 -0.53061,-0.28637 -0.69417,-0.50548 -1.05928,-1.41908 0.38753,-4.94445 4.34044,-10.57611 2.25207,-3.20842 4.12939,-5.37344 5.63195,-6.49503 l 0.0939,-0.0701 c 0.87648,-0.65425 1.63795,-0.54836 2.28444,0.31769 0.63867,0.85562 0.5302,1.60278 -0.3254,2.24145 -1.76607,1.33454 -3.60518,3.30042 -5.51732,5.89764 -2.10806,2.8572 -3.50548,5.2733 -4.19225,7.24831 2.74274,-0.24378 5.36388,-0.83548 7.86343,-1.77511 2.5777,-0.96551 4.98304,-2.28166 7.21601,-3.94847 0.92864,-0.6932 1.71231,-0.612 2.35102,0.24362 0.63866,0.85562 0.50932,1.61835 -0.38801,2.28819 -1.99299,1.48766 -3.89588,3.44428 -5.70866,5.86986 -1.74493,2.34239 -3.09664,4.7 -4.05514,7.07284 1.86434,0.10318 4.45542,-0.44172 7.77327,-1.63469 3.15364,-1.15171 5.74782,-2.48696 7.78255,-4.00577 0.75125,-0.56081 1.38002,-0.50209 1.88633,0.17616 z" />
      <path
         id="path3827"
         style="stroke:none"
         d="m 463.17143,816.34823 c -0.35231,1.17214 -1.12701,1.57832 -2.32409,1.21856 -1.18465,-0.35607 -1.60082,-1.12017 -1.2485,-2.29231 0.0712,-0.23695 0.1904,-0.45265 0.35764,-0.6471 0.82354,-0.8402 1.4319,-1.57509 1.8251,-2.2047 0.53544,-0.83161 1.11611,-2.28863 1.74201,-4.37107 0.41974,-1.39663 0.68907,-2.51894 0.808,-3.36695 -0.007,-0.11101 -0.0267,-0.20518 -0.0579,-0.28251 -0.2105,-0.56633 -0.85692,-1.03934 -1.93925,-1.41901 l -7.42577,-2.23183 -3.03011,10.08183 c -0.21739,0.72323 -0.69393,0.97429 -1.42964,0.75319 -0.73573,-0.22114 -0.9949,-0.69332 -0.77752,-1.41655 l 3.03012,-10.08184 -11.35375,-3.41239 0.006,-0.0187 c -0.89401,-0.41825 -1.20234,-1.08876 -0.92501,-2.01153 0.31857,-1.05993 1.02029,-1.42687 2.10516,-1.1008 l 23.58663,7.089 c 1.08484,0.32606 1.468,1.01905 1.14946,2.079 z" />
      <path
         id="path3829"
         style="stroke:none"
         d="m 438.47033,831.55114 c -0.73043,-0.12017 -1.35812,-0.47827 -1.88306,-1.07432 -0.24097,-0.27363 -0.37655,-0.53593 -0.40675,-0.78692 -0.0255,-0.32454 0.11315,-0.62018 0.41607,-0.88694 l 0.24743,-0.19188 c 0.0965,-0.0677 0.29906,-0.13327 0.60753,-0.19671 0.2987,-0.0549 0.58996,-0.13788 0.87378,-0.24901 0.28499,-0.12955 0.49588,-0.25455 0.63269,-0.37501 0.81103,-0.71429 0.92846,-1.91079 0.35227,-3.58949 -0.43018,-1.21741 -1.13171,-2.44741 -2.10459,-3.69 l -0.0112,-0.0422 -5.57649,-6.332 c -0.69706,-0.7915 -0.64007,-1.54439 0.17097,-2.25866 0.80128,-0.70567 1.55044,-0.66275 2.2475,0.12875 l 11.11425,12.62002 c 0.69705,0.79149 0.64495,1.54007 -0.15631,2.24575 -0.81106,0.71426 -1.56511,0.67564 -2.26216,-0.11584 l -1.8201,-2.06669 c 0.83324,3.15266 0.61472,5.28836 -0.65558,6.40712 -0.46904,0.41305 -1.06447,0.5644 -1.78629,0.45405 z" />
      <path
         id="path3831"
         style="stroke:none"
         d="m 424.93049,828.92054 c -2.8722,1.47578 -4.96598,3.04201 -6.28134,4.6987 -1.48216,1.84484 -1.81264,3.56638 -0.99144,5.16464 0.44632,0.86859 1.11904,1.4086 2.01817,1.62003 0.89914,0.21138 1.88145,0.0434 2.94694,-0.5041 2.03834,-1.04736 3.17194,-2.81559 3.40081,-5.3047 0.18766,-1.99952 -0.17672,-3.89104 -1.09314,-5.67457 z m -14.63702,2.66791 c -0.15054,0.0774 -0.27576,0.0758 -0.37566,-0.005 -0.10582,-0.092 -0.20634,-0.23068 -0.30157,-0.41597 l -0.0982,-0.1911 c -0.41058,-0.79913 -0.15308,-2.00741 0.77252,-3.62485 1.06832,-1.88108 2.65059,-3.36016 4.74683,-4.43724 2.51318,-1.29132 4.94129,-1.58007 7.28434,-0.86625 2.33147,0.71976 4.13095,2.31307 5.39847,4.77993 1.46984,2.86061 1.74867,5.71103 0.83651,8.55126 -0.91813,2.82863 -2.8075,4.97787 -5.66812,6.44773 -1.79512,0.92235 -3.47159,1.24942 -5.0294,0.98122 -1.55781,-0.26824 -2.69078,-1.09145 -3.39893,-2.46962 -0.50581,-0.98445 -0.725,-1.85264 -0.65757,-2.60459 0.10929,-1.18338 0.82539,-2.52482 2.14828,-4.02432 1.64464,-1.89907 4.2296,-4.07634 7.7549,-6.53182 -0.73194,-1.42453 -1.92612,-2.25288 -3.58253,-2.48507 -1.49894,-0.21064 -3.02437,0.0827 -4.57629,0.88015 -0.88018,0.45225 -1.78001,1.23666 -2.6995,2.35323 -0.73352,1.07957 -1.51274,2.24118 -2.33765,3.48483 z" />
      <path
         id="path3833"
         style="stroke:none"
         d="m 405.33967,837.96384 c -3.02355,1.13383 -5.28436,2.4475 -6.78243,3.94101 -1.6855,1.66112 -2.21279,3.33291 -1.58188,5.0154 0.34291,0.91436 0.94869,1.52852 1.81735,1.84248 0.86867,0.31391 1.86382,0.26057 2.98546,-0.16003 2.14575,-0.80468 3.47618,-2.43 3.99128,-4.87596 0.41756,-1.96441 0.2743,-3.88538 -0.42978,-5.7629 z m -14.8473,0.95785 c -0.15848,0.0594 -0.28268,0.0434 -0.37261,-0.048 -0.0945,-0.10364 -0.17829,-0.25299 -0.25146,-0.44805 l -0.0754,-0.20116 c -0.31545,-0.84124 0.08,-2.01165 1.18641,-3.51124 1.27862,-1.74496 3.02128,-3.03119 5.22798,-3.85871 2.64562,-0.99211 5.09084,-0.99821 7.33565,-0.0183 2.23262,0.98448 3.83584,2.77514 4.80967,5.372 1.12926,3.01135 1.07669,5.8749 -0.15772,8.59063 -1.23898,2.70351 -3.36416,4.61991 -6.37553,5.74921 -1.88972,0.70862 -3.59276,0.83969 -5.10912,0.39319 -1.51634,-0.44654 -2.54655,-1.39521 -3.09062,-2.84601 -0.3886,-1.03632 -0.50595,-1.92404 -0.35205,-2.66315 0.24537,-1.16281 1.11175,-2.41246 2.59913,-3.74898 1.85316,-1.69619 4.6725,-3.56002 8.45804,-5.59147 -0.56234,-1.4996 -1.65275,-2.46046 -3.27121,-2.88259 -1.46453,-0.38252 -3.01365,-0.26746 -4.64736,0.34519 -0.92656,0.34746 -1.91104,1.02258 -2.95345,2.02537 -0.85341,0.98752 -1.7617,2.05126 -2.72486,3.1912 z" />
      <path
         id="path3835"
         style="stroke:none"
         d="m 382.24471,837.43567 c -0.35806,-1.03348 -0.0265,-1.72712 0.99466,-2.08092 1.02118,-0.35381 1.7108,-0.014 2.06887,1.01951 l 8.29308,23.9361 c 0.35806,1.03345 0.0265,1.72709 -0.99467,2.08092 -1.02118,0.35377 -1.7108,0.0139 -2.06886,-1.01951 z" />
      <path
         id="path3837"
         transform="translate(0,427.36218)"
         d="M 369.375 410.15625 L 366.71875 411.03125 C 366.40712 412.12234 366.20574 413.23452 366.09375 414.40625 C 365.1664 420.98723 365.77644 427.45712 367.96875 433.78125 L 368.03125 433.90625 C 368.36959 434.57304 368.87688 434.77941 369.5625 434.53125 C 370.30898 434.26088 370.55837 433.75569 370.3125 433 C 369.32191 429.53661 368.72898 427.31073 368.53125 426.34375 C 367.96492 423.36378 367.78034 420.96925 367.96875 419.15625 C 368.19668 416.95505 368.90067 415.63069 370.125 415.1875 C 371.22691 414.78862 372.52882 415.18689 374 416.34375 C 375.34899 417.39252 376.52913 418.68893 377.5625 420.28125 C 378.76683 422.1163 380.02746 424.86371 381.34375 428.5 C 381.70274 429.49169 382.38329 429.79647 383.375 429.4375 C 384.31773 429.09622 384.64047 428.44145 384.34375 427.46875 L 382.59375 422.90625 C 380.84917 419.27267 378.75126 416.36249 376.34375 414.1875 C 374.46289 412.4727 372.59199 411.9469 370.71875 412.625 C 370.33922 412.76238 370.01155 412.94201 369.6875 413.15625 C 369.38016 413.37828 369.02378 413.67919 368.625 414.03125 C 368.70339 412.65047 368.95146 411.34987 369.375 410.15625 z "
         style="stroke:none" />
    </g>
    <path
       sodipodi:nodetypes="csc"
       transform="translate(0,427.36218)"
       inkscape:connector-curvature="0"
       id="path3813"
       d="m 374.5,291 c 10.6525,14.4025 65,46.90274 65,76 0,32.18569 -64.16667,39.16667 -96.5,57.5"
       style="fill:none;stroke:none;stroke-width:1px;stroke-linecap:butt;stroke-linejoin:miter;stroke-opacity:1" />
    <text
       xml:space="preserve"
       style="font-size:18.22323799px;font-style:normal;font-variant:normal;font-weight:normal;font-stretch:normal;line-height:125%;letter-spacing:0px;word-spacing:0px;fill:#000000;fill-opacity:1;stroke:none;font-family:inglobal;-inkscape-font-specification:inglobal"
       x="297.29852"
       y="952.95782"
       id="text6133"
       sodipodi:linespacing="125%"><tspan
         sodipodi:role="line"
         id="tspan6135"
         x="297.29852"
         y="952.95782">www.inkscape.org</tspan></text>
  </g>
</svg>
