<?xml version="1.0" encoding="UTF-8" standalone="no"?>
<svg
   xmlns:dc="http://purl.org/dc/elements/1.1/"
   xmlns:cc="http://creativecommons.org/ns#"
   xmlns:rdf="http://www.w3.org/1999/02/22-rdf-syntax-ns#"
   xmlns:svg="http://www.w3.org/2000/svg"
   xmlns="http://www.w3.org/2000/svg"
   xmlns:sodipodi="http://sodipodi.sourceforge.net/DTD/sodipodi-0.dtd"
   xmlns:inkscape="http://www.inkscape.org/namespaces/inkscape"
   width="1000"
   height="1000"
   viewBox="0 0 1000 1000"
   version="1.1"
   id="svg8"
   inkscape:version="1.0alpha (ce9af91c8d, 2019-05-22, custom)"
   sodipodi:docname="offset.2.svg">
  <style
     id="style846" />
  <defs
     id="defs2">
    <inkscape:path-effect
       effect="offset"
       id="path-effect1063"
       is_visible="true"
       linejoin_type="round"
       unit="mm"
       offset="0"
       miter_limit="4"
       attempt_force_join="true"
       update_on_knot_move="true" />
    <inkscape:path-effect
       effect="offset"
       id="path-effect889"
       is_visible="true"
       linejoin_type="bevel"
       unit="mm"
       offset="5.5583416"
       miter_limit="4"
       attempt_force_join="true"
       update_on_knot_move="true" />
    <inkscape:path-effect
       update_on_knot_move="true"
       attempt_force_join="true"
       miter_limit="4"
       offset="15.753983"
       unit="mm"
       linejoin_type="extrp_arc"
       is_visible="true"
       id="path-effect950"
       effect="offset" />
    <inkscape:path-effect
       update_on_knot_move="true"
       attempt_force_join="true"
       miter_limit="4"
       offset="0"
       unit="mm"
       linejoin_type="round"
       is_visible="true"
       id="path-effect944"
       effect="offset" />
    <inkscape:path-effect
       update_on_knot_move="true"
       attempt_force_join="true"
       miter_limit="4"
       offset="8.0064153"
       unit="mm"
       linejoin_type="round"
       is_visible="true"
       id="path-effect942"
       effect="offset" />
    <inkscape:path-effect
       update_on_knot_move="true"
       attempt_force_join="true"
       miter_limit="4"
       offset="-30.114608"
       unit="mm"
       linejoin_type="round"
       is_visible="true"
       id="path-effect886"
       effect="offset" />
    <inkscape:path-effect
       effect="join_type"
       id="path-effect872"
       is_visible="true"
       linecap_type="butt"
       line_width="80"
       linejoin_type="extrp_arc"
       miter_limit="100"
       attempt_force_join="true" />
    <inkscape:path-effect
       update_on_knot_move="true"
       attempt_force_join="true"
       miter_limit="4"
       offset="-17.560666"
       unit="mm"
       linejoin_type="miter"
       is_visible="true"
       id="path-effect937"
       effect="offset" />
    <inkscape:path-effect
       update_on_knot_move="true"
       attempt_force_join="true"
       miter_limit="4"
       offset="-16.418874"
       unit="mm"
       linejoin_type="round"
       is_visible="true"
       id="path-effect934"
       effect="offset" />
    <inkscape:path-effect
       update_on_knot_move="true"
       attempt_force_join="true"
       miter_limit="4"
       offset="25.329793"
       unit="mm"
       linejoin_type="round"
       is_visible="true"
       id="path-effect902"
       effect="offset" />
    <inkscape:path-effect
       update_on_knot_move="true"
       attempt_force_join="true"
       miter_limit="4"
       offset="0"
       unit="mm"
       linejoin_type="round"
       is_visible="true"
       id="path-effect900"
       effect="offset" />
    <inkscape:path-effect
       update_on_knot_move="true"
       attempt_force_join="true"
       miter_limit="4"
       offset="0"
       unit="mm"
       linejoin_type="round"
       is_visible="true"
       id="path-effect897"
       effect="offset" />
    <inkscape:path-effect
       update_on_knot_move="true"
       attempt_force_join="true"
       miter_limit="4"
       offset="23.494393"
       unit="mm"
       linejoin_type="round"
       is_visible="true"
       id="path-effect879"
       effect="offset" />
    <inkscape:path-effect
       update_on_knot_move="true"
       attempt_force_join="true"
       miter_limit="4"
       offset="21.1"
       linejoin_type="round"
       is_visible="true"
       id="path-effect859"
       effect="offset" />
    <inkscape:path-effect
       effect="offset"
       id="path-effect857"
       is_visible="true"
       linejoin_type="round"
       offset="28.920632"
       miter_limit="100"
       attempt_force_join="false"
       update_on_knot_move="true" />
    <inkscape:path-effect
       update_on_knot_move="true"
       attempt_force_join="true"
       miter_limit="4"
       offset="14.3"
       linejoin_type="bevel"
       is_visible="true"
       id="path-effect1186"
       effect="offset" />
    <inkscape:path-effect
       update_on_knot_move="true"
       attempt_force_join="true"
       miter_limit="4"
       offset="243.12447"
       linejoin_type="round"
       is_visible="true"
       id="path-effect1179"
       effect="offset" />
    <inkscape:path-effect
       update_on_knot_move="true"
       attempt_force_join="true"
       miter_limit="4"
       offset="-20.22513"
       linejoin_type="extrp_arc1"
       is_visible="true"
       id="path-effect967"
       effect="offset" />
    <inkscape:path-effect
       update_on_knot_move="true"
       attempt_force_join="true"
       miter_limit="4"
       offset="0"
       linejoin_type="round"
       is_visible="true"
       id="path-effect849"
       effect="offset" />
    <inkscape:path-effect
       effect="offset"
       id="path-effect844"
       is_visible="true"
       linejoin_type="miter"
       offset="100"
       miter_limit="10"
       attempt_force_join="true"
       update_on_knot_move="true" />
    <inkscape:path-effect
       effect="offset"
       id="path-effect3310"
       is_visible="true"
       linejoin_type="round"
       offset="55.889475"
       miter_limit="4"
       attempt_force_join="true"
       update_on_knot_move="true" />
    <inkscape:path-effect
       effect="offset"
       id="path-effect3308"
       is_visible="true"
       linejoin_type="miter"
       offset="41.29291"
       miter_limit="4"
       attempt_force_join="true"
       update_on_knot_move="true" />
    <inkscape:path-effect
       effect="offset"
       id="path-effect2742"
       is_visible="true"
       linejoin_type="round"
       offset="0"
       miter_limit="4"
       attempt_force_join="true"
       update_on_knot_move="true" />
    <inkscape:path-effect
       effect="offset"
       id="path-effect2740"
       is_visible="true"
       linejoin_type="round"
       offset="0"
       miter_limit="4"
       attempt_force_join="true"
       update_on_knot_move="true" />
    <inkscape:path-effect
       update_on_knot_move="true"
       attempt_force_join="true"
       miter_limit="4"
       offset="1.418028"
       linejoin_type="miter"
       is_visible="true"
       id="path-effect993"
       effect="offset" />
    <clipPath
       id="clipPath863"
       clipPathUnits="userSpaceOnUse">
      <path
         inkscape:transform-center-y="-5.5936297"
         inkscape:transform-center-x="17.379295"
         inkscape:randomized="0"
         inkscape:rounded="0"
         inkscape:flatsided="false"
         sodipodi:arg2="1.3326398"
         sodipodi:arg1="0.70432124"
         sodipodi:r2="119.19841"
         sodipodi:r1="238.39684"
         sodipodi:cy="704.16815"
         sodipodi:cx="-237.93484"
         sodipodi:sides="5"
         id="path865"
         style="fill:#d4aa00;stroke-width:48.869;stroke-linejoin:round"
         sodipodi:type="star" />
    </clipPath>
    <clipPath
       id="clipPath929"
       clipPathUnits="userSpaceOnUse">
      <path
         inkscape:connector-curvature="0"
         d="M -856.56437,230.38505 -395.25711,217.05743 66.050116,203.72981 -153.06146,609.89741 -372.17303,1016.065 -614.36869,623.22503 Z"
         style="d:m -248.79678000000001248, 588.46774000000004889 -116.26735999999999649, -31.15373999999999910 -116.26734999999999332, -31.15373999999999910 85.11360999999999422, -85.11360999999999422 85.11360999999999422, -85.11361999999998318 31.15373999999999910, 116.26735999999999649 z;fill:#ffff00;stroke-width:187.366;stroke-linejoin:round"
         id="path931" />
    </clipPath>
    <clipPath
       id="clipPath877"
       clipPathUnits="userSpaceOnUse">
      <path
         inkscape:connector-curvature="0"
         d="m -628.85205,312.07715 331.93595,-2e-5 331.935847,-1e-5 L -130.94817,599.54211 -296.9161,887.00704 -462.88407,599.54211 Z"
         style="d:m -248.79678000000001248, 588.46774000000004889 -116.26735999999999649, -31.15373999999999910 -116.26734999999999332, -31.15373999999999910 85.11360999999999422, -85.11360999999999422 85.11360999999999422, -85.11361999999998318 31.15373999999999910, 116.26735999999999649 z;fill:#ffff00;stroke-width:134.764;stroke-linejoin:round"
         id="path879" />
    </clipPath>
    <clipPath
       id="clipPath881"
       clipPathUnits="userSpaceOnUse">
      <path
         id="path883"
         style="d:m -248.79678000000001248, 588.46774000000004889 -116.26735999999999649, -31.15373999999999910 -116.26734999999999332, -31.15373999999999910 85.11360999999999422, -85.11360999999999422 85.11360999999999422, -85.11361999999998318 31.15373999999999910, 116.26735999999999649 z;fill:#ffff00;stroke-width:163.661;stroke-linejoin:round"
         d="M -794.41366,283.40631 -391.47095,271.76489 11.471634,260.12349 -179.91791,614.90284 -371.30747,969.68212 -582.86056,626.54423 Z"
         inkscape:connector-curvature="0" />
    </clipPath>
  </defs>
  <sodipodi:namedview
     units="px"
     showborder="false"
     inkscape:snap-global="false"
     inkscape:pagecheckerboard="false"
     inkscape:bbox-nodes="true"
     inkscape:snap-bbox="true"
     inkscape:snap-nodes="false"
     inkscape:object-nodes="false"
     inkscape:window-maximized="1"
     inkscape:window-y="27"
     inkscape:window-x="0"
     inkscape:window-height="1016"
     inkscape:window-width="1920"
     objecttolerance="20"
     borderlayer="true"
     inkscape:showpageshadow="false"
     inkscape:snap-others="true"
     inkscape:snap-grids="true"
     showgrid="true"
     inkscape:document-rotation="0"
     inkscape:current-layer="layer1"
     inkscape:document-units="px"
     inkscape:cy="523.4247"
     inkscape:cx="148.01765"
     inkscape:zoom="0.67043379"
     inkscape:pageshadow="2"
     inkscape:pageopacity="1"
     borderopacity="1.0"
     bordercolor="#666666"
     pagecolor="#ff4bb1"
     id="base"
     inkscape:snap-text-baseline="true"
     showguides="true"
     inkscape:guide-bbox="true">
    <inkscape:grid
       enabled="false"
       visible="false"
       spacingy="1"
       spacingx="1"
       units="mm"
       id="grid10"
       type="xygrid"
       empcolor="#3f3fff"
       empopacity="0.07058824"
       color="#3f3fff"
       opacity="0.03137255" />
    <sodipodi:guide
       position="635.4095,1120.8173"
       orientation="0,-1"
       id="guide883" />
    <sodipodi:guide
       position="1200.7151,889.6237"
       orientation="1,0"
       id="guide885" />
  </sodipodi:namedview>
  <metadata
     id="metadata5">
    <rdf:RDF>
      <cc:Work
         rdf:about="">
        <dc:format>image/svg+xml</dc:format>
        <dc:type
           rdf:resource="http://purl.org/dc/dcmitype/StillImage" />
        <dc:title />
      </cc:Work>
    </rdf:RDF>
  </metadata>
  <g
     id="layer1"
     inkscape:groupmode="layer"
     inkscape:label="Layer 1">
    <ellipse
       ry="238.56824"
       rx="335.57565"
       cy="-205.49559"
       cx="107.99397"
       id="path963"
       style="opacity:0.108356;fill:#ffffff;fill-opacity:0.989034;stroke-width:86.0992;stroke-linejoin:round" />
    <text
       xml:space="preserve"
       style="font-style:normal;font-variant:normal;font-weight:300;font-stretch:normal;font-size:40px;line-height:1;font-family:Lato;-inkscape-font-specification:'Lato Light';text-align:center;letter-spacing:0px;word-spacing:0px;text-anchor:middle;fill:#ffffff"
       x="-391.59827"
       y="221.69981"
       id="text962"><tspan
         sodipodi:role="line"
         id="tspan960"
         x="-391.59827"
         y="221.69981">PREVIOUS</tspan><tspan
         id="tspan889"
         sodipodi:role="line"
         x="-391.59827"
         y="261.69986">DESTRUCTIVE</tspan><tspan
         id="tspan897"
         sodipodi:role="line"
         x="-391.59827"
         y="301.69986">OFFSET</tspan><tspan
         id="tspan891"
         sodipodi:role="line"
         x="-391.59827"
         y="341.69986" /><tspan
         id="tspan893"
         sodipodi:role="line"
         x="-391.59827"
         y="381.69986" /><tspan
         id="tspan1176"
         sodipodi:role="line"
         x="-391.59827"
         y="421.69986" /></text>
    <text
       id="text855"
       y="261.69986"
       x="542.50665"
       style="font-style:normal;font-variant:normal;font-weight:300;font-stretch:normal;font-size:40px;line-height:0%;font-family:Lato;-inkscape-font-specification:'Lato Light';letter-spacing:0px;word-spacing:0px;fill:#ffffff"
       xml:space="preserve"><tspan
         y="261.69986"
         x="542.50665"
         id="tspan853"
         sodipodi:role="line">LPE OFFSET</tspan></text>
    <text
       id="text926"
       y="-28.83263"
       x="107.93227"
       style="font-style:normal;font-variant:normal;font-weight:300;font-stretch:normal;font-size:64.7611px;line-height:1;font-family:Lato;-inkscape-font-specification:'Lato Light';text-align:center;letter-spacing:0px;word-spacing:0px;text-anchor:middle;fill:#ffffff;fill-opacity:0.563929;stroke-width:1.61902"
       xml:space="preserve"><tspan
         style="fill:#ffffff;fill-opacity:0.563929;stroke-width:1.61902"
         y="-28.83263"
         x="107.93226"
         sodipodi:role="line"
         id="tspan924">SUBPATHS</tspan></text>
    <path
       id="path975"
       style="font-style:normal;font-variant:normal;font-weight:normal;font-stretch:normal;font-size:40px;line-height:0%;font-family:ChunkFive;-inkscape-font-specification:ChunkFive;letter-spacing:0px;word-spacing:0px;fill:#ffffff;stroke-width:3.25534"
       sodipodi:type="inkscape:offset"
       inkscape:radius="0"
       inkscape:original="M -494.47266 465.32812 C -514.78598 465.32812 -534.44922 484.85953 -534.44922 513.24609 C -534.44922 541.37223 -516.34988 559.08203 -493.5625 559.08203 C -483.53605 559.08203 -475.46236 554.52494 -472.59766 549.70703 L -468.56055 557.91016 L -442.51758 557.91016 L -442.51758 525.35547 L -437.30859 525.35547 L -437.30859 511.42383 L -480.54102 511.42383 L -480.54102 525.35547 L -472.59766 525.35547 L -472.59766 530.82617 C -474.55086 534.21172 -477.67549 537.20508 -485.09766 537.20508 C -496.42625 537.20508 -502.9375 526.52788 -502.9375 513.24609 C -502.9375 500.22473 -495.64496 488.76562 -485.09766 488.76562 C -477.41506 488.76562 -470.64455 494.75543 -470.25391 505.30273 L -446.94531 505.30273 L -446.94531 466.89062 L -466.34766 466.89062 L -469.08203 476.26562 C -471.16545 474.18221 -475.59169 465.32813 -494.47266 465.32812 z M -203.92773 465.45898 C -225.15254 466.11005 -237.6543 480.95372 -237.6543 498.40234 C -237.6543 516.11139 -223.85093 528.09051 -207.18359 527.43945 C -200.28227 527.17902 -194.68243 524.18439 -191.29688 520.79883 C -191.16665 532.25763 -197.54778 538.24739 -207.18359 538.50781 C -215.12662 538.50781 -221.76805 534.47146 -226.19531 531.86719 L -235.04883 548.79492 C -227.36623 555.3056 -213.04267 559.34246 -204.31836 559.08203 C -170.07218 558.04032 -164.73305 526.00731 -165.25391 506.21484 C -166.03519 480.17212 -182.5727 464.80792 -203.92773 465.45898 z M -612.49609 466.89062 L -612.49609 484.07812 L -605.33398 484.07812 L -605.33398 540.5918 L -612.49609 540.5918 L -612.49609 557.91016 L -539.57617 557.91016 L -539.57617 524.05469 L -561.45117 524.05469 L -561.45117 540.5918 L -578.25 540.5918 L -578.25 484.07812 L -571.34766 484.07812 L -571.34766 466.89062 L -612.49609 466.89062 z M -432.05078 466.89062 L -432.05078 483.6875 L -425.14844 483.6875 L -425.14844 541.11133 L -432.17969 541.11133 L -432.17969 557.91016 L -396.89258 557.91016 L -396.89258 541.11133 L -404.31445 541.11133 L -404.31445 489.80859 L -403.79297 489.80859 C -403.40232 496.31927 -401.70966 503.74145 -401.05859 505.95508 L -386.47461 557.91016 L -359.25977 557.91016 L -345.58789 507.25586 C -344.67639 504.26095 -342.85421 495.6682 -341.8125 489.80859 L -341.29102 489.80859 L -341.29102 497.49023 L -341.29102 540.98242 L -348.58398 540.98242 L -348.58398 557.91016 L -307.43555 557.91016 L -307.43555 540.98242 L -314.59766 540.98242 L -314.59766 483.6875 L -307.43555 483.6875 L -307.43555 466.89062 L -357.04688 466.89062 L -369.54688 515.58984 L -382.69922 466.89062 L -432.05078 466.89062 z M -278.16211 466.89062 C -287.6677 478.21922 -293.52704 480.30324 -300.94922 483.94922 L -294.95898 498.40234 L -281.9375 492.28125 L -281.9375 540.5918 L -294.95898 540.5918 L -294.95898 557.91016 L -242.875 557.91016 L -242.875 540.5918 L -254.98438 540.5918 L -254.98438 466.89062 L -278.16211 466.89062 z M -202.49609 485.90234 C -194.16242 485.90234 -191.55859 494.7569 -191.55859 501.26758 C -193.642 503.87186 -197.67684 508.42902 -203.79688 508.68945 C -211.60969 508.81966 -214.21548 502.17794 -214.3457 497.09961 C -214.47591 490.84936 -209.13698 485.90234 -202.49609 485.90234 z "
       d="m -494.47266,465.32812 c -20.31332,0 -39.97656,19.53141 -39.97656,47.91797 0,28.12614 18.09934,45.83594 40.88672,45.83594 10.02645,0 18.10014,-4.55709 20.96484,-9.375 l 4.03711,8.20313 h 26.04297 v -32.55469 h 5.20899 v -13.93164 h -43.23243 v 13.93164 h 7.94336 v 5.4707 c -1.9532,3.38555 -5.07783,6.37891 -12.5,6.37891 -11.32859,0 -17.83984,-10.6772 -17.83984,-23.95899 0,-13.02136 7.29254,-24.48047 17.83984,-24.48047 7.6826,0 14.45311,5.98981 14.84375,16.53711 h 23.3086 v -38.41211 h -19.40235 l -2.73437,9.375 c -2.08342,-2.08341 -6.50966,-10.93749 -25.39063,-10.9375 z m 290.54493,0.13086 c -21.22481,0.65107 -33.72657,15.49474 -33.72657,32.94336 0,17.70905 13.80337,29.68817 30.47071,29.03711 6.90132,-0.26043 12.50116,-3.25506 15.88671,-6.64062 0.13023,11.4588 -6.2509,17.44856 -15.88671,17.70898 -7.94303,0 -14.58446,-4.03635 -19.01172,-6.64062 l -8.85352,16.92773 c 7.6826,6.51068 22.00616,10.54754 30.73047,10.28711 34.24618,-1.04171 39.58531,-33.07472 39.06445,-52.86719 -0.78128,-26.04272 -17.31879,-41.40692 -38.67382,-40.75586 z m -408.56836,1.43164 v 17.1875 h 7.16211 v 56.51368 h -7.16211 v 17.31836 h 72.91992 v -33.85547 h -21.875 V 540.5918 H -578.25 v -56.51368 h 6.90234 v -17.1875 z m 180.44531,0 v 16.79688 h 6.90234 v 57.42383 h -7.03125 v 16.79883 h 35.28711 v -16.79883 h -7.42187 v -51.30274 h 0.52148 c 0.39065,6.51068 2.08331,13.93286 2.73438,16.14649 l 14.58398,51.95508 h 27.21484 l 13.67188,-50.6543 c 0.9115,-2.99491 2.73368,-11.58766 3.77539,-17.44727 h 0.52148 v 7.68164 43.49219 h -7.29296 v 16.92774 h 41.14843 v -16.92774 h -7.16211 V 483.6875 h 7.16211 v -16.79688 h -49.61133 l -12.5,48.69922 -13.15234,-48.69922 z m 153.88867,0 c -9.50559,11.3286 -15.36493,13.41262 -22.78711,17.0586 l 5.99024,14.45312 13.02148,-6.12109 v 48.31055 h -13.02148 v 17.31836 H -242.875 V 540.5918 h -12.10938 v -73.70118 z m 75.66602,19.01172 c 8.33367,0 10.9375,8.85456 10.9375,15.36524 -2.08341,2.60428 -6.11825,7.16144 -12.23829,7.42187 -7.81281,0.13021 -10.4186,-6.51151 -10.54882,-11.58984 -0.13021,-6.25025 5.20872,-11.19727 11.84961,-11.19727 z" />
    <path
       inkscape:connector-curvature="0"
       d="m 826.58399,548.79477 c 7.6826,6.51068 22.0061,10.5473 30.73041,10.28687 34.24618,-1.04171 39.58494,-33.07425 39.06408,-52.86672 -0.78128,-26.04272 -17.31841,-41.40792 -38.67344,-40.75686 -21.22481,0.65107 -33.72532,15.49542 -33.72532,32.94404 0,17.70905 13.80264,29.6887 30.46998,29.03764 6.90132,-0.26043 12.50051,-3.25534 15.88606,-6.6409 0.13022,11.4588 -6.25025,17.44863 -15.88606,17.70905 -7.94303,0 -14.58392,-4.03662 -19.01118,-6.64089 z m 31.25127,-40.10579 c -7.81282,0.13021 -10.41709,-6.51068 -10.54731,-11.58901 -0.13021,-6.25025 5.20855,-11.19837 11.84944,-11.19837 8.33367,0 10.93794,8.85452 10.93794,15.3652 -2.08341,2.60428 -6.12003,7.16175 -12.24007,7.42218 z m -91.16173,-10.28688 13.02136,-6.12004 v 48.30925 h -13.02136 v 17.31841 h 52.08544 V 540.59131 H 806.6491 v -73.7009 h -23.17802 c -9.50559,11.32859 -15.3652,13.412 -22.78738,17.05798 z m -46.33163,-8.59409 v 7.6826 43.49134 h -7.29196 v 16.92777 h 41.1475 v -16.92777 h -7.16175 v -57.29398 h 7.16175 v -16.79756 h -49.61138 l -12.50051,48.69989 -13.15157,-48.69989 h -49.35096 v 16.79756 h 6.90132 v 57.42419 h -7.03153 v 16.79756 h 35.28789 v -16.79756 h -7.42218 v -51.30415 h 0.52085 c 0.39065,6.51068 2.08342,13.93285 2.73449,16.14648 l 14.58392,51.95523 h 27.21465 l 13.67242,-50.65309 c 0.9115,-2.99491 2.73449,-11.58901 3.7762,-17.44862 z m -127.26957,68.10171 h 26.04272 v -32.5534 h 5.20855 v -13.93286 h -43.23092 v 13.93286 h 7.94303 v 5.46897 c -1.9532,3.38555 -5.07833,6.38047 -12.5005,6.38047 -11.32859,0 -17.83927,-10.67752 -17.83927,-23.95931 0,-13.02136 7.29197,-24.48015 17.83927,-24.48015 7.6826,0 14.45371,5.98982 14.84435,16.53712 h 23.30823 v -38.41301 h -19.40182 l -2.73449,9.37538 c -2.08342,-2.08342 -6.51068,-10.93794 -25.39165,-10.93794 -20.31332,0 -39.97558,19.53204 -39.97558,47.9186 0,28.12614 18.09969,45.83519 40.88707,45.83519 10.02645,0 18.09969,-4.55747 20.96439,-9.37538 z M 449.13751,466.89041 v 17.1882 h 7.1617 v 56.5127 h -7.1617 v 17.31841 h 72.91958 v -33.85554 h -21.87588 v 16.53713 h -16.79756 v -56.5127 h 6.90132 v -17.1882 z"
       style="font-style:normal;font-variant:normal;font-weight:normal;font-stretch:normal;font-size:40px;line-height:0%;font-family:ChunkFive;-inkscape-font-specification:ChunkFive;letter-spacing:0px;word-spacing:0px;fill:#ffffff;stroke-width:3.25534"
       id="path975-2"
       inkscape:path-effect="#path-effect1063"
       inkscape:original-d="m 826.58399,548.79477 c 7.6826,6.51068 22.0061,10.5473 30.73041,10.28687 34.24618,-1.04171 39.58494,-33.07425 39.06408,-52.86672 -0.78128,-26.04272 -17.31841,-41.40792 -38.67344,-40.75686 -21.22481,0.65107 -33.72532,15.49542 -33.72532,32.94404 0,17.70905 13.80264,29.6887 30.46998,29.03764 6.90132,-0.26043 12.50051,-3.25534 15.88606,-6.6409 0.13022,11.4588 -6.25025,17.44863 -15.88606,17.70905 -7.94303,0 -14.58392,-4.03662 -19.01118,-6.64089 z m 31.25127,-40.10579 c -7.81282,0.13021 -10.41709,-6.51068 -10.54731,-11.58901 -0.13021,-6.25025 5.20855,-11.19837 11.84944,-11.19837 8.33367,0 10.93794,8.85452 10.93794,15.3652 -2.08341,2.60428 -6.12003,7.16175 -12.24007,7.42218 z m -91.16173,-10.28688 13.02136,-6.12004 v 48.30925 h -13.02136 v 17.31841 h 52.08544 V 540.59131 H 806.6491 v -73.7009 h -23.17802 c -9.50559,11.32859 -15.3652,13.412 -22.78738,17.05798 z m -46.33163,-8.59409 v 7.6826 43.49134 h -7.29196 v 16.92777 h 41.1475 v -16.92777 h -7.16175 v -57.29398 h 7.16175 v -16.79756 h -49.61138 l -12.50051,48.69989 -13.15157,-48.69989 h -49.35096 v 16.79756 h 6.90132 v 57.42419 h -7.03153 v 16.79756 h 35.28789 v -16.79756 h -7.42218 v -51.30415 h 0.52085 c 0.39065,6.51068 2.08342,13.93285 2.73449,16.14648 l 14.58392,51.95523 h 27.21465 l 13.67242,-50.65309 c 0.9115,-2.99491 2.73449,-11.58901 3.7762,-17.44862 z m -127.26957,68.10171 h 26.04272 v -32.5534 h 5.20855 v -13.93286 h -43.23092 v 13.93286 h 7.94303 v 5.46897 c -1.9532,3.38555 -5.07833,6.38047 -12.5005,6.38047 -11.32859,0 -17.83927,-10.67752 -17.83927,-23.95931 0,-13.02136 7.29197,-24.48015 17.83927,-24.48015 7.6826,0 14.45371,5.98982 14.84435,16.53712 h 23.30823 v -38.41301 h -19.40182 l -2.73449,9.37538 c -2.08342,-2.08342 -6.51068,-10.93794 -25.39165,-10.93794 -20.31332,0 -39.97558,19.53204 -39.97558,47.9186 0,28.12614 18.09969,45.83519 40.88707,45.83519 10.02645,0 18.09969,-4.55747 20.96439,-9.37538 z M 449.13751,466.89041 v 17.1882 h 7.1617 v 56.5127 h -7.1617 v 17.31841 h 72.91958 v -33.85554 h -21.87588 v 16.53713 h -16.79756 v -56.5127 h 6.90132 v -17.1882 z" />
  </g>
</svg>
