<?xml version="1.0" encoding="UTF-8" standalone="no"?>
<!-- Created with Inkscape (http://www.inkscape.org/) -->

<svg
   xmlns:dc="http://purl.org/dc/elements/1.1/"
   xmlns:cc="http://creativecommons.org/ns#"
   xmlns:rdf="http://www.w3.org/1999/02/22-rdf-syntax-ns#"
   xmlns:svg="http://www.w3.org/2000/svg"
   xmlns="http://www.w3.org/2000/svg"
   xmlns:sodipodi="http://sodipodi.sourceforge.net/DTD/sodipodi-0.dtd"
   xmlns:inkscape="http://www.inkscape.org/namespaces/inkscape"
   inkscape:version="0.92.4 (5da689c313, 2019-01-14)"
   sodipodi:docname="scape-about.svg"
   id="svg8"
   version="1.1"
   viewBox="0 0 198.4375 165.36459"
   height="625"
   width="750">
  <title
     id="title6676">About - Raghed</title>
  <defs
     id="defs2">
    <meshgradient
       inkscape:collect="always"
       id="meshgradient2925"
       gradientUnits="userSpaceOnUse"
       x="14.759313"
       y="15.499908"
       gradientTransform="translate(0,-16.305511)">
      <meshrow
         id="meshrow2927">
        <meshpatch
           id="meshpatch2929">
          <stop
             path="c 121.305,0  242.61,0  363.915,0"
             style="stop-color:#202935;stop-opacity:1"
             id="stop2931" />
          <stop
             path="c 0,119.71  0,239.419  0,359.129"
             style="stop-color:#142ee9;stop-opacity:1"
             id="stop2933" />
          <stop
             path="c -121.305,0  -242.61,0  -363.915,0"
             style="stop-color:#6c7791;stop-opacity:1"
             id="stop2935" />
          <stop
             path="c 0,-119.71  0,-239.419  0,-359.129"
             style="stop-color:#5e719f;stop-opacity:1"
             id="stop2937" />
        </meshpatch>
      </meshrow>
    </meshgradient>
  </defs>
  <sodipodi:namedview
     id="base"
     pagecolor="#ffffff"
     bordercolor="#666666"
     borderopacity="1.0"
     inkscape:pageopacity="0.0"
     inkscape:pageshadow="2"
     inkscape:zoom="5.6"
     inkscape:cx="546.67103"
     inkscape:cy="112.46964"
     inkscape:document-units="mm"
     inkscape:current-layer="layer1"
     showgrid="false"
     units="px"
     inkscape:window-width="1366"
     inkscape:window-height="705"
     inkscape:window-x="-8"
     inkscape:window-y="-8"
     inkscape:window-maximized="1"
     inkscape:snap-page="true"
     inkscape:showpageshadow="false"
     borderlayer="true"
     inkscape:snap-nodes="true"
     showguides="false" />
  <metadata
     id="metadata5">
    <rdf:RDF>
      <cc:Work
         rdf:about="">
        <dc:format>image/svg+xml</dc:format>
        <dc:type
           rdf:resource="http://purl.org/dc/dcmitype/StillImage" />
        <dc:title>About - Raghed</dc:title>
        <cc:license
           rdf:resource="http://creativecommons.org/licenses/by-sa/4.0/" />
        <dc:date />
        <dc:creator>
          <cc:Agent>
            <dc:title>Raghed</dc:title>
          </cc:Agent>
        </dc:creator>
      </cc:Work>
      <cc:License
         rdf:about="http://creativecommons.org/licenses/by-sa/4.0/">
        <cc:permits
           rdf:resource="http://creativecommons.org/ns#Reproduction" />
        <cc:permits
           rdf:resource="http://creativecommons.org/ns#Distribution" />
        <cc:requires
           rdf:resource="http://creativecommons.org/ns#Notice" />
        <cc:requires
           rdf:resource="http://creativecommons.org/ns#Attribution" />
        <cc:permits
           rdf:resource="http://creativecommons.org/ns#DerivativeWorks" />
        <cc:requires
           rdf:resource="http://creativecommons.org/ns#ShareAlike" />
      </cc:License>
    </rdf:RDF>
  </metadata>
  <g
     inkscape:label="Layer 1"
     inkscape:groupmode="layer"
     id="layer1"
     transform="translate(0,-131.6354)">
    <rect
       style="fill:#ffffff;fill-opacity:1;stroke:none;stroke-width:0.26458332;stroke-opacity:1"
       id="rect6672"
       width="198.4375"
       height="165.36458"
       x="0"
       y="131.63541"
       rx="0"
       ry="0" />
    <g
       transform="matrix(0.10311441,0,0,0.10311441,102.83992,141.33448)"
       id="g7508">
      <path
         d="m 200.67967,777.90068 q -2.83434,0 -2.83434,-3.98341 0,-3.98341 4.13661,-8.88606 6.89436,-8.27323 19.151,-9.5755 l 4.21322,-0.22981 q 13.94193,0 20.22346,11.10758 3.7536,6.81775 3.7536,15.70382 0,3.67699 -0.61284,7.737 -2.22151,13.63551 -10.57135,23.13441 -9.19248,10.49475 -21.44912,10.49475 -12.18004,0 -15.47401,-6.81776 -0.99585,-2.14491 -0.99585,-4.51963 0,-2.45133 1.30227,-5.13247 2.52793,-4.90266 6.89436,-4.90266 0.38302,0 0.45962,0.45963 0.15321,0.38302 -0.0766,0.84264 -0.15321,0.45962 -0.53623,0.45962 -2.60454,0 -4.51964,3.37058 -1.22566,2.37472 -1.22566,4.36643 0,1.9917 0.76604,3.67699 2.45133,5.20907 11.72041,5.20907 10.49475,0 18.9978,-10.72456 7.6604,-9.6521 9.88191,-22.67478 0.76604,-4.21322 0.76604,-7.96682 0,-8.34984 -3.75359,-14.09514 -4.97926,-7.737 -15.62722,-7.737 -13.3291,0 -19.99365,8.96267 -3.37057,4.59624 -3.37057,8.57965 0,1.60868 0.68943,1.60868 -0.45962,1.53208 -1.9151,1.53208 z m 11.03098,29.03292 q 0,-11.64381 2.06831,-22.59818 2.06831,-11.03098 5.05586,-17.38911 3.06416,-6.43474 5.89851,-6.43474 1.22566,0 1.22566,1.22567 -3.44718,7.12417 -6.05171,18.99779 -4.82605,21.67893 -4.82605,31.33104 0,0.99585 -1.07246,0.99585 -2.29812,0 -2.29812,-6.12832 z"
         style="font-style:normal;font-variant:normal;font-weight:normal;font-stretch:normal;font-size:medium;line-height:100%;font-family:'Euphoria Script';-inkscape-font-specification:'Euphoria Script';letter-spacing:0px;word-spacing:0px;fill:#000000;fill-opacity:1;stroke:none;stroke-width:0.49872401px;stroke-linecap:butt;stroke-linejoin:miter;stroke-opacity:1"
         id="path7108"
         inkscape:connector-curvature="0" />
      <path
         d="m 279.08477,792.53205 q -2.91095,0 -2.91095,-6.35814 0,-3.60038 1.37887,-6.74115 -5.20907,4.51964 -11.64381,16.85288 -6.43473,12.25664 -6.43473,16.01024 0,0.91925 -1.22567,0.91925 -2.22151,0 -2.22151,-6.05172 0,-11.414 2.29812,-20.68308 2.29812,-9.26908 5.59209,-9.26908 1.45547,0 1.45547,1.68528 -3.52378,11.18419 -5.05586,22.9046 h 0.53623 q 6.20492,-14.32495 13.71211,-22.36837 4.28983,-4.59624 7.81361,-4.59624 0.76604,0 1.22567,0.45963 0.53622,0.45962 0.53622,1.14906 -0.53622,0.53622 -1.30226,1.60868 -0.76604,1.07246 -2.06831,5.13247 -1.30227,3.98341 -1.30227,8.73285 0,0.61284 -0.38302,0.61284 z"
         style="font-style:normal;font-variant:normal;font-weight:normal;font-stretch:normal;font-size:medium;line-height:100%;font-family:'Euphoria Script';-inkscape-font-specification:'Euphoria Script';letter-spacing:0px;word-spacing:0px;fill:#000000;fill-opacity:1;stroke:none;stroke-width:0.49872401px;stroke-linecap:butt;stroke-linejoin:miter;stroke-opacity:1"
         id="path7110"
         inkscape:connector-curvature="0" />
      <path
         d="m 290.52181,814.5174 q -6.28153,0 -6.28153,-9.88192 0,-5.89851 2.91095,-12.94608 4.06002,-9.88191 10.64796,-13.4823 2.83435,-1.53208 5.28568,-1.53208 2.45133,0 3.8302,1.07245 1.45547,1.07246 1.83849,2.14492 l 0.45963,0.99585 q -0.22981,1.30227 -1.30227,1.30227 -1.22566,0 -1.45548,-0.53623 -0.1532,-0.61283 -0.38302,-0.99585 -0.22981,-0.45963 -1.07245,-1.14906 -0.84265,-0.76604 -1.9151,-0.76604 -4.97926,0 -9.03928,8.96266 -4.59624,10.34154 -4.59624,19.45742 0,4.59624 1.8385,4.59624 1.45548,0 4.06001,-3.21737 2.68114,-3.29397 5.5921,-8.19663 5.05586,-8.42644 8.19662,-14.63136 2.60454,-5.51549 5.36228,-5.51549 1.45548,0 1.45548,1.76189 -0.68944,1.45548 -1.76189,4.13662 -1.07246,2.68114 -2.83435,10.64796 -1.76189,7.96681 -1.76189,15.85702 0,7.89022 2.37472,7.89022 0.91925,0 1.68529,-0.84265 0.76604,-0.76604 1.37887,-2.37472 0.22981,-0.84264 1.07246,-0.84264 0.30641,0 0.45962,0.22981 0.15321,0.22981 0,0.76604 -0.15321,0.53623 -0.53623,1.45547 -0.38302,0.99586 -1.68528,2.60454 -1.22567,1.60868 -2.60454,1.60868 -3.21737,0 -4.97926,-4.21322 -1.68529,-4.21322 -1.68529,-9.95852 0,-5.7453 0.84265,-11.03097 h -0.76604 q -9.72871,16.62307 -14.63137,16.62307 z"
         style="font-style:normal;font-variant:normal;font-weight:normal;font-stretch:normal;font-size:medium;line-height:100%;font-family:'Euphoria Script';-inkscape-font-specification:'Euphoria Script';letter-spacing:0px;word-spacing:0px;fill:#000000;fill-opacity:1;stroke:none;stroke-width:0.49872401px;stroke-linecap:butt;stroke-linejoin:miter;stroke-opacity:1"
         id="path7112"
         inkscape:connector-curvature="0" />
      <path
         d="m 362.26266,779.81578 q 2.22151,1.68529 4.21322,1.68529 2.0683,0 2.91095,-0.53623 0,0.99585 -0.91925,1.9151 -0.84264,0.84265 -2.52793,0.84265 -1.60869,0 -3.52379,-0.76604 -0.1532,7.20077 -2.37472,14.78457 -2.22152,7.50719 -5.7453,12.63966 -3.52378,5.05586 -6.97096,5.05586 -3.44718,0 -5.28568,-2.68114 -1.9151,-2.98755 -1.9151,-8.50304 0,-3.14077 0.38302,-6.74115 -9.4989,17.00609 -14.63137,17.00609 -5.05586,0 -5.05586,-8.57965 0,-8.88607 4.36643,-18.9978 3.67699,-8.04342 6.74115,-8.42644 1.45548,0 1.45548,1.60869 -0.91925,2.22151 -2.29812,5.7453 -1.37888,3.44718 -3.677,11.10758 -2.22151,7.6604 -2.22151,11.33739 0,3.60039 1.60868,3.60039 1.99171,0 6.20493,-6.43474 4.28982,-6.43473 7.50719,-12.86947 l 3.29397,-6.35813 q 2.14491,-4.28983 3.8302,-4.28983 1.68529,0 1.68529,1.60869 -4.67284,16.01023 -4.67284,25.04951 0,4.21322 2.45132,4.21322 2.75775,0 5.7453,-4.51964 3.06416,-4.59624 5.05587,-11.87362 2.06831,-7.35398 2.06831,-14.47816 v -0.45962 q -2.22152,-1.60868 -3.60039,-3.8302 -1.37887,-2.22152 -1.37887,-3.29397 0,-1.14906 0.99585,-2.06831 0.99585,-0.91925 2.14491,-0.91925 1.45548,0 2.60454,2.60454 1.14906,2.52793 1.53208,5.8219 z"
         style="font-style:normal;font-variant:normal;font-weight:normal;font-stretch:normal;font-size:medium;line-height:100%;font-family:'Euphoria Script';-inkscape-font-specification:'Euphoria Script';letter-spacing:0px;word-spacing:0px;fill:#000000;fill-opacity:1;stroke:none;stroke-width:0.49872401px;stroke-linecap:butt;stroke-linejoin:miter;stroke-opacity:1"
         id="path7114"
         inkscape:connector-curvature="0" />
      <path
         d="m 402.86248,775.29615 q 0,5.66869 3.21737,6.05171 -0.22982,1.07246 -1.7619,1.07246 -3.14076,0 -4.44303,-3.8302 -0.61283,-1.76189 -0.61283,-4.28983 0,-2.60453 1.9917,-6.20492 4.51964,-8.34984 16.39326,-10.72456 4.06001,-0.76604 8.65625,-0.76604 4.67285,0 7.96682,-0.91925 3.29397,-0.91925 4.51964,-2.06831 3.21736,-2.98755 4.74944,-2.98755 1.53208,0 1.53208,0.91924 0,0.22982 0,0.45963 -0.53622,2.14491 -4.59624,4.06001 -2.45132,1.07246 -5.51548,1.68529 -2.52794,1.07245 -4.21323,5.89851 -1.68528,4.74944 -3.52378,13.78872 3.98341,-0.38302 6.58794,-0.38302 0.68944,0 0.61284,0.84264 -0.30642,0.91925 -1.60869,0.99585 -1.30227,0 -6.05171,0.76604 -3.60039,17.77213 -6.28153,25.12612 -6.74115,18.61477 -19.22761,18.61477 -8.96267,0 -11.18418,-8.19663 -0.84265,-2.83435 -0.84265,-5.6687 0,-5.36228 2.83435,-10.72456 4.28983,-8.19662 11.26079,-8.19662 0.99585,0 1.60869,0.45962 0.68943,0.45962 0.91924,1.37887 -6.58794,0 -10.87776,6.81776 -3.37058,5.28567 -3.37058,10.95437 0,8.27323 5.8219,10.11173 1.37888,0.38302 3.60039,0.38302 2.22152,0 4.67285,-1.30227 2.52793,-1.22566 4.51963,-4.59624 2.06831,-3.29397 3.37058,-5.51549 1.30227,-2.29812 2.98755,-8.12002 1.99171,-7.12417 3.37058,-13.17589 1.37887,-6.12832 1.68529,-7.35398 -4.28983,0.68943 -6.51134,0.68943 -2.14491,0 -2.45133,-1.9151 -0.0766,-1.53208 0.84264,-1.76189 0.38302,0.45962 2.37473,0.45962 2.06831,0 6.43473,-0.38302 1.9151,-7.50719 3.677,-12.18003 1.76189,-4.74945 4.13661,-7.20078 -1.22566,0.0766 -3.8302,0.0766 -14.70797,0 -20.60647,8.65626 -2.83435,4.06001 -2.83435,8.19663 z m 33.70576,15.70382 q 0,0.38302 -0.68944,0.38302 -0.68943,0 -1.37887,-0.30642 -0.61283,-0.30642 -0.61283,-0.84264 0,-7.81361 1.76189,-12.56306 1.76189,-4.82605 4.67285,-4.82605 0.76604,0 1.30226,0.53622 0.53623,0.53623 0.53623,1.45548 -3.44718,3.44718 -4.97926,10.26494 -0.61283,2.83435 -0.61283,5.89851 z"
         style="font-style:normal;font-variant:normal;font-weight:normal;font-stretch:normal;font-size:medium;line-height:100%;font-family:'Euphoria Script';-inkscape-font-specification:'Euphoria Script';letter-spacing:0px;word-spacing:0px;fill:#000000;fill-opacity:1;stroke:none;stroke-width:0.49872401px;stroke-linecap:butt;stroke-linejoin:miter;stroke-opacity:1"
         id="path7116"
         inkscape:connector-curvature="0" />
      <path
         d="m 465.91925,792.53205 q -2.91096,0 -2.91096,-6.35814 0,-3.60038 1.37888,-6.74115 -5.20908,4.51964 -11.64381,16.85288 -6.43474,12.25664 -6.43474,16.01024 0,0.91925 -1.22566,0.91925 -2.22152,0 -2.22152,-6.05172 0,-11.414 2.29812,-20.68308 2.29812,-9.26908 5.59209,-9.26908 1.45548,0 1.45548,1.68528 -3.52378,11.18419 -5.05586,22.9046 h 0.53622 q 6.20493,-14.32495 13.71212,-22.36837 4.28982,-4.59624 7.81361,-4.59624 0.76604,0 1.22566,0.45963 0.53623,0.45962 0.53623,1.14906 -0.53623,0.53622 -1.30227,1.60868 -0.76604,1.07246 -2.06831,5.13247 -1.30226,3.98341 -1.30226,8.73285 0,0.61284 -0.38302,0.61284 z"
         style="font-style:normal;font-variant:normal;font-weight:normal;font-stretch:normal;font-size:medium;line-height:100%;font-family:'Euphoria Script';-inkscape-font-specification:'Euphoria Script';letter-spacing:0px;word-spacing:0px;fill:#000000;fill-opacity:1;stroke:none;stroke-width:0.49872401px;stroke-linecap:butt;stroke-linejoin:miter;stroke-opacity:1"
         id="path7118"
         inkscape:connector-curvature="0" />
      <path
         d="m 490.9918,777.36445 q 5.82191,0 5.82191,6.81776 0,3.9068 -2.60454,8.19663 -4.44303,7.12417 -11.79701,7.12417 -1.14906,0 -1.9151,-0.38302 -0.76604,-0.38302 -1.14907,-1.14906 5.43889,0 9.95853,-6.28153 3.67699,-5.05586 3.67699,-9.26908 0,-3.14077 -2.52793,-3.14077 -5.05587,0 -9.4223,7.89022 -4.67284,8.57964 -4.67284,17.61892 0,7.6604 4.36643,9.19248 0.84264,0.30641 2.14491,0.30641 1.30227,0 2.75774,-0.61283 1.45548,-0.68944 2.45133,-1.60868 1.99171,-1.8385 3.29397,-4.06002 0.30642,-0.61283 1.14906,-0.61283 1.37888,0 1.30227,0.45963 -0.22981,0.84264 -1.76189,2.83434 -1.45548,1.99171 -2.75774,3.21737 -1.22567,1.14906 -3.29398,2.06831 -1.9917,0.99585 -4.06001,0.99585 -8.12002,0 -10.34154,-7.6604 -0.68944,-2.60453 -0.68944,-5.36228 0,-5.13247 2.37473,-11.18418 3.75359,-9.19248 10.34154,-13.25249 3.60039,-2.14492 7.35398,-2.14492 z"
         style="font-style:normal;font-variant:normal;font-weight:normal;font-stretch:normal;font-size:medium;line-height:100%;font-family:'Euphoria Script';-inkscape-font-specification:'Euphoria Script';letter-spacing:0px;word-spacing:0px;fill:#000000;fill-opacity:1;stroke:none;stroke-width:0.49872401px;stroke-linecap:butt;stroke-linejoin:miter;stroke-opacity:1"
         id="path7120"
         inkscape:connector-curvature="0" />
      <path
         d="m 520.72822,777.36445 q 5.82191,0 5.82191,6.81776 0,3.9068 -2.60454,8.19663 -4.44303,7.12417 -11.79702,7.12417 -1.14906,0 -1.9151,-0.38302 -0.76604,-0.38302 -1.14906,-1.14906 5.43889,0 9.95853,-6.28153 3.67699,-5.05586 3.67699,-9.26908 0,-3.14077 -2.52793,-3.14077 -5.05587,0 -9.4223,7.89022 -4.67284,8.57964 -4.67284,17.61892 0,7.6604 4.36643,9.19248 0.84264,0.30641 2.14491,0.30641 1.30227,0 2.75774,-0.61283 1.45548,-0.68944 2.45133,-1.60868 1.99171,-1.8385 3.29397,-4.06002 0.30642,-0.61283 1.14906,-0.61283 1.37888,0 1.30227,0.45963 -0.22981,0.84264 -1.76189,2.83434 -1.45548,1.99171 -2.75774,3.21737 -1.22567,1.14906 -3.29398,2.06831 -1.9917,0.99585 -4.06001,0.99585 -8.12002,0 -10.34154,-7.6604 -0.68944,-2.60453 -0.68944,-5.36228 0,-5.13247 2.37473,-11.18418 3.75359,-9.19248 10.34154,-13.25249 3.60039,-2.14492 7.35398,-2.14492 z"
         style="font-style:normal;font-variant:normal;font-weight:normal;font-stretch:normal;font-size:medium;line-height:100%;font-family:'Euphoria Script';-inkscape-font-specification:'Euphoria Script';letter-spacing:0px;word-spacing:0px;fill:#000000;fill-opacity:1;stroke:none;stroke-width:0.49872401px;stroke-linecap:butt;stroke-linejoin:miter;stroke-opacity:1"
         id="path7122"
         inkscape:connector-curvature="0" />
      <path
         d="m 541.65518,825.70158 q -4.44303,0 -6.58794,-4.67284 -2.06831,-4.67285 -2.06831,-14.01854 0,-9.34569 2.75774,-22.13855 2.75775,-12.79287 6.43474,-21.21931 3.7536,-8.42644 6.51134,-8.42644 1.30227,0 1.30227,1.53208 -1.60869,3.67699 -4.06001,11.10758 -2.45133,7.35398 -4.13662,13.63551 -1.60868,6.28153 -2.98756,14.70797 -1.30226,8.42644 -1.30226,14.47815 0,5.97512 1.14906,9.19249 1.22566,3.29397 3.29397,3.29397 1.76189,0 3.37057,-1.68529 1.60869,-1.60868 2.29812,-3.21737 0.38302,-0.84264 1.37888,-0.45962 0.38302,0.15321 0.1532,0.61283 -0.1532,0.53623 -0.61283,1.30227 -0.38302,0.76604 -1.45547,2.37472 -2.29812,3.60039 -5.43889,3.60039 z"
         style="font-style:normal;font-variant:normal;font-weight:normal;font-stretch:normal;font-size:medium;line-height:100%;font-family:'Euphoria Script';-inkscape-font-specification:'Euphoria Script';letter-spacing:0px;word-spacing:0px;fill:#000000;fill-opacity:1;stroke:none;stroke-width:0.49872401px;stroke-linecap:butt;stroke-linejoin:miter;stroke-opacity:1"
         id="path7124"
         inkscape:connector-curvature="0" />
      <path
         d="m 552.73761,838.49445 q 6.89436,0 10.80116,-6.51134 3.37058,-5.7453 5.20908,-14.32495 -13.86533,0.30642 -21.29592,10.57135 -0.45962,0.68944 -1.45547,0.22981 -0.53623,-0.30641 -0.30642,-0.76604 3.29397,-4.97926 9.19248,-8.50304 5.89851,-3.44718 14.32495,-3.7536 0.84264,-3.8302 1.60868,-8.96267 0.76604,-5.13246 1.7619,-9.95852 h -0.68944 q -9.95852,17.69553 -15.16759,17.69553 -5.82191,0 -5.82191,-8.96267 0,-8.96267 3.8302,-18.00194 3.8302,-9.11588 6.97097,-9.80531 l 0.45962,-0.0766 q 1.30227,0 1.30227,1.68529 -0.84264,2.06831 -2.14491,5.43889 -1.30227,3.29397 -3.44718,10.95437 -2.14491,7.58379 -2.14491,11.87362 0,4.21322 1.83849,4.21322 2.14491,0 6.89436,-7.43059 6.97097,-10.87777 12.10343,-22.06195 2.22152,-4.67285 4.74945,-4.67285 1.60869,0 1.60869,1.7619 -1.45548,2.68114 -3.52379,10.03512 -2.06831,7.35398 -3.37057,14.86118 -1.30227,7.43058 -2.22152,11.64381 5.8219,0.99585 6.74115,5.05586 0.15321,0.68944 0.15321,1.8385 0,1.22566 -0.91925,2.0683 -0.91925,0.91925 -1.60868,0.91925 0.15321,-0.53623 0.0766,-1.9151 -0.0766,-1.30227 -0.53623,-2.22151 -0.38302,-0.91925 -1.53208,-1.9151 -1.14906,-0.99586 -2.98755,-1.45548 -5.89851,22.21516 -20.45327,22.21516 -6.28153,0 -8.34984,-4.44303 -0.0766,-0.22981 -0.0766,-0.38302 0,-0.45963 0.84264,-0.61283 0.76604,-0.0766 1.14906,0.53622 1.37887,3.14077 6.43474,3.14077 z"
         style="font-style:normal;font-variant:normal;font-weight:normal;font-stretch:normal;font-size:medium;line-height:100%;font-family:'Euphoria Script';-inkscape-font-specification:'Euphoria Script';letter-spacing:0px;word-spacing:0px;fill:#000000;fill-opacity:1;stroke:none;stroke-width:0.49872401px;stroke-linecap:butt;stroke-linejoin:miter;stroke-opacity:1"
         id="path7126"
         inkscape:connector-curvature="0" />
      <path
         d="m 592.1019,815.05362 q -1.60869,0 -1.60869,-2.98755 0,-1.8385 0.99586,-3.90681 0.99585,-2.06831 2.83434,-2.06831 1.53208,0 1.53208,1.7619 0,1.76189 -2.83434,5.8985 z"
         style="font-style:normal;font-variant:normal;font-weight:normal;font-stretch:normal;font-size:medium;line-height:100%;font-family:'Euphoria Script';-inkscape-font-specification:'Euphoria Script';letter-spacing:0px;word-spacing:0px;fill:#000000;fill-opacity:1;stroke:none;stroke-width:0.49872401px;stroke-linecap:butt;stroke-linejoin:miter;stroke-opacity:1"
         id="path7128"
         inkscape:connector-curvature="0" />
    </g>
    <g
       transform="matrix(0.10311441,0,0,0.10311441,102.83992,141.33448)"
       id="g7498">
      <path
         d="m 139.06411,694.98079 c -0.24215,-9.92803 -0.36322,-15.49741 -0.36322,-25.54651 0,-10.0491 0,-15.9817 0.36322,-26.15187 0.24215,-10.0491 1.93718,-10.41232 10.41232,-11.01769 0.72644,-0.72644 0.72644,-2.05825 0,-2.78469 -4.47972,0.24215 -11.98628,0.60537 -15.61848,0.60537 -3.6322,0 -11.8652,-0.36322 -15.73955,-0.60537 -0.72644,0.72644 -0.72644,2.05825 0,2.78469 8.47514,0.72644 10.41232,0.96859 10.65446,11.01769 0.24215,10.0491 0.36322,15.9817 0.36322,26.0308 0,10.0491 -0.12107,15.61848 -0.36322,25.66758 -0.24214,10.04909 -2.17932,10.65446 -10.65446,11.01768 -0.72644,0.72644 -0.72644,2.05825 0,2.78469 4.72186,-0.24214 12.10735,-0.60536 15.73955,-0.60536 3.6322,0 10.65447,0.24214 15.61848,0.60536 0.72644,-0.72644 0.72644,-2.05825 0,-2.78469 -8.47514,-0.36322 -10.17017,-0.96859 -10.41232,-11.01768 z"
         style="font-style:normal;font-variant:normal;font-weight:normal;font-stretch:normal;font-size:121.07348633px;line-height:100%;font-family:'Linux Libertine Display O';-inkscape-font-specification:'Linux Libertine Display O';letter-spacing:0px;word-spacing:0px;fill:#000000;fill-opacity:1;stroke:none;stroke-width:0.90805119px;stroke-linecap:butt;stroke-linejoin:miter;stroke-opacity:1"
         id="path7131"
         inkscape:connector-curvature="0" />
      <path
         d="m 222.38348,644.61422 0.12107,42.01249 c 0,2.3004 -0.60537,3.63221 -1.45288,3.63221 -0.96859,0 -2.3004,-2.17932 -5.81153,-6.65904 l -41.5282,-53.51448 -15.61848,-0.24215 c -0.72645,0.72644 -0.72645,2.05825 0,2.78469 5.81152,0.36322 8.83836,4.23757 10.17017,8.95944 l -0.12108,52.0616 c 0,10.77554 -2.05824,11.50198 -10.53339,12.34949 -0.72644,0.72644 -0.72644,2.05825 0,2.78469 5.9326,-0.12107 7.99085,-0.60536 13.07594,-0.60536 5.08508,0 6.90119,0.48429 12.95486,0.60536 0.72644,-0.72644 0.72644,-2.05825 0,-2.78469 -8.47514,-0.84751 -10.53339,-1.33181 -10.53339,-12.34949 l -0.12108,-38.62245 c 0,-4.11649 0.60537,-5.9326 1.57396,-5.9326 0.72644,0 2.05825,1.33181 4.1165,3.99543 l 42.25465,53.39341 c 1.3318,1.8161 2.90576,2.90576 4.84293,2.90576 1.69503,0 1.45289,-1.45288 1.45289,-3.75328 l 0.12107,-61.02103 c 0,-10.77555 2.05825,-11.50199 10.53339,-12.3495 0.72644,-0.72644 0.72644,-2.05825 0,-2.78469 -5.9326,0.12107 -7.99085,0.60537 -13.07593,0.60537 -5.08509,0 -6.90119,-0.4843 -12.95487,-0.60537 -0.72644,0.72644 -0.72644,2.05825 0,2.78469 8.47515,0.84751 10.5334,1.33181 10.5334,12.3495 z"
         style="font-style:normal;font-variant:normal;font-weight:normal;font-stretch:normal;font-size:121.07348633px;line-height:100%;font-family:'Linux Libertine Display O';-inkscape-font-specification:'Linux Libertine Display O';letter-spacing:0px;word-spacing:0px;fill:#000000;fill-opacity:1;stroke:none;stroke-width:0.90805119px;stroke-linecap:butt;stroke-linejoin:miter;stroke-opacity:1"
         id="path7133"
         inkscape:connector-curvature="0" />
      <path
         d="m 265.81292,694.98079 c -0.24215,-9.68588 -0.36322,-15.25526 -0.36322,-24.82007 4.23757,0.12107 8.47514,2.05825 11.01769,5.20616 l 19.00853,23.97255 c 2.42147,3.14791 4.1165,6.78012 4.35865,8.71729 0,0.36322 0.12107,0.72644 0.60537,0.72644 2.42147,-0.12107 2.17932,-0.60536 5.81152,-0.60536 4.72187,0 7.74871,0.48429 13.43916,0.60536 0.72644,-0.72644 0.72644,-2.05825 0,-2.78469 -2.17932,-0.36322 -7.7487,-1.57395 -11.8652,-6.65904 l -26.51509,-31.47911 c -0.96859,-1.08966 -1.57396,-2.05824 -1.57396,-3.02683 0,-0.84752 0.12107,-1.69503 4.23757,-5.9326 l 17.79781,-18.2821 c 5.56938,-5.9326 11.62305,-7.7487 16.46599,-8.35407 0.72644,-0.72644 0.72644,-2.05825 0,-2.78469 -5.69045,0.12107 -7.86978,0.60537 -12.71272,0.60537 -4.84294,0 -8.59621,-0.4843 -14.28667,-0.60537 -0.72644,0.72644 -0.72644,2.05825 0,2.78469 4.35865,0.36322 9.56481,2.42147 4.60079,7.86978 l -19.37175,21.30893 c -2.54255,2.78469 -6.53797,4.96401 -11.01769,5.32723 0,-8.47514 0.12107,-14.28667 0.36322,-23.48825 0.24215,-10.0491 2.05825,-10.65447 10.53339,-11.01769 0.72644,-0.72644 0.72644,-2.05825 0,-2.78469 -5.9326,0.12107 -9.68588,0.60537 -15.86062,0.60537 -6.05368,0 -9.44374,-0.4843 -15.49741,-0.60537 -0.72644,0.72644 -0.72644,2.05825 0,2.78469 8.47514,0.36322 10.17017,0.96859 10.41232,11.01769 0.24215,10.0491 0.48429,15.9817 0.48429,26.0308 0,10.0491 -0.24214,15.61848 -0.48429,25.66758 -0.24215,10.04909 -1.93718,10.65446 -10.41232,11.01768 -0.72644,0.72644 -0.72644,2.05825 0,2.78469 5.9326,-0.12107 9.56481,-0.60536 15.73955,-0.60536 6.05368,0 9.56481,0.48429 15.61848,0.60536 0.72644,-0.72644 0.72644,-2.05825 0,-2.78469 -8.47514,-0.36322 -10.29124,-0.96859 -10.53339,-11.01768 z"
         style="font-style:normal;font-variant:normal;font-weight:normal;font-stretch:normal;font-size:121.07348633px;line-height:100%;font-family:'Linux Libertine Display O';-inkscape-font-specification:'Linux Libertine Display O';letter-spacing:0px;word-spacing:0px;fill:#000000;fill-opacity:1;stroke:none;stroke-width:0.90805119px;stroke-linecap:butt;stroke-linejoin:miter;stroke-opacity:1"
         id="path7135"
         inkscape:connector-curvature="0" />
      <path
         d="m 368.54187,631.78043 c -7.02226,-0.96859 -6.65904,-3.26899 -18.52424,-3.26899 -12.22842,0 -23.00396,8.11192 -23.00396,20.94571 0,11.38091 7.99085,16.82922 17.43458,20.82464 7.62763,3.39006 20.21927,6.05368 20.21927,19.85606 0,9.80695 -5.81152,16.10277 -15.37633,16.10277 -11.38091,0 -19.85605,-6.29582 -22.51967,-18.40317 -1.45288,-0.48429 -1.57395,-0.24215 -2.66362,0.36322 0.4843,9.32266 0.96859,12.47057 2.42147,18.40317 7.62763,0 10.89662,2.78469 21.67216,2.78469 5.56938,0 10.77554,-1.33181 15.01311,-3.87435 6.90119,-4.35865 11.38091,-11.8652 11.38091,-19.61391 0,-11.50198 -7.86978,-16.95028 -16.70814,-20.70356 -5.81153,-2.42147 -22.51967,-7.14334 -22.51967,-19.00854 0,-6.78011 6.41689,-14.77096 13.43916,-14.77096 11.8652,0 16.82921,8.71729 19.25068,16.70814 1.33181,0 1.57396,0.12107 2.66362,-0.72644 -0.36322,-5.81153 -0.84752,-9.20159 -2.17933,-15.61848 z"
         style="font-style:normal;font-variant:normal;font-weight:normal;font-stretch:normal;font-size:121.07348633px;line-height:100%;font-family:'Linux Libertine Display O';-inkscape-font-specification:'Linux Libertine Display O';letter-spacing:0px;word-spacing:0px;fill:#000000;fill-opacity:1;stroke:none;stroke-width:0.90805119px;stroke-linecap:butt;stroke-linejoin:miter;stroke-opacity:1"
         id="path7137"
         inkscape:connector-curvature="0" />
      <path
         d="m 421.98069,709.38853 c 11.74413,0 23.7304,-5.56938 31.9634,-16.34492 -0.60537,-1.08966 -1.45288,-1.8161 -2.78469,-1.8161 -8.59622,9.44373 -16.82922,13.19701 -28.08905,13.19701 -18.76639,0 -28.21012,-19.00854 -28.21012,-36.68527 0,-19.73498 12.59164,-35.95882 27.8469,-35.95882 16.70814,0 23.85148,11.13876 26.99939,21.55108 1.08966,0.12107 1.8161,0 2.78469,-0.60537 -0.60537,-6.29582 -1.45289,-12.10735 -2.66362,-18.76639 -6.17475,-0.60537 -11.62305,-5.44831 -26.51509,-5.44831 -23.97255,0 -39.34889,18.76639 -39.34889,41.52821 0,21.43 11.98628,39.34888 38.01708,39.34888 z"
         style="font-style:normal;font-variant:normal;font-weight:normal;font-stretch:normal;font-size:121.07348633px;line-height:100%;font-family:'Linux Libertine Display O';-inkscape-font-specification:'Linux Libertine Display O';letter-spacing:0px;word-spacing:0px;fill:#000000;fill-opacity:1;stroke:none;stroke-width:0.90805119px;stroke-linecap:butt;stroke-linejoin:miter;stroke-opacity:1"
         id="path7139"
         inkscape:connector-curvature="0" />
      <path
         d="m 489.70806,674.51937 c -2.66362,0 -3.51113,-0.96859 -3.02684,-2.17933 l 12.71272,-31.35803 h 0.36322 l 11.62305,33.53736 z m -13.68131,25.30435 7.26441,-18.76639 c 0.60537,-1.57395 1.33181,-2.66361 4.23757,-2.66361 h 25.30436 l 7.62763,22.27752 c 1.69503,4.96401 -3.14791,4.96401 -8.95944,5.32723 -0.72644,0.72644 -0.72644,2.05825 0,2.78469 4.47972,-0.12107 11.13877,-0.60536 15.86063,-0.60536 4.96401,0 10.17017,0.48429 14.64989,0.60536 0.72644,-0.72644 0.72644,-2.05825 0,-2.78469 -4.72186,-0.36322 -8.71729,-0.84751 -10.89661,-7.02226 l -25.30436,-70.46477 c -1.8161,1.08966 -4.72187,2.42147 -6.29582,2.42147 l -28.08905,66.10612 c -3.14791,7.38549 -6.78011,8.59622 -12.10735,8.95944 -0.72644,0.72644 -0.72644,2.05825 0,2.78469 4.47972,-0.12107 7.26441,-0.60536 11.98628,-0.60536 4.96401,0 8.59621,0.48429 13.07593,0.60536 0.72644,-0.72644 0.72644,-2.05825 0,-2.78469 -4.60079,-0.24214 -10.29124,-1.08966 -8.35407,-6.17475 z"
         style="font-style:normal;font-variant:normal;font-weight:normal;font-stretch:normal;font-size:121.07348633px;line-height:100%;font-family:'Linux Libertine Display O';-inkscape-font-specification:'Linux Libertine Display O';letter-spacing:0px;word-spacing:0px;fill:#000000;fill-opacity:1;stroke:none;stroke-width:0.90805119px;stroke-linecap:butt;stroke-linejoin:miter;stroke-opacity:1"
         id="path7141"
         inkscape:connector-curvature="0" />
      <path
         d="m 565.52655,672.34004 c 2.66362,0.84752 6.17475,1.08966 10.29125,1.08966 22.03537,0 28.33119,-13.80237 28.33119,-24.09362 0,-7.14333 -4.47971,-20.46142 -26.87831,-20.46142 -3.14791,0 -11.62305,1.21074 -16.46599,1.21074 -6.05368,0 -9.44374,-0.4843 -15.49741,-0.60537 -0.72644,0.72644 -0.72644,2.05825 0,2.78469 8.47514,0.36322 10.29125,0.96859 10.41232,11.01769 0.12107,10.0491 0.24215,15.9817 0.24215,26.0308 0,10.0491 0,15.61848 -0.24215,25.66758 -0.24215,10.17017 -1.93718,10.65446 -10.41232,11.01768 -0.72644,0.72644 -0.72644,2.05825 0,2.78469 5.9326,-0.12107 9.56481,-0.60536 15.73955,-0.60536 6.78012,0 11.13876,0.48429 17.19244,0.60536 0.72644,-0.72644 0.72644,-2.05825 0,-2.78469 -8.35407,-0.48429 -12.3495,-1.08966 -12.47057,-8.11192 -0.12107,-9.08051 -0.24215,-16.82922 -0.24215,-25.54651 z m 0.24215,-34.74809 c 0.12107,-3.51113 2.05825,-5.81152 10.77554,-5.81152 8.35407,0 16.95029,4.35864 16.95029,19.73497 0,13.07594 -6.65904,19.00854 -18.40317,19.00854 -2.90577,0 -7.99085,-0.24215 -9.56481,-0.60537 v -0.60536 c 0,-10.0491 0.12108,-21.67216 0.24215,-31.72126 z"
         style="font-style:normal;font-variant:normal;font-weight:normal;font-stretch:normal;font-size:121.07348633px;line-height:100%;font-family:'Linux Libertine Display O';-inkscape-font-specification:'Linux Libertine Display O';letter-spacing:0px;word-spacing:0px;fill:#000000;fill-opacity:1;stroke:none;stroke-width:0.90805119px;stroke-linecap:butt;stroke-linejoin:miter;stroke-opacity:1"
         id="path7143"
         inkscape:connector-curvature="0" />
      <path
         d="m 647.32304,664.95456 -14.1656,0.12107 c 0,0 -0.12107,-16.46599 0.24215,-26.39402 0.12107,-2.90576 1.57395,-5.32723 4.47972,-5.32723 h 18.88746 c 9.08051,0 10.89662,6.4169 13.56023,14.77097 1.45288,0.24214 1.69503,0 2.90577,-0.60537 -0.60537,-4.96401 -2.42147,-16.95029 -2.66362,-17.91888 0,-0.24214 -0.12107,-0.36322 -0.48429,-0.36322 -2.05825,0.36322 -3.14791,0.84752 -6.05368,0.84752 h -35.35346 c -3.6322,0 -9.68588,-0.4843 -15.73955,-0.60537 -0.72644,0.72644 -0.72644,2.05825 0,2.78469 8.47514,0.36322 10.0491,0.96859 10.41232,11.01769 0.24215,9.92802 0.24215,15.9817 0.24215,26.0308 0,10.0491 0,15.73955 -0.24215,25.66758 -0.36322,10.04909 -1.93718,10.65446 -10.41232,11.01768 -0.72644,0.72644 -0.72644,2.05825 0,2.78469 5.9326,-0.12107 12.3495,-0.60536 15.9817,-0.60536 h 26.87831 c 5.81153,0 15.49741,0.60536 15.49741,0.60536 1.69503,-6.05367 3.39006,-14.40774 4.35865,-20.58249 -1.21074,-0.72644 -1.33181,-0.96859 -2.90577,-0.60537 -2.42147,8.71729 -6.78011,17.43458 -15.9817,17.43458 h -18.88746 c -2.66362,0 -4.35865,-1.93717 -4.47972,-5.20616 -0.36322,-10.17017 -0.24215,-31.35803 -0.24215,-31.35803 l 14.1656,0.12108 c 10.29125,0.12107 10.77554,2.66361 11.13876,8.11192 0.72644,0.72644 1.93718,0.72644 2.66362,0 -0.12108,-4.23757 -0.4843,-5.69045 -0.4843,-9.44373 0,-3.99543 0.36322,-6.78012 0.4843,-10.41232 -0.72644,-0.72644 -1.93718,-0.72644 -2.66362,0 -0.36322,6.65904 -0.84751,8.11192 -11.13876,8.11192 z"
         style="font-style:normal;font-variant:normal;font-weight:normal;font-stretch:normal;font-size:121.07348633px;line-height:100%;font-family:'Linux Libertine Display O';-inkscape-font-specification:'Linux Libertine Display O';letter-spacing:0px;word-spacing:0px;fill:#000000;fill-opacity:1;stroke:none;stroke-width:0.90805119px;stroke-linecap:butt;stroke-linejoin:miter;stroke-opacity:1"
         id="path7145"
         inkscape:connector-curvature="0" />
    </g>
    <g
       id="g5945"
       transform="matrix(1.5114838,0,0,1.8029468,-58.898673,-242.86064)">
      <path
         id="path5897"
         style="opacity:1;fill:none;stroke:#2d2df6;stroke-width:0.26458332;stroke-linecap:butt;stroke-linejoin:miter;stroke-opacity:1"
         d="M -4.4374906,208.83116 C 1.8844762,268.19656 115.20863,294.09168 169.03133,301.23315"
         inkscape:connector-curvature="0" />
      <path
         id="path5899"
         style="opacity:1;fill:none;stroke:#2d2ff5;stroke-width:0.26458332;stroke-linecap:butt;stroke-linejoin:miter;stroke-opacity:1"
         d="M -1.6604822,208.76977 C 4.5146667,266.7565 113.95911,292.7179 167.14102,301.31382"
         inkscape:connector-curvature="0" />
      <path
         id="path5901"
         style="opacity:1;fill:none;stroke:#2f33f4;stroke-width:0.26458332;stroke-linecap:butt;stroke-linejoin:miter;stroke-opacity:1"
         d="M 1.9423993,208.69012 C 7.9270673,264.88817 112.33799,290.93556 164.68853,301.41848"
         inkscape:connector-curvature="0" />
      <path
         id="path5903"
         style="opacity:1;fill:none;stroke:#3036f3;stroke-width:0.26458332;stroke-linecap:butt;stroke-linejoin:miter;stroke-opacity:1"
         d="M 5.9407252,208.60173 C 11.714005,262.81478 110.53894,288.95759 161.96687,301.53463"
         inkscape:connector-curvature="0" />
      <path
         id="path5905"
         style="opacity:1;fill:none;stroke:#313af3;stroke-width:0.26458332;stroke-linecap:butt;stroke-linejoin:miter;stroke-opacity:1"
         d="m 10.219648,208.50714 c 5.547057,52.08874 98.393982,78.33367 148.834552,93.1518"
         inkscape:connector-curvature="0" />
      <path
         id="path5907"
         style="opacity:1;fill:none;stroke:#333ff2;stroke-width:0.26458332;stroke-linecap:butt;stroke-linejoin:miter;stroke-opacity:1"
         d="m 14.720114,208.40765 c 5.309122,49.85445 91.868526,76.20679 141.270616,93.38202"
         inkscape:connector-curvature="0" />
      <path
         id="path5909"
         style="opacity:1;fill:none;stroke:#3443f1;stroke-width:0.26458332;stroke-linecap:butt;stroke-linejoin:miter;stroke-opacity:1"
         d="m 19.405388,208.30407 c 5.061416,47.52841 85.075112,73.99257 133.396072,93.62171"
         inkscape:connector-curvature="0" />
      <path
         id="path5911"
         style="opacity:1;fill:none;stroke:#3648f0;stroke-width:0.26458332;stroke-linecap:butt;stroke-linejoin:miter;stroke-opacity:1"
         d="m 24.250151,208.19697 c 4.805278,45.12319 78.050439,71.70297 125.253479,93.86955"
         inkscape:connector-curvature="0" />
      <path
         id="path5913"
         style="opacity:1;fill:none;stroke:#374def;stroke-width:0.26458332;stroke-linecap:butt;stroke-linejoin:miter;stroke-opacity:1"
         d="m 29.23577,208.08676 c 4.541693,42.64803 70.82153,69.3468 116.87414,94.12459"
         inkscape:connector-curvature="0" />
      <path
         id="path5915"
         style="opacity:1;fill:none;stroke:#3951ee;stroke-width:0.26458332;stroke-linecap:butt;stroke-linejoin:miter;stroke-opacity:1"
         d="m 34.347903,207.97375 c 4.271419,40.11006 63.40919,66.93085 108.282177,94.3861"
         inkscape:connector-curvature="0" />
      <path
         id="path5917"
         style="opacity:1;fill:none;stroke:#3b56ed;stroke-width:0.26458332;stroke-linecap:butt;stroke-linejoin:miter;stroke-opacity:1"
         d="m 39.586178,207.71331 c 3.995061,37.51497 55.818919,64.60539 99.485722,94.79839"
         inkscape:connector-curvature="0"
         sodipodi:nodetypes="cc" />
      <path
         id="path5919"
         style="opacity:1;fill:none;stroke:#3d5cec;stroke-width:0.26458332;stroke-linecap:butt;stroke-linejoin:miter;stroke-opacity:1"
         d="m 44.886004,207.71331 c 3.713112,34.86736 48.119511,61.96717 90.555736,94.95332"
         inkscape:connector-curvature="0"
         sodipodi:nodetypes="cc" />
      <path
         id="path5921"
         style="opacity:1;fill:none;stroke:#3e61eb;stroke-width:0.26458332;stroke-linecap:butt;stroke-linejoin:miter;stroke-opacity:1"
         d="m 50.339061,207.62024 c 3.425982,32.17112 40.22279,59.37355 81.405819,95.20415"
         inkscape:connector-curvature="0" />
      <path
         id="path5923"
         style="opacity:1;fill:none;stroke:#4066e9;stroke-width:0.26458332;stroke-linecap:butt;stroke-linejoin:miter;stroke-opacity:1"
         d="m 55.861385,207.49816 c 3.134022,29.42952 32.215689,56.76375 72.124445,95.48665"
         inkscape:connector-curvature="0" />
      <path
         id="path5925"
         style="opacity:1;fill:none;stroke:#426be8;stroke-width:0.26458332;stroke-linecap:butt;stroke-linejoin:miter;stroke-opacity:1"
         d="m 61.469402,207.37418 c 2.837531,26.64538 24.084338,54.11345 62.699048,95.77355"
         inkscape:connector-curvature="0" />
      <path
         id="path5927"
         style="opacity:1;fill:none;stroke:#4471e7;stroke-width:0.26458332;stroke-linecap:butt;stroke-linejoin:miter;stroke-opacity:1"
         d="m 67.158171,207.24842 c 2.536771,23.82114 15.8359,51.42498 53.137929,96.06456"
         inkscape:connector-curvature="0" />
      <path
         id="path5929"
         style="opacity:1;fill:none;stroke:#4676e6;stroke-width:0.26458332;stroke-linecap:butt;stroke-linejoin:miter;stroke-opacity:1"
         d="m 72.923349,207.12097 c 2.231971,20.95897 7.476673,48.70041 43.448391,96.35949"
         inkscape:connector-curvature="0" />
      <path
         id="path5931"
         style="opacity:1;fill:none;stroke:#487ce5;stroke-width:0.26458332;stroke-linecap:butt;stroke-linejoin:miter;stroke-opacity:1"
         d="m 78.761087,206.99192 c 1.923336,18.06077 -0.987763,45.94154 33.636903,96.65812"
         inkscape:connector-curvature="0" />
      <path
         id="path5933"
         style="opacity:1;fill:none;stroke:#4a81e4;stroke-width:0.26458332;stroke-linecap:butt;stroke-linejoin:miter;stroke-opacity:1"
         d="m 84.667945,206.86134 c 1.611046,15.12827 -9.552419,43.15 23.709235,96.9603"
         inkscape:connector-curvature="0" />
      <path
         id="path5935"
         style="opacity:1;fill:none;stroke:#4c87e2;stroke-width:0.26458332;stroke-linecap:butt;stroke-linejoin:miter;stroke-opacity:1"
         d="m 90.640833,206.7293 c 1.295265,12.16298 -18.212816,40.32726 13.670597,97.26585"
         inkscape:connector-curvature="0" />
      <path
         id="path5937"
         style="opacity:1;fill:none;stroke:#4d8de1;stroke-width:0.26458332;stroke-linecap:butt;stroke-linejoin:miter;stroke-opacity:1"
         d="m 96.676951,206.59586 c 0.976141,9.1663 -26.964893,37.47464 3.525689,97.57463"
         inkscape:connector-curvature="0" />
      <path
         id="path5939"
         style="opacity:1;fill:none;stroke:#4f93e0;stroke-width:0.26458332;stroke-linecap:butt;stroke-linejoin:miter;stroke-opacity:1"
         d="m 102.77376,206.46108 c 0.65381,6.13949 -35.804967,34.59334 -6.721219,97.88652"
         inkscape:connector-curvature="0" />
      <path
         id="path5941"
         style="opacity:1;fill:none;stroke:#5199df;stroke-width:0.26458332;stroke-linecap:butt;stroke-linejoin:miter;stroke-opacity:1"
         d="m 108.92892,206.32501 c 0.32839,3.0837 -44.729652,31.68446 -17.066206,98.2014"
         inkscape:connector-curvature="0" />
      <path
         id="path5943"
         style="opacity:1;fill:none;stroke:#549fde;stroke-width:0.26458332;stroke-linecap:butt;stroke-linejoin:miter;stroke-opacity:1"
         d="m 115.14032,206.1877 c 0,0 -53.735878,28.749 -27.505709,98.51915"
         inkscape:connector-curvature="0" />
    </g>
    <g
       id="inkscape-logo"
       transform="matrix(0.09693231,0,0,0.09693231,124.69271,158.07467)">
      <path
         d="M 163.15,11.524488 28.81,148.99448 c -45.39,56.21 30.89,49.67 63.59,65.86 11.73,11.99 -44.96,20.84 -33.23,32.84 11.73,11.99 70.93,23.1 82.68,35.09 11.73,11.99 -24.01,24.71 -12.28,36.7 11.73,11.99 38.86,0.63 43.94,28.31 3.62,19.78 48.89,8.5 71.03,-7.7 11.73,-12 -22.44,-10.87 -10.71,-22.86 29.17,-29.83 56.33,-10.84 66.31,-40.73 4.93,-14.77 -42.94,-22.77 -31.19,-34.76 33.75,-19.71 150.4,-32.54 95.05,-87.89 L 224.75,11.524488 c -17.03,-16.3499992 -45.45,-16.5299992 -61.6,0 z M 317.46,276.50448 c 0,6.82 50.25,11.29 50.25,-1.61 -7.16,-20.72 -44.31,-19.32 -50.25,1.61 z m -226.36,36.24 c 11.9,10.29 30.28,-2.56 35.79,-16.92 -11.53,-15.32 -54.69,0.55 -35.79,16.92 z m 220.06,-22.23 c -15.34,13.76 1.72,27.72 16.84,18.83 3.37,-3.42 -0.09,-15.41 -16.84,-18.83 z"
         id="path2313"
         inkscape:connector-curvature="0"
         style="fill:url(#meshgradient2925);fill-opacity:1" />
      <path
         d="m 131,222.29448 c 3.59,2.23 57.89,13.26 71.16,15.46 4.6,0.97 1.34,5.71 -5,8.91 -14.3,3.8 -83.66,-24.37 -66.16,-24.37 z"
         id="path2315"
         style="fill:#ffffff"
         inkscape:connector-curvature="0" />
      <path
         d="m 216.63,21.164488 53.15,53.98 c 5.04,5.15 4.97,15.13 2.15,17.999996 L 245.54,72.034488 240.35,103.29448 218.3,91.654488 182.99,113.96448 171.3,66.934488 152.33,99.754484 h -29 c -11.82,0 -13.21,-14.999996 -2.47,-25.739996 18.76,-20.25 40.29,-40.89 51.99,-52.85 11.76,-12.0199996 32.25,-11.6799996 43.78,0 z"
         id="path2317"
         style="fill:#ffffff"
         inkscape:connector-curvature="0" />
    </g>
    <rect
       style="fill:#ffffff;fill-opacity:1;stroke:none;stroke-width:0.59777081;stroke-opacity:1"
       id="rect2273-2"
       width="153.41272"
       height="49.424355"
       x="53.453903"
       y="296.99997"
       ry="8.117569"
       rx="5.8218732" />
    <rect
       style="fill:#ffffff;fill-opacity:1;stroke:none;stroke-width:0.47003421;stroke-opacity:1"
       id="rect2273"
       width="131.92697"
       height="35.535164"
       x="13.909142"
       y="96.083542"
       ry="5.8363762"
       rx="5.0065084" />
    <rect
       style="fill:#ffffff;fill-opacity:1;stroke:none;stroke-width:0.91055518;stroke-opacity:1"
       id="rect2273-9"
       width="131.92697"
       height="133.35582"
       x="-131.92726"
       y="124.94189"
       ry="21.902662"
       rx="5.0065088" />
    <rect
       style="fill:#132d5e;fill-opacity:1;stroke:none;stroke-width:0.29277241;stroke-opacity:1"
       id="rect6540"
       width="12.269131"
       height="8.364953"
       x="154.98723"
       y="157.45851"
       rx="3.9538603"
       ry="3.9538603" />
    <g
       aria-label="1.0"
       style="font-style:normal;font-variant:normal;font-weight:normal;font-stretch:normal;font-size:6.95468235px;line-height:1.25;font-family:Arial;-inkscape-font-specification:Arial;font-variant-ligatures:normal;font-variant-caps:normal;font-variant-numeric:lining-nums;font-feature-settings:normal;text-align:start;letter-spacing:0px;word-spacing:0px;writing-mode:lr-tb;text-anchor:start;fill:#f7f7f7;fill-opacity:1;stroke:none;stroke-width:0.5216012"
       id="text6544">
      <path
         d="m 159.08891,159.31274 v 4.65268 h -0.63983 v -3.97112 l -1.08493,0.66069 -0.27819,-0.45205 1.43962,-0.8902 z"
         style="font-style:normal;font-variant:normal;font-weight:normal;font-stretch:normal;font-family:'Fira Sans';-inkscape-font-specification:'Fira Sans';fill:#f7f7f7;fill-opacity:1;stroke-width:0.5216012"
         id="path887" />
      <path
         d="m 160.68566,163.08218 q 0.20864,0 0.34773,0.13909 0.1391,0.1391 0.1391,0.34078 0,0.20169 -0.1391,0.34774 -0.13909,0.13909 -0.34773,0.13909 -0.20169,0 -0.34078,-0.13909 -0.13909,-0.14605 -0.13909,-0.34774 0,-0.20168 0.13909,-0.34078 0.13909,-0.13909 0.34078,-0.13909 z"
         style="font-style:normal;font-variant:normal;font-weight:normal;font-stretch:normal;font-family:'Fira Sans';-inkscape-font-specification:'Fira Sans';fill:#f7f7f7;fill-opacity:1;stroke-width:0.5216012"
         id="path889" />
      <path
         d="m 163.38766,159.24319 q 0.77197,0 1.16143,0.61897 0.39642,0.61201 0.39642,1.7804 0,1.16839 -0.39642,1.78735 -0.38946,0.61897 -1.16143,0.61897 -0.77197,0 -1.16839,-0.61897 -0.38946,-0.61896 -0.38946,-1.78735 0,-1.16839 0.38946,-1.7804 0.39642,-0.61897 1.16839,-0.61897 z m 0,0.5077 q -0.45205,0 -0.6746,0.4451 -0.2156,0.4451 -0.2156,1.44657 0,1.00147 0.2156,1.45353 0.22255,0.4451 0.6746,0.4451 0.4451,0 0.66765,-0.4451 0.22255,-0.45206 0.22255,-1.45353 0,-0.99452 -0.22255,-1.43962 -0.22255,-0.45205 -0.66765,-0.45205 z"
         style="font-style:normal;font-variant:normal;font-weight:normal;font-stretch:normal;font-family:'Fira Sans';-inkscape-font-specification:'Fira Sans';fill:#f7f7f7;fill-opacity:1;stroke-width:0.5216012"
         id="path891" />
    </g>
    <text
       xml:space="preserve"
       style="font-style:normal;font-variant:normal;font-weight:normal;font-stretch:normal;font-size:3.52777767px;line-height:1.25;font-family:Georgia;-inkscape-font-specification:'Georgia, Normal';font-variant-ligatures:normal;font-variant-caps:normal;font-variant-numeric:lining-nums;font-feature-settings:normal;text-align:start;letter-spacing:0px;word-spacing:0px;writing-mode:lr-tb;text-anchor:start;fill:#000000;fill-opacity:1;stroke:none;stroke-width:0.26458332"
       x="136.4494"
       y="225.75148"
       id="text6548"><tspan
         sodipodi:role="line"
         id="tspan6546"
         x="136.4494"
         y="228.93431"
         style="stroke-width:0.26458332" /></text>
    <g
       aria-label="www.inkscape.org


Raghed"
       style="font-style:normal;font-variant:normal;font-weight:normal;font-stretch:normal;font-size:4.54332685px;line-height:1.25;font-family:Yrsa;-inkscape-font-specification:Yrsa;font-variant-ligatures:normal;font-variant-caps:normal;font-variant-numeric:lining-nums;font-feature-settings:normal;text-align:center;letter-spacing:0px;word-spacing:0px;writing-mode:lr-tb;text-anchor:middle;fill:#000000;fill-opacity:1;stroke:none;stroke-width:0.34074953"
       id="text6552">
      <path
         d="m 128.34314,259.02705 -0.51876,-1.62569 q -0.0116,-0.0363 -0.0363,-0.0562 -0.0231,-0.0198 -0.0611,-0.0314 l -0.10573,-0.0297 v -0.16356 h 0.80458 v 0.16356 l -0.25608,0.0496 0.38329,1.32334 0.42625,-1.53647 h 0.0743 v 0 h 0.25608 l 0.42294,1.53647 0.37173,-1.32169 -0.25773,-0.0512 v -0.16356 h 0.68067 v 0.16356 l -0.11069,0.0297 q -0.038,0.01 -0.0628,0.0314 -0.0231,0.0215 -0.0347,0.0578 l -0.49564,1.62403 h -0.30234 l -0.44442,-1.49517 -0.42459,1.49517 z"
         style="font-style:normal;font-variant:normal;font-weight:normal;font-stretch:normal;font-family:Yrsa;-inkscape-font-specification:Yrsa;text-align:center;text-anchor:middle;stroke-width:0.34074953"
         id="path894" />
      <path
         d="m 131.34245,259.02705 -0.51877,-1.62569 q -0.0116,-0.0363 -0.0363,-0.0562 -0.0231,-0.0198 -0.0611,-0.0314 l -0.10574,-0.0297 v -0.16356 h 0.80458 v 0.16356 l -0.25608,0.0496 0.3833,1.32334 0.42624,-1.53647 h 0.0744 v 0 h 0.25608 l 0.42294,1.53647 0.37173,-1.32169 -0.25774,-0.0512 v -0.16356 h 0.68068 v 0.16356 l -0.11069,0.0297 q -0.038,0.01 -0.0628,0.0314 -0.0231,0.0215 -0.0347,0.0578 l -0.49563,1.62403 h -0.30234 l -0.44442,-1.49517 -0.4246,1.49517 z"
         style="font-style:normal;font-variant:normal;font-weight:normal;font-stretch:normal;font-family:Yrsa;-inkscape-font-specification:Yrsa;text-align:center;text-anchor:middle;stroke-width:0.34074953"
         id="path896" />
      <path
         d="m 134.34175,259.02705 -0.51876,-1.62569 q -0.0116,-0.0363 -0.0363,-0.0562 -0.0231,-0.0198 -0.0611,-0.0314 l -0.10573,-0.0297 v -0.16356 h 0.80458 v 0.16356 l -0.25608,0.0496 0.38329,1.32334 0.42625,-1.53647 h 0.0743 v 0 h 0.25608 l 0.42294,1.53647 0.37173,-1.32169 -0.25773,-0.0512 v -0.16356 h 0.68067 v 0.16356 l -0.11069,0.0297 q -0.038,0.01 -0.0628,0.0314 -0.0231,0.0215 -0.0347,0.0578 l -0.49564,1.62403 h -0.30234 l -0.44442,-1.49517 -0.42459,1.49517 z"
         style="font-style:normal;font-variant:normal;font-weight:normal;font-stretch:normal;font-family:Yrsa;-inkscape-font-specification:Yrsa;text-align:center;text-anchor:middle;stroke-width:0.34074953"
         id="path898" />
      <path
         d="m 137.1295,258.79575 q 0,0.10409 -0.0677,0.17182 -0.0677,0.0661 -0.17678,0.0661 -0.10904,0 -0.17678,-0.0661 -0.0661,-0.0677 -0.0661,-0.17182 0,-0.10573 0.0661,-0.17182 0.0677,-0.0661 0.17678,-0.0661 0.10904,0 0.17678,0.0661 0.0677,0.0661 0.0677,0.17182 z"
         style="font-style:normal;font-variant:normal;font-weight:normal;font-stretch:normal;font-family:Yrsa;-inkscape-font-specification:Yrsa;text-align:center;text-anchor:middle;stroke-width:0.34074953"
         id="path900" />
      <path
         d="m 138.17377,257.13207 v 1.5629 q 0,0.0446 0.0231,0.071 0.0231,0.0264 0.0661,0.0331 l 0.20321,0.0314 v 0.16851 h -0.94006 v -0.16851 l 0.20321,-0.0314 q 0.043,-0.007 0.0661,-0.0331 0.0248,-0.0264 0.0248,-0.0694 v -1.23082 q 0,-0.0446 -0.0231,-0.0711 -0.0215,-0.0264 -0.0644,-0.033 l -0.22965,-0.033 v -0.16191 q 0.14208,-0.043 0.30895,-0.0628 0.16686,-0.0215 0.30894,-0.0248 z m 0.0264,-0.56503 q 0,0.10574 -0.0677,0.17348 -0.0677,0.0661 -0.17678,0.0661 -0.10904,0 -0.17678,-0.0661 -0.0677,-0.0677 -0.0677,-0.17348 0,-0.10408 0.0677,-0.17016 0.0677,-0.0661 0.17678,-0.0661 0.10904,0 0.17678,0.0661 0.0677,0.0661 0.0677,0.17016 z"
         style="font-style:normal;font-variant:normal;font-weight:normal;font-stretch:normal;font-family:Yrsa;-inkscape-font-specification:Yrsa;text-align:center;text-anchor:middle;stroke-width:0.34074953"
         id="path902" />
      <path
         d="m 139.65876,258.83045 v 0.16851 h -0.91692 v -0.16851 l 0.20321,-0.0314 q 0.0429,-0.007 0.0661,-0.0331 0.0248,-0.0264 0.0248,-0.0694 v -1.23082 q 0,-0.0446 -0.0231,-0.0711 -0.0215,-0.0264 -0.0644,-0.033 l -0.22964,-0.033 v -0.16191 q 0.13382,-0.0413 0.28581,-0.0628 0.15365,-0.0231 0.28747,-0.0248 l 0.0578,0.0578 0.0248,0.20322 q 0.13712,-0.14539 0.30894,-0.20487 0.17182,-0.0595 0.3486,-0.0595 0.32877,0 0.44772,0.19164 0.11896,0.19165 0.11896,0.53364 v 0.8971 q 0,0.0429 0.0231,0.0694 0.0248,0.0248 0.0661,0.0314 l 0.20321,0.0314 v 0.16851 h -0.91527 v -0.16851 l 0.18008,-0.0314 q 0.038,-0.007 0.0628,-0.0297 0.0264,-0.0248 0.0264,-0.071 v -0.83267 q 0,-0.2726 -0.0743,-0.40642 -0.0743,-0.13548 -0.28912,-0.13548 -0.13052,0 -0.25773,0.0396 -0.12722,0.0397 -0.2346,0.12061 v 1.21265 q 0,0.043 0.0231,0.0694 0.0231,0.0248 0.0644,0.0331 z"
         style="font-style:normal;font-variant:normal;font-weight:normal;font-stretch:normal;font-family:Yrsa;-inkscape-font-specification:Yrsa;text-align:center;text-anchor:middle;stroke-width:0.34074953"
         id="path904" />
      <path
         d="m 142.0371,258.83045 v 0.16851 h -0.93676 v -0.16851 l 0.20322,-0.0314 q 0.0429,-0.007 0.0661,-0.0331 0.0231,-0.0264 0.0231,-0.0694 v -2.28653 q 0,-0.0446 -0.0231,-0.0694 -0.0231,-0.0248 -0.0661,-0.0314 l -0.24287,-0.0347 v -0.152 q 0.14374,-0.0413 0.31556,-0.0661 0.17347,-0.0248 0.31721,-0.0281 l 0.0529,0.0512 v 2.0668 l 0.74346,-0.81119 -0.33043,-0.0529 v -0.16025 h 0.90206 v 0.16025 l -0.19825,0.043 q -0.0479,0.01 -0.0793,0.0231 -0.0314,0.0116 -0.0628,0.043 l -0.42459,0.44112 q 0.0479,0.0628 0.0892,0.12721 0.0413,0.0628 0.0876,0.14539 l 0.34364,0.57989 q 0.0281,0.0463 0.0578,0.0694 0.0314,0.0231 0.0677,0.0314 l 0.20816,0.0446 v 0.16851 h -0.50059 q -0.0677,0 -0.12391,-0.0793 -0.0545,-0.0793 -0.1206,-0.20486 l -0.18834,-0.35686 q -0.0413,-0.0793 -0.081,-0.14869 -0.038,-0.071 -0.076,-0.13217 l -0.31391,0.32877 v 0.29243 q 0,0.0429 0.0231,0.0694 0.0248,0.0248 0.0661,0.0314 z"
         style="font-style:normal;font-variant:normal;font-weight:normal;font-stretch:normal;font-family:Yrsa;-inkscape-font-specification:Yrsa;text-align:center;text-anchor:middle;stroke-width:0.34074953"
         id="path906" />
      <path
         d="m 143.4212,258.89653 q -0.0165,-0.13217 -0.0132,-0.26269 0.003,-0.13217 0.0198,-0.24451 h 0.18834 l 0.0644,0.24947 q 0.0132,0.0562 0.0297,0.0859 0.0165,0.0281 0.0529,0.0512 0.0429,0.0264 0.13217,0.0578 0.0909,0.0314 0.20816,0.0314 0.17348,0 0.26269,-0.0793 0.0909,-0.0793 0.0909,-0.20982 0,-0.0793 -0.0347,-0.13382 -0.033,-0.0562 -0.0975,-0.10078 -0.0644,-0.0446 -0.16026,-0.0859 -0.0958,-0.0413 -0.21973,-0.0909 -0.22138,-0.0925 -0.36347,-0.20816 -0.14208,-0.11731 -0.14208,-0.34365 0,-0.13382 0.0512,-0.2346 0.0512,-0.10243 0.14208,-0.17016 0.0925,-0.0694 0.22138,-0.10409 0.12887,-0.0347 0.28252,-0.0347 0.14373,0 0.29903,0.0314 0.15695,0.0314 0.25773,0.076 0.007,0.11895 -0.002,0.24286 -0.008,0.12225 -0.0297,0.24121 h -0.17678 l -0.0562,-0.22469 q -0.0116,-0.0463 -0.0314,-0.0777 -0.0198,-0.0314 -0.0611,-0.0562 -0.0363,-0.0215 -0.0958,-0.0396 -0.0578,-0.0182 -0.13713,-0.0198 -0.14373,-0.002 -0.24121,0.0644 -0.0958,0.0661 -0.0958,0.20487 0,0.0842 0.0363,0.14208 0.038,0.0562 0.0991,0.0975 0.0611,0.0413 0.13878,0.0727 0.0793,0.0314 0.16191,0.0628 0.114,0.043 0.22138,0.0942 0.10739,0.0512 0.18835,0.1206 0.0826,0.0694 0.13217,0.16356 0.0512,0.0942 0.0512,0.22304 0,0.13217 -0.0545,0.23625 -0.0529,0.10243 -0.15034,0.17347 -0.0958,0.0694 -0.2313,0.10574 -0.13547,0.0364 -0.29738,0.0364 -0.1966,0 -0.36512,-0.0463 -0.16686,-0.0463 -0.2759,-0.0975 z"
         style="font-style:normal;font-variant:normal;font-weight:normal;font-stretch:normal;font-family:Yrsa;-inkscape-font-specification:Yrsa;text-align:center;text-anchor:middle;stroke-width:0.34074953"
         id="path908" />
      <path
         d="m 145.15237,258.08038 q 0,-0.21808 0.0578,-0.40311 0.0595,-0.18669 0.17347,-0.32051 0.114,-0.13548 0.28582,-0.21147 0.17182,-0.076 0.39486,-0.076 0.15695,0 0.3172,0.0347 0.16191,0.0347 0.25939,0.0843 0.008,0.12887 -0.002,0.27921 -0.01,0.14869 -0.0314,0.27755 h -0.18173 l -0.0694,-0.2759 q -0.0116,-0.0463 -0.0248,-0.0777 -0.0132,-0.033 -0.0446,-0.0595 -0.0413,-0.033 -0.10904,-0.0545 -0.0661,-0.0231 -0.15034,-0.0231 -0.2313,0 -0.35851,0.18669 -0.12721,0.18669 -0.12721,0.56338 0,0.39485 0.14208,0.59146 0.14373,0.1966 0.40312,0.1966 0.1553,0 0.27755,-0.0611 0.12226,-0.0611 0.19826,-0.14374 l 0.10078,0.0909 q -0.0793,0.16356 -0.25774,0.26269 -0.17677,0.0975 -0.41963,0.0975 -0.20652,0 -0.36512,-0.071 -0.15695,-0.0727 -0.26104,-0.1999 -0.10243,-0.12722 -0.1553,-0.30399 -0.0529,-0.17678 -0.0529,-0.3833 z"
         style="font-style:normal;font-variant:normal;font-weight:normal;font-stretch:normal;font-family:Yrsa;-inkscape-font-specification:Yrsa;text-align:center;text-anchor:middle;stroke-width:0.34074953"
         id="path910" />
      <path
         d="m 147.65025,258.80401 q 0.11896,0 0.24121,-0.0446 0.12226,-0.0463 0.20817,-0.11731 v -0.44111 l -0.31555,0.0281 q -0.19991,0.0165 -0.3073,0.0909 -0.10573,0.0744 -0.10573,0.22634 0,0.12226 0.0677,0.19 0.0694,0.0677 0.21147,0.0677 z m 0.76328,0.22304 q -0.11895,0 -0.19495,-0.0595 -0.076,-0.0611 -0.10573,-0.17677 -0.10409,0.11234 -0.25939,0.18008 -0.15529,0.0661 -0.33207,0.0661 -0.11235,0 -0.20982,-0.0297 -0.0975,-0.0297 -0.16852,-0.0859 -0.0694,-0.0578 -0.11069,-0.14208 -0.0397,-0.0859 -0.0397,-0.19495 0,-0.14373 0.0661,-0.24121 0.0661,-0.0975 0.17016,-0.15695 0.10574,-0.0595 0.2346,-0.0892 0.13052,-0.0297 0.25608,-0.0397 l 0.37999,-0.0314 v -0.22303 q 0,-0.25443 -0.10243,-0.35851 -0.10078,-0.10408 -0.30895,-0.10408 -0.15695,0 -0.29738,0.0529 -0.13878,0.0512 -0.25773,0.16191 l -0.0843,-0.0843 q 0.0314,-0.0942 0.10243,-0.16686 0.0711,-0.0744 0.16687,-0.12391 0.0975,-0.0496 0.21808,-0.0743 0.1206,-0.0264 0.25112,-0.0264 0.32877,0 0.49398,0.16686 0.16522,0.16522 0.16522,0.5072 v 0.9351 q 0,0.0529 0.0231,0.0777 0.0248,0.0231 0.071,0.0281 l 0.18999,0.0165 v 0.15695 q -0.0413,0.0149 -0.14043,0.0363 -0.0975,0.0231 -0.17678,0.0231 z"
         style="font-style:normal;font-variant:normal;font-weight:normal;font-stretch:normal;font-family:Yrsa;-inkscape-font-specification:Yrsa;text-align:center;text-anchor:middle;stroke-width:0.34074953"
         id="path912" />
      <path
         d="m 149.92873,258.85027 q 0.25608,0 0.41303,-0.17678 0.15695,-0.17842 0.16191,-0.61624 0.003,-0.37172 -0.11895,-0.55841 -0.12061,-0.18669 -0.37503,-0.18669 -0.13878,0 -0.24617,0.0463 -0.10739,0.0463 -0.17347,0.10739 v 1.30352 q 0.0578,0.0363 0.14538,0.0595 0.0892,0.0215 0.1933,0.0215 z m 0.0264,0.80128 v 0.16686 h -1.0111 v -0.16686 l 0.20486,-0.033 q 0.043,-0.007 0.0644,-0.0331 0.0231,-0.0248 0.0231,-0.0677 v -2.05028 q 0,-0.043 -0.0215,-0.071 -0.0198,-0.0281 -0.0611,-0.0347 l -0.23295,-0.033 v -0.16191 q 0.13713,-0.0396 0.28416,-0.0628 0.1487,-0.0231 0.28747,-0.0248 l 0.0595,0.0578 0.0248,0.19 q 0.0909,-0.10904 0.22965,-0.18339 0.14043,-0.0743 0.34198,-0.0743 0.15696,0 0.29078,0.0529 0.13547,0.0512 0.23295,0.16025 0.0975,0.10904 0.15364,0.28086 0.0562,0.17017 0.0562,0.40477 0,0.24947 -0.0661,0.44938 -0.0661,0.19825 -0.18999,0.33538 -0.12226,0.13712 -0.30234,0.21147 -0.17843,0.0727 -0.40312,0.0727 -0.076,0 -0.16521,-0.0116 -0.0876,-0.01 -0.16521,-0.0331 v 0.52703 q 0,0.0429 0.0231,0.0677 0.0231,0.0264 0.0677,0.0314 z"
         style="font-style:normal;font-variant:normal;font-weight:normal;font-stretch:normal;font-family:Yrsa;-inkscape-font-specification:Yrsa;text-align:center;text-anchor:middle;stroke-width:0.34074953"
         id="path914" />
      <path
         d="m 152.08291,257.25763 q -0.17843,0 -0.29573,0.12391 -0.1173,0.12225 -0.152,0.39155 h 0.83102 q 0.002,-0.0182 0.003,-0.0364 0.002,-0.0198 0.002,-0.0413 0,-0.1933 -0.10078,-0.31555 -0.10078,-0.12226 -0.28747,-0.12226 z m 0.73519,1.33161 q -0.0661,0.1999 -0.25773,0.32546 -0.19164,0.12391 -0.47581,0.12391 -0.21147,0 -0.37007,-0.071 -0.15696,-0.0727 -0.26104,-0.1999 -0.10243,-0.12722 -0.15365,-0.30399 -0.0512,-0.17678 -0.0512,-0.38495 0,-0.23625 0.0628,-0.42459 0.0628,-0.18834 0.17843,-0.31721 0.11565,-0.13052 0.27921,-0.19825 0.16356,-0.0694 0.36346,-0.0694 0.15365,0 0.28086,0.0429 0.12722,0.0413 0.21808,0.12226 0.0909,0.0809 0.14043,0.20321 0.0512,0.12226 0.0512,0.28251 0,0.0463 -0.005,0.11235 -0.005,0.0644 -0.0132,0.11564 h -1.18291 q 0,0.0116 0,0.0248 0,0.0132 0,0.0264 0,0.22304 0.0429,0.37668 0.043,0.152 0.1173,0.24452 0.0744,0.0909 0.17678,0.13051 0.10243,0.0397 0.22138,0.0397 0.16191,0 0.29904,-0.0727 0.13878,-0.0727 0.21973,-0.1966 z"
         style="font-style:normal;font-variant:normal;font-weight:normal;font-stretch:normal;font-family:Yrsa;-inkscape-font-specification:Yrsa;text-align:center;text-anchor:middle;stroke-width:0.34074953"
         id="path916" />
      <path
         d="m 153.74104,258.79575 q 0,0.10409 -0.0677,0.17182 -0.0677,0.0661 -0.17677,0.0661 -0.10904,0 -0.17678,-0.0661 -0.0661,-0.0677 -0.0661,-0.17182 0,-0.10573 0.0661,-0.17182 0.0677,-0.0661 0.17678,-0.0661 0.10904,0 0.17677,0.0661 0.0677,0.0661 0.0677,0.17182 z"
         style="font-style:normal;font-variant:normal;font-weight:normal;font-stretch:normal;font-family:Yrsa;-inkscape-font-specification:Yrsa;text-align:center;text-anchor:middle;stroke-width:0.34074953"
         id="path918" />
      <path
         d="m 154.16246,258.06552 q 0,-0.25939 0.071,-0.44938 0.0727,-0.18999 0.19495,-0.3106 0.12226,-0.1206 0.28747,-0.17843 0.16686,-0.0578 0.35355,-0.0578 0.21974,0 0.37999,0.071 0.16191,0.0694 0.26434,0.1966 0.10408,0.12556 0.15365,0.30729 0.0496,0.18009 0.0496,0.39982 0,0.25938 -0.0727,0.44937 -0.071,0.18835 -0.1933,0.30895 -0.12226,0.1206 -0.28912,0.17843 -0.16686,0.0578 -0.35355,0.0578 -0.21974,0 -0.38164,-0.0694 -0.16026,-0.071 -0.26269,-0.1966 -0.10243,-0.12721 -0.152,-0.30729 -0.0496,-0.18174 -0.0496,-0.39981 z m 1.363,0.0116 q 0,-0.18669 -0.0248,-0.33868 -0.0231,-0.152 -0.081,-0.25773 -0.0578,-0.10739 -0.15364,-0.16522 -0.0958,-0.0578 -0.23956,-0.0578 -0.24121,0 -0.35851,0.18338 -0.11565,0.18339 -0.11565,0.58981 0,0.18504 0.0231,0.33703 0.0248,0.152 0.081,0.25939 0.0578,0.10573 0.15365,0.16521 0.0975,0.0578 0.24286,0.0578 0.23956,0 0.35521,-0.18338 0.1173,-0.18504 0.1173,-0.58981 z"
         style="font-style:normal;font-variant:normal;font-weight:normal;font-stretch:normal;font-family:Yrsa;-inkscape-font-specification:Yrsa;text-align:center;text-anchor:middle;stroke-width:0.34074953"
         id="path920" />
      <path
         d="m 157.34124,258.8354 v 0.16356 h -1.07388 v -0.16851 l 0.20321,-0.0314 q 0.043,-0.007 0.0661,-0.0314 0.0248,-0.0264 0.0248,-0.0694 v -1.22422 q 0,-0.0496 -0.0215,-0.0777 -0.0198,-0.0281 -0.0677,-0.0347 l -0.228,-0.033 v -0.16191 q 0.13052,-0.0396 0.28252,-0.0628 0.15199,-0.0231 0.28086,-0.0248 l 0.0562,0.0529 0.038,0.30234 q 0.0512,-0.0711 0.12225,-0.13713 0.071,-0.0661 0.152,-0.11565 0.081,-0.0512 0.17017,-0.0809 0.0909,-0.0314 0.18008,-0.0314 0.0512,0 0.1173,0.0116 0.0661,0.0116 0.10739,0.033 0.0116,0.13878 0,0.31391 -0.01,0.17512 -0.0396,0.31886 h -0.17348 l -0.0479,-0.25608 q -0.0116,-0.0545 -0.038,-0.076 -0.0248,-0.0215 -0.0743,-0.0215 -0.11565,-0.002 -0.23791,0.0463 -0.1206,0.0479 -0.22469,0.152 v 1.10692 q 0,0.0446 0.0231,0.071 0.0248,0.0248 0.0694,0.0297 z"
         style="font-style:normal;font-variant:normal;font-weight:normal;font-stretch:normal;font-family:Yrsa;-inkscape-font-specification:Yrsa;text-align:center;text-anchor:middle;stroke-width:0.34074953"
         id="path922" />
      <path
         d="m 158.45452,257.71361 q 0,0.23956 0.0975,0.36677 0.0991,0.12557 0.31556,0.12557 0.18669,0 0.28416,-0.1107 0.0991,-0.11069 0.0991,-0.36181 0,-0.25112 -0.0991,-0.36677 -0.0991,-0.11565 -0.30894,-0.11565 -0.16191,0 -0.27591,0.0942 -0.11234,0.0942 -0.11234,0.36842 z m 1.39273,1.48691 q 0,0.16191 -0.0777,0.29408 -0.076,0.13217 -0.21312,0.22303 -0.13713,0.0925 -0.32877,0.14209 -0.18999,0.0512 -0.41633,0.0512 -0.39156,0 -0.58981,-0.14373 -0.19826,-0.14374 -0.19826,-0.37834 0,-0.16686 0.0892,-0.27755 0.0909,-0.10904 0.22964,-0.17513 -0.081,-0.0413 -0.12225,-0.10904 -0.0413,-0.0694 -0.0413,-0.16356 0,-0.13382 0.0727,-0.21643 0.0727,-0.0842 0.17347,-0.13547 -0.15695,-0.0743 -0.24617,-0.21643 -0.0876,-0.14208 -0.0876,-0.34364 0,-0.17182 0.0628,-0.30068 0.0628,-0.13052 0.16852,-0.21313 0.10739,-0.0842 0.25277,-0.12556 0.14539,-0.0429 0.30895,-0.0429 0.16025,0 0.29242,0.0413 0.13217,0.0396 0.22634,0.1173 0.081,-0.076 0.15861,-0.1173 0.0777,-0.043 0.1586,-0.043 0.0413,0 0.0925,0.01 0.0512,0.008 0.0925,0.0198 v 0.26765 h -0.38164 q 0.0413,0.0694 0.0644,0.1553 0.0231,0.0842 0.0231,0.18338 0,0.31225 -0.21477,0.49894 -0.21478,0.18669 -0.57494,0.18669 -0.0677,0 -0.13217,-0.007 -0.0644,-0.008 -0.12226,-0.0215 -0.0463,0.0331 -0.0727,0.0793 -0.0264,0.0446 -0.0264,0.10573 0,0.10078 0.0859,0.14374 0.0876,0.0413 0.28417,0.0413 h 0.40642 q 0.29903,0 0.45103,0.12391 0.15199,0.12391 0.15199,0.34529 z m -0.96979,0.51546 q 0.27425,0 0.44772,-0.11234 0.17513,-0.11069 0.17513,-0.33703 0,-0.12226 -0.0727,-0.19165 -0.071,-0.0694 -0.28252,-0.0694 h -0.42459 q -0.0611,0 -0.11565,-0.005 -0.0545,-0.003 -0.10078,-0.0116 -0.0578,0.0611 -0.0958,0.14373 -0.038,0.0843 -0.038,0.19826 0,0.16521 0.10739,0.27425 0.10904,0.11069 0.39981,0.11069 z"
         style="font-style:normal;font-variant:normal;font-weight:normal;font-stretch:normal;font-family:Yrsa;-inkscape-font-specification:Yrsa;text-align:center;text-anchor:middle;stroke-width:0.34074953"
         id="path924" />
      <path
         d="m 138.06168,273.63591 v 1.07718 q 0.0545,0.003 0.11895,0.005 0.0644,0.002 0.12391,0.002 0.0595,0 0.10904,0 0.0512,0 0.0777,0 0.20982,-0.002 0.34198,-0.14208 0.13383,-0.14043 0.13383,-0.43947 0,-0.24947 -0.12556,-0.38659 -0.12391,-0.13713 -0.46095,-0.13713 -0.0975,0 -0.18669,0.008 -0.0876,0.008 -0.13216,0.0132 z m 0.36842,2.23201 v 0.16852 h -1.08544 v -0.16852 l 0.26103,-0.0496 q 0.0413,-0.008 0.0644,-0.0314 0.0248,-0.0248 0.0248,-0.0694 v -1.93628 q 0,-0.043 -0.0231,-0.0677 -0.0231,-0.0264 -0.0644,-0.0347 l -0.26268,-0.0512 v -0.17182 h 0.53363 q 0.14373,0 0.27095,-0.0116 0.12721,-0.0132 0.29242,-0.0132 0.49564,0 0.70711,0.17016 0.21147,0.16852 0.21147,0.51381 0,0.19165 -0.0562,0.32382 -0.0545,0.13052 -0.13713,0.21477 -0.0826,0.0826 -0.18173,0.12722 -0.0975,0.0446 -0.18339,0.0661 0.0925,0.0611 0.16356,0.15365 0.071,0.0925 0.14209,0.22964 l 0.24781,0.47747 q 0.0314,0.0611 0.0611,0.0842 0.0297,0.0231 0.0859,0.0347 l 0.18339,0.0413 v 0.16852 h -0.51051 q -0.076,0 -0.14208,-0.10904 -0.0644,-0.10904 -0.15034,-0.29077 l -0.16521,-0.35191 q -0.0578,-0.12225 -0.11565,-0.22303 -0.0578,-0.10078 -0.11565,-0.16026 -0.12391,0 -0.23625,0 -0.1107,-0.002 -0.18834,-0.002 v 0.81945 q 0,0.0446 0.0231,0.0694 0.0231,0.0231 0.0677,0.0297 z"
         style="font-style:normal;font-variant:normal;font-weight:normal;font-stretch:normal;font-family:Yrsa;-inkscape-font-specification:Yrsa;text-align:center;text-anchor:middle;stroke-width:0.34074953"
         id="path926" />
      <path
         d="m 140.55574,275.84149 q 0.11896,0 0.24121,-0.0446 0.12226,-0.0463 0.20817,-0.1173 v -0.44112 l -0.31556,0.0281 q -0.1999,0.0165 -0.30729,0.0909 -0.10574,0.0743 -0.10574,0.22634 0,0.12225 0.0677,0.18999 0.0694,0.0677 0.21147,0.0677 z m 0.76328,0.22303 q -0.11895,0 -0.19495,-0.0595 -0.076,-0.0611 -0.10573,-0.17678 -0.10409,0.11235 -0.25939,0.18008 -0.1553,0.0661 -0.33207,0.0661 -0.11235,0 -0.20982,-0.0297 -0.0975,-0.0297 -0.16852,-0.0859 -0.0694,-0.0578 -0.11069,-0.14208 -0.0396,-0.0859 -0.0396,-0.19495 0,-0.14374 0.0661,-0.24121 0.0661,-0.0975 0.17017,-0.15695 0.10574,-0.0595 0.2346,-0.0892 0.13052,-0.0297 0.25608,-0.0396 l 0.37999,-0.0314 v -0.22304 q 0,-0.25442 -0.10243,-0.35851 -0.10078,-0.10408 -0.30895,-0.10408 -0.15695,0 -0.29738,0.0529 -0.13878,0.0512 -0.25773,0.16191 l -0.0843,-0.0843 q 0.0314,-0.0942 0.10243,-0.16687 0.071,-0.0743 0.16687,-0.1239 0.0975,-0.0496 0.21808,-0.0744 0.1206,-0.0264 0.25112,-0.0264 0.32877,0 0.49398,0.16686 0.16521,0.16521 0.16521,0.5072 v 0.9351 q 0,0.0529 0.0231,0.0777 0.0248,0.0231 0.071,0.0281 l 0.19,0.0165 v 0.15695 q -0.0413,0.0149 -0.14043,0.0363 -0.0975,0.0231 -0.17678,0.0231 z"
         style="font-style:normal;font-variant:normal;font-weight:normal;font-stretch:normal;font-family:Yrsa;-inkscape-font-specification:Yrsa;text-align:center;text-anchor:middle;stroke-width:0.34074953"
         id="path928" />
      <path
         d="m 142.30885,274.75109 q 0,0.23956 0.0975,0.36677 0.0991,0.12556 0.31556,0.12556 0.18669,0 0.28416,-0.11069 0.0991,-0.11069 0.0991,-0.36181 0,-0.25113 -0.0991,-0.36678 -0.0991,-0.11564 -0.30894,-0.11564 -0.16191,0 -0.27591,0.0942 -0.11234,0.0942 -0.11234,0.36842 z m 1.39273,1.48691 q 0,0.1619 -0.0777,0.29407 -0.076,0.13217 -0.21312,0.22304 -0.13713,0.0925 -0.32877,0.14208 -0.18999,0.0512 -0.41634,0.0512 -0.39155,0 -0.5898,-0.14374 -0.19826,-0.14373 -0.19826,-0.37833 0,-0.16687 0.0892,-0.27756 0.0909,-0.10904 0.22964,-0.17512 -0.0809,-0.0413 -0.12225,-0.10904 -0.0413,-0.0694 -0.0413,-0.16356 0,-0.13382 0.0727,-0.21643 0.0727,-0.0843 0.17347,-0.13547 -0.15695,-0.0743 -0.24617,-0.21643 -0.0876,-0.14208 -0.0876,-0.34364 0,-0.17182 0.0628,-0.30069 0.0628,-0.13051 0.16852,-0.21312 0.10739,-0.0843 0.25277,-0.12556 0.14539,-0.043 0.30895,-0.043 0.16025,0 0.29242,0.0413 0.13217,0.0396 0.22634,0.1173 0.081,-0.076 0.15861,-0.1173 0.0776,-0.043 0.1586,-0.043 0.0413,0 0.0925,0.01 0.0512,0.008 0.0925,0.0198 v 0.26764 h -0.38164 q 0.0413,0.0694 0.0644,0.1553 0.0231,0.0843 0.0231,0.18339 0,0.31225 -0.21478,0.49894 -0.21477,0.18669 -0.57493,0.18669 -0.0677,0 -0.13217,-0.007 -0.0644,-0.008 -0.12226,-0.0215 -0.0463,0.033 -0.0727,0.0793 -0.0264,0.0446 -0.0264,0.10574 0,0.10078 0.0859,0.14373 0.0876,0.0413 0.28417,0.0413 h 0.40642 q 0.29903,0 0.45103,0.12391 0.15199,0.12391 0.15199,0.3453 z m -0.96979,0.51546 q 0.27425,0 0.44772,-0.11235 0.17513,-0.11069 0.17513,-0.33703 0,-0.12226 -0.0727,-0.19164 -0.071,-0.0694 -0.28252,-0.0694 h -0.42459 q -0.0611,0 -0.11565,-0.005 -0.0545,-0.003 -0.10078,-0.0116 -0.0578,0.0611 -0.0958,0.14373 -0.038,0.0843 -0.038,0.19825 0,0.16522 0.10739,0.27426 0.10904,0.11069 0.39981,0.11069 z"
         style="font-style:normal;font-variant:normal;font-weight:normal;font-stretch:normal;font-family:Yrsa;-inkscape-font-specification:Yrsa;text-align:center;text-anchor:middle;stroke-width:0.34074953"
         id="path930" />
      <path
         d="m 144.86851,275.86792 v 0.16852 h -0.91528 v -0.16852 l 0.20322,-0.0314 q 0.0429,-0.007 0.0661,-0.0314 0.0231,-0.0248 0.0231,-0.0694 v -2.29314 q 0,-0.043 -0.0248,-0.0677 -0.0231,-0.0248 -0.0644,-0.0314 l -0.24287,-0.0363 v -0.15035 q 0.0694,-0.0215 0.15035,-0.038 0.0826,-0.0165 0.16521,-0.0264 0.0843,-0.0116 0.16521,-0.0182 0.0826,-0.007 0.152,-0.008 l 0.0529,0.0545 v 1.2457 q 0.13548,-0.13878 0.30399,-0.19495 0.16852,-0.0578 0.34034,-0.0578 0.32877,0 0.44772,0.19165 0.11896,0.19164 0.11896,0.53363 v 0.8971 q 0,0.043 0.0231,0.0694 0.0248,0.0248 0.0677,0.0314 l 0.20321,0.0314 v 0.16852 h -0.91692 v -0.16852 l 0.18008,-0.0314 q 0.0397,-0.007 0.0644,-0.0297 0.0248,-0.0248 0.0248,-0.071 v -0.83267 q 0,-0.2726 -0.0743,-0.40642 -0.0743,-0.13547 -0.28747,-0.13547 -0.13052,0 -0.25938,0.0396 -0.12722,0.0396 -0.23626,0.12226 v 1.21265 q 0,0.0446 0.0231,0.0694 0.0231,0.0231 0.0661,0.0314 z"
         style="font-style:normal;font-variant:normal;font-weight:normal;font-stretch:normal;font-family:Yrsa;-inkscape-font-specification:Yrsa;text-align:center;text-anchor:middle;stroke-width:0.34074953"
         id="path932" />
      <path
         d="m 147.21569,274.2951 q -0.17843,0 -0.29573,0.12391 -0.1173,0.12226 -0.15199,0.39156 h 0.83101 q 0.002,-0.0182 0.003,-0.0363 0.002,-0.0198 0.002,-0.0413 0,-0.1933 -0.10078,-0.31556 -0.10078,-0.12226 -0.28747,-0.12226 z m 0.73519,1.33161 q -0.0661,0.19991 -0.25773,0.32547 -0.19164,0.12391 -0.47581,0.12391 -0.21147,0 -0.37007,-0.071 -0.15695,-0.0727 -0.26104,-0.19991 -0.10243,-0.12721 -0.15364,-0.30399 -0.0512,-0.17678 -0.0512,-0.38494 0,-0.23626 0.0628,-0.4246 0.0628,-0.18834 0.17843,-0.3172 0.11565,-0.13052 0.27921,-0.19826 0.16356,-0.0694 0.36346,-0.0694 0.15365,0 0.28086,0.043 0.12722,0.0413 0.21808,0.12226 0.0909,0.081 0.14043,0.20321 0.0512,0.12225 0.0512,0.28251 0,0.0463 -0.005,0.11234 -0.005,0.0644 -0.0132,0.11565 h -1.18292 q 0,0.0116 0,0.0248 0,0.0132 0,0.0264 0,0.22303 0.043,0.37668 0.043,0.15199 0.1173,0.24451 0.0743,0.0909 0.17677,0.13052 0.10243,0.0396 0.22139,0.0396 0.1619,0 0.29903,-0.0727 0.13878,-0.0727 0.21973,-0.1966 z"
         style="font-style:normal;font-variant:normal;font-weight:normal;font-stretch:normal;font-family:Yrsa;-inkscape-font-specification:Yrsa;text-align:center;text-anchor:middle;stroke-width:0.34074953"
         id="path934" />
      <path
         d="m 149.20921,275.83323 q 0.1239,0 0.23294,-0.0413 0.10904,-0.0413 0.1933,-0.11069 v -1.29856 q -0.0595,-0.0347 -0.1553,-0.0595 -0.0942,-0.0248 -0.19825,-0.0248 -0.11565,0 -0.21973,0.0396 -0.10243,0.038 -0.17843,0.12887 -0.076,0.0909 -0.12061,0.24451 -0.0446,0.15365 -0.0446,0.38164 0,0.21477 0.0397,0.35851 0.0396,0.14208 0.10573,0.22799 0.0677,0.0843 0.15695,0.11895 0.0892,0.0347 0.18835,0.0347 z m 0.74675,0.23129 q -0.13382,0 -0.20651,-0.0694 -0.071,-0.0694 -0.0975,-0.17348 -0.0958,0.10574 -0.23955,0.18008 -0.14209,0.0727 -0.33208,0.0727 -0.15034,0 -0.28747,-0.0529 -0.13547,-0.0529 -0.23625,-0.16356 -0.10078,-0.11234 -0.16026,-0.28912 -0.0595,-0.17678 -0.0595,-0.42129 0,-0.26269 0.0694,-0.45929 0.071,-0.1966 0.1966,-0.32547 0.12721,-0.12886 0.30564,-0.19164 0.17843,-0.0644 0.3932,-0.0644 0.0925,0 0.17843,0.0116 0.0859,0.0116 0.1553,0.0281 v -0.69884 q 0,-0.0446 -0.0248,-0.0694 -0.0231,-0.0248 -0.0644,-0.0314 l -0.25112,-0.0347 v -0.15199 q 0.071,-0.0215 0.15364,-0.038 0.0826,-0.0165 0.16687,-0.0281 0.0859,-0.0116 0.16851,-0.0182 0.0826,-0.008 0.15365,-0.01 l 0.0512,0.0529 v 2.60539 q 0,0.0578 0.0264,0.0809 0.0281,0.0215 0.0694,0.0264 l 0.18999,0.0165 v 0.15695 q -0.0562,0.0182 -0.14869,0.038 -0.0925,0.0215 -0.17017,0.0215 z"
         style="font-style:normal;font-variant:normal;font-weight:normal;font-stretch:normal;font-family:Yrsa;-inkscape-font-specification:Yrsa;text-align:center;text-anchor:middle;stroke-width:0.34074953"
         id="path936" />
    </g>
    <path
       style="fill:none;stroke:#000000;stroke-width:0.2567932px;stroke-linecap:butt;stroke-linejoin:miter;stroke-opacity:1"
       d="m 131.46309,252.23234 h 24.54688"
       id="path6648"
       inkscape:connector-curvature="0" />
  </g>
</svg>
