<?xml version="1.0" encoding="UTF-8" standalone="no"?>
<svg
   xmlns:dc="http://purl.org/dc/elements/1.1/"
   xmlns:cc="http://creativecommons.org/ns#"
   xmlns:rdf="http://www.w3.org/1999/02/22-rdf-syntax-ns#"
   xmlns:svg="http://www.w3.org/2000/svg"
   xmlns="http://www.w3.org/2000/svg"
   xmlns:sodipodi="http://sodipodi.sourceforge.net/DTD/sodipodi-0.dtd"
   xmlns:inkscape="http://www.inkscape.org/namespaces/inkscape"
   inkscape:export-ydpi="96"
   inkscape:export-xdpi="96"
   inkscape:export-filename="/home/doctormo/Desktop/sfc.png"
   inkscape:version="1.0alpha (c15df26511, 2019-01-24, custom)"
   sodipodi:docname="sfc.svg"
   viewBox="0 0 162 69.999997"
   height="70"
   width="162"
   id="svg2"
   version="1.1">
  <metadata
     id="metadata8">
    <rdf:RDF>
      <cc:Work
         rdf:about="">
        <dc:format>image/svg+xml</dc:format>
        <dc:type
           rdf:resource="http://purl.org/dc/dcmitype/StillImage" />
        <dc:title></dc:title>
      </cc:Work>
    </rdf:RDF>
  </metadata>
  <defs
     id="defs6" />
  <sodipodi:namedview
     inkscape:current-layer="g10"
     inkscape:cy="-50.320571"
     inkscape:cx="108.17308"
     inkscape:zoom="1.0475803"
     showgrid="false"
     id="namedview4"
     inkscape:window-height="480"
     inkscape:window-width="640"
     inkscape:pageshadow="2"
     inkscape:pageopacity="1"
     guidetolerance="10"
     gridtolerance="10"
     objecttolerance="10"
     borderopacity="1"
     inkscape:document-rotation="0"
     bordercolor="#666666"
     pagecolor="#ffffff" />
  <g
     transform="translate(-32.303028,157.368)"
     id="g10"
     inkscape:label="Image"
     inkscape:groupmode="layer">
    <g
       style="opacity:1;stroke-width:1.10554;stop-opacity:1"
       transform="matrix(0.48790926,0,0,0.48790926,-286.29374,-403.92258)"
       id="g3114">
      <g
         transform="matrix(0.38392529,0,0,0.38392529,621.68182,395.0987)"
         id="g4365"
         style="stroke-width:1.10554">
        <path
           inkscape:connector-curvature="0"
           id="path4367"
           d="M 294.8728,344.65416 C 276.87689,344.85763 261.95468,357.03647 260.70865,373.10632 260.57243,374.8619 260.62625,376.57859 260.81625,378.27944 254.92197,376.39153 248.56186,375.13573 241.84815,374.61515 212.61315,372.34828 187.18254,385.12875 181.3873,403.92949 162.05277,410.19104 146.70491,422.3697 139.14016,437.98587 121.97026,437.09216 107.06991,450.13291 105.73042,467.40799 104.36968,484.95732 117.42253,500.32183 134.937,501.67991 140.47951,502.10966 145.83652,501.0301 150.56413,498.8778 164.24293,513.27877 185.32594,523.40657 209.51614,525.28227 231.3076,526.97195 251.53885,521.62536 266.85156,511.70283 272.90111,521.7042 284.13616,529.10307 297.56696,531.10203 V 531.42518 C 297.96798,531.38588 298.35507,531.25861 298.75247,531.20963 299.1578,531.25963 299.52888,531.38483 299.93797,531.42518 V 531.10203 C 313.38964,529.11338 324.59679,521.71585 330.65337,511.70283 345.96609,521.62536 366.30514,526.97199 388.09656,525.28227 412.28676,523.4066 433.26201,513.27877 446.94081,498.8778 451.66846,501.0301 457.02546,502.10969 462.56795,501.67991 480.08241,500.32186 493.24303,484.95728 491.88229,467.40799 490.5428,450.13291 475.64246,437.09216 458.47256,437.98587 450.9078,422.3697 435.45217,410.19104 416.11763,403.92949 410.32239,385.12875 384.99956,372.34828 355.76456,374.61515 349.05085,375.13573 342.69074,376.39153 336.79645,378.27944 336.98648,376.57859 337.04063,374.8619 336.90405,373.10632 335.65802,357.03647 320.62804,344.85774 302.63213,344.65416 301.43238,344.64036 300.19128,344.66796 298.96784,344.76176 298.89544,344.76876 298.82403,344.75476 298.75229,344.76176 298.68059,344.75476 298.60917,344.76876 298.53675,344.76176 297.3133,344.66696 296.0722,344.64002 294.87245,344.65416 Z M 298.32154,366.20883 H 298.86041 C 301.91414,366.20883 304.68228,367.06784 306.72787,368.57984 308.77345,370.09184 310.06884,372.24565 310.06884,374.61515 310.06884,375.31455 309.85226,376.00389 309.63775,376.66284 L 318.69071,383.34479 C 320.5742,382.28926 322.75968,381.62041 325.26488,381.62041 328.31768,381.62041 331.08647,382.48743 333.13233,383.99143 335.1782,385.49543 336.58108,387.65734 336.58108,390.02673 336.58108,391.58605 335.8307,392.98086 334.85671,394.22989 L 347.57396,403.4984 C 349.18442,402.82465 350.99374,402.42067 352.96263,402.42067 356.01635,402.42067 358.8923,403.27965 360.93785,404.79168 362.98341,406.30371 364.27883,408.45749 364.27883,410.82699 364.27883,412.16507 363.71634,413.38082 362.98555,414.49128 L 375.05616,423.22092 C 376.68552,422.52755 378.55502,422.03541 380.5526,422.03541 383.60633,422.03541 386.3745,422.89439 388.42006,424.40643 390.46561,425.91846 391.76103,428.07234 391.76103,430.44174 391.76103,432.81123 390.46561,434.96504 388.42006,436.47704 386.3745,437.98904 383.60633,438.84806 380.5526,438.84806 377.49888,438.84806 374.73074,437.98904 372.68515,436.47704 370.63956,434.96504 369.2364,432.81123 369.2364,430.44174 369.2364,428.61259 370.20233,426.95891 371.49964,425.59193 L 360.18344,417.29339 C 358.22307,418.53083 355.6981,419.34108 352.96263,419.34108 350.46863,419.34108 348.26516,418.66295 346.38845,417.61671 L 337.33549,424.19088 C 338.11636,425.1436 338.78859,426.17384 339.05987,427.31631 339.15027,427.69712 339.16747,428.09697 339.16747,428.50181 339.16747,430.87121 337.87205,433.02509 335.82649,434.53712 334.80373,435.29312 333.59943,435.96552 332.26997,436.36927 331.60526,436.57102 330.94317,436.69621 330.22228,436.80036 329.50139,436.90451 328.72245,436.90796 327.95904,436.90796 325.55751,436.90796 323.32893,436.37506 321.49264,435.39914 L 308.77539,444.77542 C 310.08622,445.8805 311.06094,447.33549 311.46972,448.8708 311.60595,449.38256 311.68527,449.83835 311.68527,450.37963 311.68527,452.74902 310.38985,454.79513 308.34429,456.30716 307.83291,456.68518 307.32257,457.08165 306.72769,457.3849 305.53791,457.99143 304.1819,458.44966 302.74008,458.67818 302.01919,458.79233 301.24025,458.78578 300.47684,458.78578 297.42311,458.78578 294.65494,457.81903 292.60939,456.30699 291.58663,455.55096 290.71016,454.71712 290.1306,453.72043 289.84091,453.22209 289.63736,452.65249 289.48396,452.10383 289.33049,451.55517 289.26841,450.97181 289.26841,450.37946 289.26841,448.01007 290.56383,445.85615 292.60939,444.34415 294.65494,442.83215 297.42311,441.86536 300.47684,441.86536 302.00129,441.86536 303.45987,442.20265 304.78777,442.61978 L 318.47499,432.70463 C 317.98602,432.08158 317.59832,431.46412 317.28948,430.76471 316.98047,430.0653 316.75061,429.28403 316.75061,428.50147 316.75061,426.13197 318.04572,423.97013 320.09159,422.46616 320.60304,422.09018 321.11321,421.78897 321.70819,421.4962 323.49312,420.61788 325.66945,420.09515 327.95904,420.09515 330.25473,420.09515 332.30932,420.70492 334.10212,421.60398 L 343.37063,414.92203 C 342.91853,414.31798 342.47626,413.66741 342.18512,412.98211 341.89405,412.29681 341.75403,411.57678 341.75403,410.82664 341.75403,408.97332 342.79596,407.35627 344.12504,405.97684 L 331.62333,396.81611 C 329.79798,397.76779 327.63217,398.43271 325.26471,398.43271 322.57741,398.43271 320.20408,397.69068 318.25944,396.49279 L 307.80543,404.1447 C 308.73945,405.15342 309.43099,406.3232 309.74535,407.59344 309.85019,408.01685 309.96089,408.43911 309.96089,408.88672 309.96089,411.25618 308.66547,413.41 306.61992,414.92203 306.10854,415.30005 305.50053,415.70662 304.89555,415.99976 303.68555,416.58608 302.36996,416.97697 300.90793,417.18527 300.17694,417.28942 299.40811,417.29287 298.64469,417.29287 295.59097,417.29287 292.8228,416.43389 290.77724,414.92186 288.73169,413.40982 287.43627,411.25601 287.43627,408.88655 287.43627,406.51705 288.73138,404.35521 290.77724,402.85124 292.82311,401.34728 295.5919,400.48023 298.64469,400.48023 300.74932,400.48023 302.77336,400.90163 304.46445,401.66574 L 315.34956,393.69051 C 314.61418,392.57505 314.05628,391.3674 314.05628,390.02622 314.05628,389.66096 314.09078,389.29905 314.16388,388.94848 314.38701,387.89679 314.92092,386.91948 315.56493,386.0386 L 307.37416,380.0033 C 305.29346,381.86969 302.29943,383.12872 298.86007,383.12872 295.99674,383.12872 293.42443,382.10338 291.42371,380.75771 L 283.34071,386.36192 C 284.05491,387.46511 284.52622,388.70773 284.52622,390.02622 284.52622,392.39571 283.2308,394.44175 281.18524,395.95375 279.13969,397.46575 276.37148,398.43254 273.31779,398.43254 271.27913,398.43254 269.36863,397.96789 267.71357,397.24703 L 254.99632,405.8689 C 256.41269,407.27192 257.58288,408.90559 257.58288,410.82647 257.58288,411.21276 257.56218,411.64258 257.47528,412.01198 257.2149,413.1202 256.5774,414.09774 255.85868,415.02963 L 265.12719,421.71158 C 266.49672,421.26134 267.95823,420.95716 269.54589,420.95716 272.59959,420.95716 275.36776,421.92399 277.41335,423.43595 279.45894,424.94792 280.75432,426.99399 280.75432,429.36348 280.75432,431.73298 279.45894,433.88679 277.41335,435.39879 275.36776,436.91079 272.59962,437.87758 269.54589,437.87758 266.4922,437.87758 263.71634,436.91124 261.67844,435.39879 259.64054,433.88634 258.33747,431.73174 258.33747,429.36348 258.33747,428.27768 258.5844,427.26375 259.09188,426.34583 259.34571,425.88687 259.70655,425.46747 260.06184,425.05255 260.41713,424.63763 260.80749,424.23651 261.24735,423.86704 L 252.73325,417.61619 C 250.90242,418.58067 248.75988,419.34056 246.37463,419.34056 243.4185,419.34056 240.74375,418.2867 238.72272,416.86178 L 226.86765,425.05255 C 228.2994,426.17412 229.42338,427.64915 229.88531,429.25571 230.03912,429.79123 230.10085,430.30296 230.10085,430.87231 230.10085,431.90197 229.68697,432.77233 229.23867,433.67442 L 239.69268,441.21855 C 241.09901,440.74211 242.58352,440.46414 244.21916,440.46414 247.27285,440.46414 250.14883,441.32315 252.19439,442.83515 254.23994,444.34715 255.53536,446.50107 255.53536,448.87046 255.53536,451.23995 254.24025,453.4018 252.19439,454.90577 250.14852,456.40973 247.27192,457.27678 244.21916,457.27678 242.69278,457.27678 241.23775,457.14262 239.90823,456.73791 239.24345,456.53547 238.56328,456.27626 237.96831,455.9835 237.37333,455.6907 236.86316,455.28175 236.35171,454.90577 234.30584,453.4018 233.01073,451.23995 233.01073,448.87046 233.01073,446.75869 234.35147,444.94951 236.02839,443.48179 L 226.54433,436.69207 C 224.50292,438.19859 221.83324,439.27863 218.78465,439.27863 215.2968,439.27863 212.24031,438.06436 210.16278,436.1532 L 198.95436,443.91288 C 199.49702,444.5577 200.00609,445.33204 200.35541,446.06835 200.52992,446.43651 200.68925,446.75489 200.7865,447.14609 200.8838,447.53728 200.8941,447.91729 200.8941,448.33159 200.8941,450.70116 199.599,452.8629 197.55313,454.3669 197.04168,454.74288 196.53151,455.15183 195.93653,455.44463 194.74658,456.03019 193.3906,456.42056 191.94892,456.63014 191.2281,456.73498 190.44885,456.73774 189.68568,456.73774 186.63288,456.73774 183.75632,455.87072 181.71045,454.36673 179.66459,452.86273 178.36948,450.70098 178.36948,448.33142 178.36948,445.96203 179.6649,443.80811 181.71045,442.29611 183.75601,440.78411 186.63195,439.9251 189.68568,439.9251 191.81362,439.9251 193.69095,440.43748 195.39766,441.21838 L 208.00715,432.59651 C 207.82816,432.02471 207.57605,431.50591 207.57605,430.87214 207.57605,428.50275 208.87147,426.34887 210.91703,424.83683 212.96258,423.3248 215.73079,422.35804 218.78448,422.35804 220.08659,422.35804 221.38683,422.58773 222.55655,422.89691 L 224.28092,421.60363 224.49647,421.49603 235.92044,413.73635 C 235.46717,412.82278 235.05825,411.86078 235.05825,410.82647 235.05825,408.45708 236.35367,406.3032 238.39923,404.79116 240.44478,403.27913 243.32073,402.42015 246.37445,402.42015 248.10755,402.42015 249.64421,402.75088 251.11648,403.28234 L 252.62531,402.31238 264.04928,394.44492 C 262.9482,393.14823 262.00159,391.69686 262.00159,390.02622 262.00159,387.65672 263.40447,385.49487 265.45033,383.99091 267.4962,382.48695 270.26499,381.6199 273.31779,381.6199 275.93704,381.6199 278.28716,382.30689 280.21528,383.45204 L 288.51383,377.84783 C 287.97162,376.86252 287.54387,375.75272 287.54387,374.61463 287.54387,372.24524 288.83929,370.09136 290.88484,368.57932 292.79586,367.16675 295.50326,366.42782 298.3212,366.31608 V 366.20848 Z M 298.86041,369.76535 C 296.77137,369.76535 294.84414,370.44385 293.57952,371.38195 292.6268,372.08856 291.99527,372.8916 291.74737,373.75296 291.66457,374.04024 291.63977,374.30786 291.63977,374.61515 291.63977,375.53731 291.99327,376.4177 292.71751,377.20171 292.95892,377.46312 293.26213,377.72054 293.57969,377.95612 294.52816,378.65959 295.86914,379.23012 297.35176,379.46495 297.84596,379.54325 298.33834,379.57255 298.86058,379.57255 300.94983,379.57255 302.75915,378.89656 304.0337,377.95595 305.31402,377.01096 305.97362,375.83549 305.97362,374.61497 305.97362,373.39484 305.31395,372.32656 304.0337,371.38177 302.75915,370.44102 300.94983,369.76517 298.86058,369.76517 Z M 273.31813,385.17693 C 271.22799,385.17693 269.30276,385.75353 268.03724,386.68576 267.08359,387.38841 266.53014,388.27163 266.31287,389.16455 266.24047,389.46217 266.20527,389.71942 266.20527,390.02673 266.20527,390.94862 266.48116,391.82926 267.17523,392.61329 267.40664,392.87471 267.71985,393.13216 268.03741,393.36771 269.30203,394.3058 271.22923,394.87653 273.31831,394.87653 275.40749,394.87653 277.21684,394.30846 278.49143,393.36771 279.77167,392.42289 280.43135,391.247 280.43135,390.02673 280.43135,388.80657 279.77295,387.6252 278.49143,386.68576 277.21594,385.75087 275.40856,385.17693 273.31831,385.17693 Z M 325.26488,385.17693 C 323.1748,385.17693 321.35728,385.75353 320.09176,386.68576 319.13811,387.38841 318.5072,388.27163 318.25961,389.16455 318.17721,389.46217 318.15201,389.71942 318.15201,390.02673 318.15201,390.94862 318.50551,391.82926 319.22974,392.61329 319.47116,392.87471 319.77437,393.13216 320.09193,393.36771 321.35655,394.3058 323.17601,394.87653 325.26505,394.87653 327.3543,394.87653 329.27136,394.30846 330.54595,393.36771 331.82619,392.42289 332.48587,391.247 332.48587,390.02673 332.48587,388.80657 331.82747,387.6252 330.54595,386.68576 329.27046,385.75087 327.35534,385.17693 325.26505,385.17693 Z M 298.64486,404.03727 C 296.55461,404.03727 294.74726,404.71888 293.47175,405.65387 292.51065,406.35831 291.88484,407.16411 291.6396,408.02488 291.5579,408.31182 291.532,408.58203 291.532,408.88707 291.532,409.80243 291.88408,410.68718 292.60973,411.47363 292.85149,411.73573 293.15188,411.99184 293.47192,412.22804 294.42788,412.93362 295.68622,413.5027 297.13621,413.73687 297.61955,413.81477 298.12272,413.84447 298.64504,413.84447 300.73408,413.84447 302.66134,413.166 303.92593,412.22787 305.19621,411.28574 305.86585,410.11624 305.86585,408.8869 305.86585,407.65787 305.19745,406.59037 303.92593,405.65369 302.66041,404.72133 300.73515,404.03709 298.64504,404.03709 Z M 246.3748,405.97719 C 244.28469,405.97719 242.35935,406.66142 241.09391,407.59379 240.14026,408.29626 239.50934,409.17959 239.26176,410.07257 239.17936,410.3702 239.15416,410.62744 239.15416,410.93476 239.15416,411.85675 239.50765,412.76763 240.23189,413.52132 240.4733,413.77273 240.77652,413.93241 241.09408,414.16796 242.04255,414.87144 243.38353,415.44196 244.86614,415.67679 245.36035,415.75509 245.85269,415.78439 246.37497,415.78439 248.46419,415.78439 250.2735,415.1085 251.54809,414.16779 252.8284,413.2228 253.48801,412.15493 253.48801,410.93459 253.48801,409.71442 252.82961,408.53305 251.54809,407.59362 250.27257,406.65873 248.46522,405.97701 246.37497,405.97701 Z M 352.96263,405.97719 C 350.87238,405.97719 349.06503,406.6589 347.78951,407.59379 346.82838,408.29837 346.2026,409.18152 345.95736,410.07257 345.87566,410.36951 345.84976,410.62972 345.84976,410.93476 345.84976,411.84999 346.20184,412.76511 346.92749,413.52132 347.16925,413.77342 347.4696,413.93172 347.78968,414.16796 348.74564,414.87351 350.00398,415.44258 351.45397,415.67679 351.93731,415.75469 352.44049,415.78439 352.9628,415.78439 355.05184,415.78439 356.97904,415.10574 358.24369,414.16779 359.51397,413.22563 360.18361,412.16393 360.18361,410.93459 360.18361,409.70539 359.51518,408.53026 358.24369,407.59362 356.97821,406.66121 355.05291,405.97701 352.9628,405.97701 Z M 327.95921,423.65201 C 325.86907,423.65201 323.9438,424.33625 322.67832,425.26861 321.72467,425.97123 321.17122,426.77699 320.95395,427.63963 320.88155,427.92725 320.84634,428.19453 320.84634,428.50181 320.84634,429.4238 321.12224,430.30434 321.8163,431.08838 322.04772,431.34979 322.36093,431.6072 322.67849,431.84279 323.62697,432.54626 324.96794,433.11679 326.45056,433.35162 326.94476,433.42992 327.43711,433.45922 327.95939,433.45922 330.04864,433.45922 331.96569,432.78319 333.24028,431.84262 334.52059,430.89762 335.07243,429.72198 335.07243,428.50164 335.07243,427.28148 334.5218,426.20788 333.24028,425.26844 331.96479,424.33356 330.04967,423.65184 327.95939,423.65184 Z M 269.54607,424.5142 C 267.45702,424.5142 265.63753,425.19285 264.37295,426.1308 263.42023,426.83759 262.78866,427.71791 262.5408,428.60959 262.458,428.90687 262.4332,429.16442 262.4332,429.47178 262.4332,430.70094 263.10284,431.87059 264.37312,432.81275 265.32159,433.51633 266.58511,434.00933 268.03741,434.2138 268.52151,434.2821 269.02399,434.3214 269.54624,434.3214 271.63549,434.3214 273.55254,433.75333 274.82713,432.81258 276.10738,431.86776 276.76705,430.69191 276.76705,429.4716 276.76705,428.2513 276.10741,427.07559 274.82713,426.13063 273.55254,425.18988 271.63549,424.51403 269.54624,424.51403 Z M 380.5526,425.59193 C 378.46249,425.59193 376.53719,426.27634 375.27171,427.20853 374.31806,427.91118 373.76461,428.71695 373.54733,429.57955 373.47493,429.86717 373.43973,430.13449 373.43973,430.44174 373.43973,431.3639 373.71563,432.24426 374.40969,433.0283 374.6411,433.28971 374.95429,433.54706 375.27188,433.78271 376.22032,434.48618 377.5613,435.05671 379.04395,435.29154 379.53815,435.36984 380.0305,435.39914 380.55278,435.39914 382.64182,435.39914 384.46127,434.72053 385.7259,433.78254 386.99631,432.83996 387.66582,431.67111 387.66582,430.44156 387.66582,429.2126 386.99741,428.14521 385.7259,427.20836 384.46038,426.27613 382.64289,425.59176 380.55278,425.59176 Z M 218.78482,425.91508 C 216.69578,425.91508 214.87633,426.59355 213.6117,427.53168 212.65899,428.2383 212.02745,429.1188 211.77956,430.01047 211.69676,430.30775 211.67196,430.56534 211.67196,430.87266 211.67196,431.79454 212.02528,432.70625 212.74969,433.45922 212.9911,433.71028 213.29401,433.87169 213.61188,434.10586 214.56097,434.80516 215.8239,435.37855 217.27617,435.61468 217.76027,435.69328 218.26248,435.72228 218.785,435.72228 220.87514,435.72228 222.80041,435.03809 224.06589,434.10568 225.33741,433.169 226.00581,432.10165 226.00581,430.87248 226.00581,429.64328 225.33617,428.47367 224.06589,427.53151 222.80127,426.59338 220.87408,425.91491 218.785,425.91491 Z M 189.68602,443.48214 C 187.59694,443.48214 185.66978,444.16075 184.40513,445.09874 183.45245,445.80532 182.82088,446.68582 182.57298,447.57752 182.49018,447.87481 182.46538,448.13239 182.46538,448.43971 182.46538,449.36132 182.81871,450.2732 183.54312,451.02627 183.78453,451.27734 184.08743,451.43871 184.4053,451.67291 185.35447,452.37207 186.69482,452.94557 188.17737,453.18174 188.67154,453.26034 189.16368,453.28934 189.6862,453.28934 191.77624,453.28934 193.59376,452.60497 194.85932,451.67274 196.13083,450.73589 196.79924,449.66836 196.79924,448.43954 196.79924,447.2102 196.12956,446.04069 194.85932,445.09856 193.59466,444.16057 191.77524,443.48196 189.6862,443.48196 Z M 244.21933,444.021 C 242.13025,444.021 240.31083,444.69948 239.04621,445.6376 238.0935,446.34422 237.46196,447.14726 237.21406,448.00862 237.13126,448.2959 237.10646,448.56349 237.10646,448.8708 237.10646,449.48547 237.31925,450.13846 237.64533,450.70295 237.80846,450.98506 237.94261,451.19629 238.1842,451.45736 238.42561,451.71843 238.72851,451.97761 239.04638,452.21178 239.99551,452.91104 241.25841,453.48447 242.71068,453.7206 243.19478,453.7992 243.69698,453.8282 244.2195,453.8282 246.30972,453.8282 248.22491,453.14659 249.5004,452.2116 250.78192,451.2723 251.44032,450.09094 251.44032,448.87063 251.44032,447.6505 250.78061,446.58218 249.5004,445.63743 248.22581,444.69665 246.30872,444.02083 244.2195,444.02083 Z M 300.47701,445.52983 C 298.38676,445.52983 296.57941,446.10377 295.30389,447.03866 294.34279,447.74306 293.71699,448.62636 293.47175,449.51744 293.39005,449.81438 293.36415,450.07462 293.36415,450.37963 293.36415,451.295 293.71623,452.1797 294.44188,452.96619 294.68363,453.22829 294.98399,453.48436 295.30406,453.7206 296.57865,454.66132 298.38797,455.22943 300.47718,455.22943 302.56626,455.22943 304.49349,454.65856 305.75808,453.7206 307.02835,452.77844 307.59022,451.60897 307.59022,450.37963 307.59022,449.15081 307.02963,447.97547 305.75808,447.03866 304.49259,446.10639 302.56726,445.52983 300.47718,445.52983 Z"
           style="fill:#afe478;fill-opacity:1;fill-rule:evenodd;stroke:none;stroke-width:1.10554" />
        <path
           inkscape:connector-curvature="0"
           transform="translate(0,308.2677)"
           id="path4369"
           d="M 242.96875,155.625 272.625,178.84375 245.8125,179 230.9375,167.59375 216.28125,167.5 242.65625,188.1875 242.96875,187.96875 V 188.03125 L 284.0625,187.8125 284.875,188.4375 269.8125,271.03125 327.78125,271.46875 311.75,189.25 313.53125,187.84375 354.65625,188.0625 V 188 L 354.9375,188.21875 381.3125,167.53125 366.65625,167.62495 351.78125,179.0312 324.96875,178.87495 354.65625,155.6562 338.75,155.8437 309.65625,178.5312 307.5625,167.7187 288.6875,167.5312 286.84375,177.62495 258.875,155.81245 242.96875,155.62495 Z"
           style="fill:#577632;fill-opacity:1;stroke:none;stroke-width:1.10554" />
      </g>
      <g
         id="g3443"
         style="stroke-width:1.10554">
        <path
           inkscape:connector-curvature="0"
           style="font-style:normal;font-variant:normal;font-weight:bold;font-stretch:normal;font-size:48px;line-height:125%;font-family:'Open Sans Condensed';-inkscape-font-specification:'Open Sans Condensed, Bold';text-align:start;letter-spacing:0px;word-spacing:0px;writing-mode:lr-tb;text-anchor:start;fill:#577632;fill-opacity:1;stroke:none;stroke-width:1.10554"
           d="M 790.28125,287.1875 C 787.6076,287.18752 785.65341,288.11809 784.375,290 783.09658,291.88195 782.4375,294.71548 782.4375,298.53125 782.4375,302.17831 783.11895,304.96182 784.46875,306.84375 785.81855,308.72568 787.7922,309.65625 790.375,309.65625 792.0233,309.65625 793.51221,309.24988 794.875,308.40625 V 303.84375 C 793.46029,304.75227 792.11037,305.1875 790.8125,305.1875 789.72227,305.1875 788.94896,304.64095 788.46875,303.53125 787.98853,302.42157 787.74999,300.74535 787.75,298.5 787.74999,296.20276 787.98204,294.49239 788.46875,293.34375 788.95545,292.19514 789.74054,291.62502 790.84375,291.625 791.67439,291.62502 792.64149,291.92655 793.71875,292.5625 L 795.1875,288.53125 C 794.48663,288.08999 793.69505,287.76489 792.8125,287.53125 791.92993,287.29765 791.08593,287.18752 790.28125,287.1875 Z M 805.6875,287.1875 C 803.03981,287.18752 800.96131,288.177 799.46875,290.15625 797.97618,292.13554 797.25,294.85775 797.25,298.375 797.25,300.65929 797.59337,302.66829 798.28125,304.375 798.96913,306.08172 799.94682,307.40398 801.21875,308.3125 802.49067,309.22102 803.9637,309.65625 805.625,309.65625 808.24671,309.65625 810.30694,308.66677 811.8125,306.6875 813.31803,304.70823 814.06248,301.93121 814.0625,298.375 814.06248,294.93562 813.29327,292.20573 811.78125,290.1875 810.2692,288.16931 808.24432,287.18752 805.6875,287.1875 Z M 827.8125,287.1875 C 826.64439,287.18752 825.65082,287.46669 824.78125,288.03125 823.95962,288.56471 823.30618,289.29718 822.84375,290.21875 V 287.5625 H 817.71875 V 287.5937 H 817.68755 V 309.2812 H 822.87505 V 298.8437 C 822.87504,296.20901 823.13714,294.35966 823.6563,293.24995 824.17545,292.14028 825.00886,291.56247 826.12505,291.56245 826.96866,291.56247 827.56115,291.97653 827.93755,292.7812 828.31392,293.5859 828.50004,294.77327 828.50005,296.3437 V 309.2812 H 833.7188 V 295.12495 C 833.71878,292.5292 833.22994,290.53727 832.25005,289.18745 831.27013,287.83767 829.78532,287.18747 827.81255,287.18745 Z M 843.25,287.1875 C 841.42231,287.30534 839.951,287.83868 838.84375,288.78125 837.57831,289.85851 836.9375,291.31327 836.9375,293.15625 836.9375,294.59692 837.28736,295.84849 837.96875,296.90625 838.65014,297.96404 839.77331,298.97178 841.34375,299.90625 842.52482,300.6201 843.33996,301.22556 843.78125,301.71875 844.22252,302.21195 844.43749,302.77559 844.4375,303.4375 844.43749,304.08645 844.20305,304.6354 843.78125,305.03125 843.35943,305.42711 842.77343,305.625 841.96875,305.625 841.24193,305.625 840.39144,305.44948 839.4375,305.125 838.48355,304.80053 837.65133,304.39945 836.9375,303.90625 V 308.40625 C 838.33921,309.24988 840.10849,309.65625 842.25,309.65625 844.66406,309.65625 846.47926,309.06256 847.71875,307.875 848.95822,306.68744 849.59374,305.05306 849.59375,302.9375 849.59374,301.96409 849.4235,301.10182 849.125,300.375 848.82647,299.64819 848.4201,299.00858 847.875,298.4375 847.32988,297.86644 846.38104,297.16143 845.03125,296.34375 843.91506,295.66886 843.15883,295.11052 842.75,294.65625 842.34116,294.20201 842.12499,293.67781 842.125,293.09375 842.12499,292.58759 842.29403,292.16295 842.625,291.8125 842.95595,291.46209 843.46307,291.28127 844.125,291.28125 845.17628,291.28127 846.3925,291.65349 847.78125,292.40625 L 849.46875,288.6875 C 847.76851,287.67517 845.95211,287.18752 844.03125,287.1875 843.75545,287.1875 843.5111,287.1707 843.25,287.1875 Z M 860.1875,287.1875 C 857.65662,287.18752 855.66469,288.1758 854.25,290.1875 852.8353,292.19924 852.125,295.0116 852.125,298.59375 852.125,302.124 852.93605,304.8539 854.5,306.78125 856.06395,308.70861 858.19366,309.65625 860.90625,309.65625 863.22945,309.65625 865.21369,309.15562 866.875,308.15625 V 303.90625 C 865.10986,304.95754 863.37474,305.46875 861.6875,305.46875 860.36365,305.46875 859.34651,305.00347 858.59375,304.0625 857.84097,303.12154 857.44518,301.68386 857.40625,299.75 H 867.8125 V 297 C 867.81248,293.89807 867.14401,291.46972 865.78125,289.75 864.41846,288.03032 862.54964,287.18752 860.1875,287.1875 Z M 880.53125,287.1875 C 879.6357,287.18752 878.83114,287.47847 878.15625,288.0625 877.48134,288.64657 876.88356,289.60599 876.3125,290.96875 H 876.125 L 875.53125,287.59375 H 871.28125 V 309.28125 H 876.46875 V 298.125 C 876.46874,296.2301 876.79384,294.77415 877.46875,293.78125 878.14364,292.78838 879.11604,292.28127 880.375,292.28125 880.95904,292.28127 881.41783,292.37025 881.78125,292.5 L 882.40625,287.46875 C 881.79623,287.27409 881.1672,287.18752 880.53125,287.1875 Z M 860.125,291.15625 C 860.9167,291.15627 861.54573,291.5886 862,292.40625 862.45425,293.22393 862.69278,294.4166 862.71875,296 H 857.46875 C 857.54665,294.3517 857.83228,293.12899 858.3125,292.34375 858.79271,291.55855 859.3852,291.15627 860.125,291.15625 Z M 805.25,291.625 C 805.37695,291.6075 805.51997,291.625 805.65625,291.625 806.73348,291.62502 807.5003,292.18985 808,293.3125 808.49967,294.43519 808.74999,296.10371 808.75,298.375 808.74999,302.94356 807.73285,305.25 805.65625,305.25 804.56602,305.25 803.77444,304.65512 803.28125,303.5 802.78805,302.34489 802.53124,300.63333 802.53125,298.375 802.53124,296.10371 802.78805,294.43519 803.28125,293.3125 803.71279,292.33018 804.36135,291.7478 805.25,291.625 Z"
           transform="translate(0,308.2677)"
           id="flowRoot3023-5-6-2-5-9-7-4-5" />
        <path
           inkscape:connector-curvature="0"
           style="font-style:normal;font-variant:normal;font-weight:bold;font-stretch:normal;font-size:48px;line-height:125%;font-family:'Open Sans Condensed';-inkscape-font-specification:'Open Sans Condensed, Bold';text-align:start;letter-spacing:0px;word-spacing:0px;writing-mode:lr-tb;text-anchor:start;fill:#577632;fill-opacity:1;stroke:none;stroke-width:1.10554"
           d="M 912.25,287.1875 C 909.71912,287.18752 907.37323,287.85599 905.21875,289.21875 L 907,292.8125 C 908.68724,291.80017 910.17086,291.28127 911.46875,291.28125 913.22088,291.28127 914.12499,292.28782 914.125,294.3125 V 295.875 L 911.21875,296 C 908.72681,296.11682 906.87745,296.73407 905.625,297.84375 904.37254,298.95345 903.75,300.65323 903.75,302.9375 903.75,305.06604 904.17874,306.7122 905.09375,307.90625 906.00876,309.1003 907.2786,309.6875 908.875,309.6875 910.12096,309.6875 911.15107,309.44897 911.96875,308.96875 912.78641,308.48853 913.57799,307.61568 914.34375,306.34375 H 914.46875 L 915.5,309.3125 H 919.28125 V 294.75 C 919.28123,292.33595 918.70053,290.47362 917.5,289.15625 916.29944,287.83892 914.54724,287.18752 912.25,287.1875 Z M 933.59375,287.2187 C 932.42564,287.21872 931.40082,287.49789 930.53125,288.06245 929.68003,288.61512 929.02818,289.37446 928.5625,290.3437 V 287.56245 H 923.4375 V 299.2187 H 923.4687 V 309.31245 H 928.6562 V 298.9062 C 928.65619,296.27151 928.91829,294.39091 929.43745,293.2812 929.9566,292.17153 930.75876,291.62497 931.87495,291.62495 932.71856,291.62497 933.3423,292.00778 933.7187,292.81245 934.09507,293.61715 934.28119,294.80452 934.2812,296.37495 V 309.31245 H 939.49995 V 295.1562 C 939.49993,292.56045 939.01109,290.59977 938.0312,289.24995 937.05128,287.90017 935.56647,287.21872 933.5937,287.2187 Z M 950.8125,287.2187 C 948.13885,287.21872 946.15341,288.14929 944.875,290.0312 943.59658,291.91315 942.96875,294.77793 942.96875,298.5937 942.96875,302.24076 943.6502,304.99302 945,306.87495 946.3498,308.75688 948.2922,309.68745 950.875,309.68745 952.5233,309.68745 954.04346,309.28108 955.40625,308.43745 V 303.87495 C 953.99154,304.78347 952.64162,305.24995 951.34375,305.24995 950.25352,305.24995 949.44896,304.67215 948.96875,303.56245 948.48853,302.45277 948.24999,300.77655 948.25,298.5312 948.24999,296.23396 948.51329,294.52359 949,293.37495 949.4867,292.22634 950.27179,291.65622 951.375,291.6562 952.20564,291.65622 953.17274,291.95775 954.25,292.5937 L 955.71875,288.56245 C 955.01788,288.12119 954.2263,287.79609 953.34375,287.56245 952.46118,287.32885 951.61718,287.21872 950.8125,287.2187 Z M 884.90625,287.62495 890.5625,309.31245 H 897 L 902.6875,287.62495 H 897.3125 C 895.41758,296.2559 894.41632,300.8587 894.3125,301.4687 894.20866,302.07871 894.09733,302.77314 894,303.49995 893.9026,304.22677 893.85672,304.76684 893.84375,305.1562 H 893.78125 C 893.74235,304.66301 893.63098,303.87263 893.46875,302.74995 893.30651,301.62729 893.14805,300.77151 893.03125,300.18745 L 890.28125,287.62495 Z M 914.125,299.1562 V 300.9687 C 914.12499,302.3834 913.81457,303.52484 913.25,304.37495 912.68541,305.22507 911.94745,305.6562 911,305.6562 909.72807,305.6562 909.09374,304.75979 909.09375,302.9687 909.09374,301.76167 909.35464,300.85996 909.90625,300.24995 910.45784,299.63995 911.31892,299.2836 912.5,299.2187 Z"
           transform="translate(0,308.2677)"
           id="flowRoot3023-5-6-2-5-9-7-1-4-1" />
        <g
           id="flowRoot3023-5-6-2-5-9-7-1-5-1-3"
           style="font-style:normal;font-variant:normal;font-weight:bold;font-stretch:normal;font-size:48px;line-height:125%;font-family:'Open Sans Condensed';-inkscape-font-specification:'Open Sans Condensed, Bold';text-align:start;letter-spacing:0px;word-spacing:0px;writing-mode:lr-tb;text-anchor:start;fill:#577632;fill-opacity:1;stroke:none;stroke-width:1.10554"
           transform="matrix(0.8306463,0,0,0.8306463,1795.7434,-128.90577)">
          <path
             inkscape:connector-curvature="0"
             id="path3407"
             d="M -1008.5625,872.02908 H -1002.0937 L -998.48437,886.77127 C -998.12501,888.08378 -997.83595,889.91972 -997.61719,892.27908 H -997.47656 C -997.46096,891.90409 -997.39066,891.23612 -997.26562,890.27518 -997.14064,889.31425 -997.03907,888.56034 -996.96094,888.01346 -996.88284,887.46659 -995.8047,882.13847 -993.72656,872.02908 H -987.16406 L -994.64062,900.01346 C -995.54689,903.45095 -996.75001,905.9197 -998.25,907.41971 -999.75001,908.9197 -1001.75,909.6697 -1004.25,909.66971 -1005.4844,909.6697 -1006.5859,909.53688 -1007.5547,909.27127 V 904.04471 C -1006.9141,904.2322 -1006.1953,904.32595 -1005.3984,904.32596 -1003.3047,904.32595 -1001.9297,902.95095 -1001.2734,900.20096 L -1000.8281,898.56033 Z"
             style="stroke-width:1.10554" />
        </g>
      </g>
      <g
         id="flowRoot3013-0-3-7-9-7-8-1-7"
         style="font-style:normal;font-variant:normal;font-weight:300;font-stretch:normal;font-size:48px;line-height:125%;font-family:'Open Sans Condensed Light';-inkscape-font-specification:'Open Sans Condensed Light, Light';text-align:start;letter-spacing:0px;word-spacing:0px;writing-mode:lr-tb;text-anchor:start;fill:#577632;fill-opacity:1;stroke:none;stroke-width:1.10554"
         transform="matrix(0.57050433,0,0,0.57050433,1417.5478,155.19829)">
        <path
           inkscape:connector-curvature="0"
           id="path3376"
           d="M -1032.3359,754.60721 C -1032.336,756.74784 -1032.8985,758.42362 -1034.0234,759.63455 -1035.1484,760.84549 -1036.7734,761.45096 -1038.8984,761.45096 -1040.0547,761.45096 -1041.0703,761.30252 -1041.9453,761.00565 -1042.8203,760.70877 -1043.5,760.38065 -1043.9844,760.02127 V 757.41971 C -1043.4063,757.99784 -1042.6406,758.46268 -1041.6875,758.81424 -1040.7344,759.1658 -1039.7578,759.34158 -1038.7578,759.34158 -1037.4453,759.34158 -1036.4141,758.9119 -1035.6641,758.05252 -1034.9141,757.19315 -1034.5391,756.04471 -1034.5391,754.60721 -1034.5391,753.48222 -1034.8086,752.533 -1035.3477,751.75955 -1035.8867,750.98612 -1036.9141,750.10722 -1038.4297,749.12283 -1040.1641,748.0291 -1041.3477,747.1541 -1041.9805,746.49783 -1042.6133,745.8416 -1043.1055,745.10722 -1043.457,744.29471 -1043.8086,743.48223 -1043.9844,742.51348 -1043.9844,741.38846 -1043.9844,739.56035 -1043.3672,738.04864 -1042.1328,736.8533 -1040.8984,735.65801 -1039.3281,735.06036 -1037.4219,735.06033 -1035.375,735.06036 -1033.6641,735.54473 -1032.2891,736.51346 L -1033.4375,738.45877 C -1034.7188,737.59942 -1036.0781,737.16973 -1037.5156,737.16971 -1038.8281,737.16973 -1039.875,737.55645 -1040.6563,738.32986 -1041.4375,739.10332 -1041.8281,740.12285 -1041.8281,741.38846 -1041.8281,742.51348 -1041.5625,743.45488 -1041.0313,744.21268 -1040.5,744.97051 -1039.375,745.88847 -1037.6563,746.96658 -1035.9688,748.07597 -1034.8125,748.96269 -1034.1875,749.62674 -1033.5625,750.29081 -1033.0977,751.02519 -1032.793,751.82986 -1032.4883,752.63456 -1032.336,753.56034 -1032.3359,754.60721 Z"
           style="stroke-width:1.10554" />
        <path
           inkscape:connector-curvature="0"
           id="path3378"
           d="M -1012.9062,748.20877 C -1012.9063,752.49003 -1013.582,755.76737 -1014.9336,758.0408 -1016.2852,760.31424 -1018.2188,761.45096 -1020.7344,761.45096 -1023.2188,761.45096 -1025.1211,760.31424 -1026.4414,758.0408 -1027.7617,755.76737 -1028.4219,752.49003 -1028.4219,748.20877 -1028.4219,739.44317 -1025.8281,735.06036 -1020.6406,735.06033 -1018.2031,735.06036 -1016.3047,736.2088 -1014.9453,738.50565 -1013.586,740.80254 -1012.9063,744.03691 -1012.9062,748.20877 Z M -1026.1016,748.20877 C -1026.1016,751.88065 -1025.6641,754.65409 -1024.7891,756.52908 -1023.9141,758.40409 -1022.5469,759.34158 -1020.6875,759.34158 -1017.0469,759.34158 -1015.2266,755.63065 -1015.2266,748.20877 -1015.2266,740.84942 -1017.0469,737.16973 -1020.6875,737.16971 -1022.5938,737.16973 -1023.9727,738.09161 -1024.8242,739.93533 -1025.6758,741.7791 -1026.1016,744.53691 -1026.1016,748.20877 Z"
           style="stroke-width:1.10554" />
        <path
           inkscape:connector-curvature="0"
           id="path3380"
           d="M -1000.7656,737.52127 H -1004.75 V 760.98221 H -1006.9531 V 737.52127 H -1010.1875 V 736.25565 L -1006.9531,735.29471 V 733.37283 C -1006.9531,730.13849 -1006.5703,727.81037 -1005.8047,726.38846 -1005.0391,724.96662 -1003.7109,724.25568 -1001.8203,724.25565 -1000.7266,724.25568 -999.73439,724.45099 -998.84375,724.84158 L -999.61719,726.90408 C -1000.4453,726.51349 -1001.1953,726.31818 -1001.8672,726.31815 -1002.6328,726.31818 -1003.2109,726.54474 -1003.6016,726.99783 -1003.9922,727.45099 -1004.2813,728.18537 -1004.4687,729.20096 -1004.6563,730.21661 -1004.75,731.62286 -1004.75,733.41971 V 735.55252 H -1000.7656 Z"
           style="stroke-width:1.10554" />
        <path
           inkscape:connector-curvature="0"
           id="path3382"
           d="M -992,759.38846 C -991.31251,759.38846 -990.70313,759.29476 -990.17187,759.10721 V 760.98221 C -990.85938,761.29471 -991.7422,761.45096 -992.82031,761.45096 -995.44532,761.45096 -996.75782,759.49002 -996.75781,755.56815 V 737.52127 H -999.05469 V 736.20877 L -996.80469,735.55252 -996.07812,729.50565 H -994.53125 V 735.55252 H -990.5 V 737.52127 H -994.53125 V 754.93533 C -994.53126,756.65409 -994.34376,757.82596 -993.96875,758.45096 -993.59376,759.07596 -992.93751,759.38846 -992,759.38846 Z"
           style="stroke-width:1.10554" />
        <path
           inkscape:connector-curvature="0"
           id="path3384"
           d="M -972.03125,760.98221 -975.54687,743.75565 C -975.57817,743.63066 -975.60547,743.49785 -975.62887,743.35721 -975.65237,743.2166 -975.89841,741.7166 -976.36715,738.85721 H -976.41405 L -976.74218,740.8494 -977.28124,743.75565 -980.91405,760.98221 H -983.56249 L -989.09374,735.55252 H -986.86718 L -983.70311,750.36502 -982.22655,758.0994 H -982.08593 C -981.80469,755.86503 -981.35156,753.27128 -980.72655,750.31815 L -977.56249,735.55252 H -975.21874 L -972.03124,750.36502 C -971.78126,751.47441 -971.33595,754.05253 -970.6953,758.0994 H -970.55468 C -970.50778,757.58377 -970.27735,756.2869 -969.86327,754.20877 -969.44923,752.13065 -968.12501,745.91191 -965.89061,735.55252 H -963.68749 L -969.40624,760.98221 Z"
           style="stroke-width:1.10554" />
        <path
           inkscape:connector-curvature="0"
           id="path3386"
           d="M -949.97656,760.98221 -950.25781,757.41971 H -950.35151 C -951.57027,760.10721 -953.41402,761.45096 -955.88276,761.45096 -957.53902,761.45096 -958.87105,760.7908 -959.87886,759.47049 -960.88667,758.15018 -961.39058,756.38065 -961.39057,754.1619 -961.39058,751.74003 -960.66402,749.82206 -959.21089,748.40799 -957.75777,746.99394 -955.71871,746.22441 -953.0937,746.0994 L -950.35151,745.95877 V 743.8494 C -950.35153,741.47442 -950.6484,739.74395 -951.24214,738.65799 -951.8359,737.57208 -952.82027,737.02911 -954.19526,737.02908 -955.6484,737.02911 -957.13277,737.50567 -958.64839,738.45877 L -959.60932,736.70096 C -957.84371,735.60723 -955.99214,735.06036 -954.05464,735.06033 -951.9609,735.06036 -950.45309,735.72051 -949.5312,737.0408 -948.60934,738.36114 -948.1484,740.56817 -948.14839,743.6619 V 760.98221 Z M -955.39062,759.55252 C -953.79688,759.55252 -952.5586,758.76737 -951.67578,757.19705 -950.79298,755.62674 -950.35158,753.40409 -950.35156,750.52908 V 747.88065 L -953,748.02127 C -955.04688,748.13066 -956.56641,748.69706 -957.55859,749.72049 -958.55079,750.74394 -959.04688,752.24003 -959.04687,754.20877 -959.04688,756.05253 -958.71875,757.40409 -958.0625,758.26346 -957.40626,759.12283 -956.51563,759.55252 -955.39062,759.55252 Z"
           style="stroke-width:1.10554" />
        <path
           inkscape:connector-curvature="0"
           id="path3388"
           d="M -934.39062,735.06033 C -933.59376,735.06036 -932.85157,735.16973 -932.16406,735.38846 L -932.70312,737.61502 C -933.26564,737.38067 -933.84376,737.26348 -934.4375,737.26346 -935.29688,737.26348 -936.09766,737.70489 -936.83984,738.58768 -937.58204,739.47051 -938.16407,740.70098 -938.58594,742.27908 -939.00782,743.85723 -939.21876,745.59941 -939.21875,747.50565 V 760.98221 H -941.44531 V 735.55252 H -939.61719 L -939.38281,740.00565 H -939.21875 C -938.03126,736.70879 -936.42188,735.06036 -934.39062,735.06033 Z"
           style="stroke-width:1.10554" />
        <path
           inkscape:connector-curvature="0"
           id="path3390"
           d="M -921.10156,761.45096 C -923.78907,761.45096 -925.85547,760.30643 -927.30078,758.01736 -928.7461,755.72831 -929.46875,752.5369 -929.46875,748.44315 -929.46875,744.09941 -928.82422,740.78301 -927.53516,738.49393 -926.2461,736.20489 -924.39063,735.06036 -921.96875,735.06033 -919.85939,735.06036 -918.19533,736.06426 -916.97656,738.07205 -915.75783,740.07989 -915.14845,742.78691 -915.14844,746.19315 V 748.25565 H -927.19531 C -927.16411,751.95878 -926.64063,754.73221 -925.625,756.57596 -924.60938,758.41971 -923.07032,759.34158 -921.00781,759.34158 -919.41407,759.34158 -917.73439,758.81815 -915.96875,757.77127 V 759.92752 C -917.59376,760.94315 -919.3047,761.45096 -921.10156,761.45096 Z M -922.10937,737.07596 C -925.17188,737.07598 -926.85157,740.13067 -927.14844,746.24002 H -917.375 C -917.37501,743.44316 -917.8008,741.2166 -918.65234,739.56033 -919.50392,737.90411 -920.65626,737.07598 -922.10937,737.07596 Z"
           style="stroke-width:1.10554" />
        <path
           inkscape:connector-curvature="0"
           id="path3392"
           d="M -893.98437,737.52127 H -897.96875 V 760.98221 H -900.17187 V 737.52127 H -903.40625 V 736.25565 L -900.17187,735.29471 V 733.37283 C -900.17188,730.13849 -899.78907,727.81037 -899.02344,726.38846 -898.25782,724.96662 -896.92969,724.25568 -895.03906,724.25565 -893.94532,724.25568 -892.95314,724.45099 -892.0625,724.84158 L -892.83594,726.90408 C -893.66407,726.51349 -894.41407,726.31818 -895.08594,726.31815 -895.85157,726.31818 -896.42969,726.54474 -896.82031,726.99783 -897.21094,727.45099 -897.50001,728.18537 -897.6875,729.20096 -897.87501,730.21661 -897.96876,731.62286 -897.96875,733.41971 V 735.55252 H -893.98437 Z"
           style="stroke-width:1.10554" />
        <path
           inkscape:connector-curvature="0"
           id="path3394"
           d="M -882.82812,735.06033 C -882.03126,735.06036 -881.28907,735.16973 -880.60156,735.38846 L -881.14062,737.61502 C -881.70314,737.38067 -882.28126,737.26348 -882.875,737.26346 -883.73438,737.26348 -884.53516,737.70489 -885.27734,738.58768 -886.01954,739.47051 -886.60157,740.70098 -887.02344,742.27908 -887.44532,743.85723 -887.65626,745.59941 -887.65625,747.50565 V 760.98221 H -889.88281 V 735.55252 H -888.05469 L -887.82031,740.00565 H -887.65625 C -886.46876,736.70879 -884.85938,735.06036 -882.82812,735.06033 Z"
           style="stroke-width:1.10554" />
        <path
           inkscape:connector-curvature="0"
           id="path3396"
           d="M -869.53906,761.45096 C -872.22657,761.45096 -874.29297,760.30643 -875.73828,758.01736 -877.1836,755.72831 -877.90625,752.5369 -877.90625,748.44315 -877.90625,744.09941 -877.26172,740.78301 -875.97266,738.49393 -874.6836,736.20489 -872.82813,735.06036 -870.40625,735.06033 -868.29689,735.06036 -866.63283,736.06426 -865.41406,738.07205 -864.19533,740.07989 -863.58595,742.78691 -863.58594,746.19315 V 748.25565 H -875.63281 C -875.60161,751.95878 -875.07813,754.73221 -874.0625,756.57596 -873.04688,758.41971 -871.50782,759.34158 -869.44531,759.34158 -867.85157,759.34158 -866.17189,758.81815 -864.40625,757.77127 V 759.92752 C -866.03126,760.94315 -867.7422,761.45096 -869.53906,761.45096 Z M -870.54687,737.07596 C -873.60938,737.07598 -875.28907,740.13067 -875.58594,746.24002 H -865.8125 C -865.81251,743.44316 -866.2383,741.2166 -867.08984,739.56033 -867.94142,737.90411 -869.09376,737.07598 -870.54687,737.07596 Z"
           style="stroke-width:1.10554" />
        <path
           inkscape:connector-curvature="0"
           id="path3398"
           d="M -850.69531,761.45096 C -853.38282,761.45096 -855.44922,760.30643 -856.89453,758.01736 -858.33985,755.72831 -859.0625,752.5369 -859.0625,748.44315 -859.0625,744.09941 -858.41797,740.78301 -857.12891,738.49393 -855.83985,736.20489 -853.98438,735.06036 -851.5625,735.06033 -849.45314,735.06036 -847.78908,736.06426 -846.57031,738.07205 -845.35158,740.07989 -844.7422,742.78691 -844.74219,746.19315 V 748.25565 H -856.78906 C -856.75786,751.95878 -856.23438,754.73221 -855.21875,756.57596 -854.20313,758.41971 -852.66407,759.34158 -850.60156,759.34158 -849.00782,759.34158 -847.32814,758.81815 -845.5625,757.77127 V 759.92752 C -847.18751,760.94315 -848.89845,761.45096 -850.69531,761.45096 Z M -851.70312,737.07596 C -854.76563,737.07598 -856.44532,740.13067 -856.74219,746.24002 H -846.96875 C -846.96876,743.44316 -847.39455,741.2166 -848.24609,739.56033 -849.09767,737.90411 -850.25001,737.07598 -851.70312,737.07596 Z"
           style="stroke-width:1.10554" />
        <path
           inkscape:connector-curvature="0"
           id="path3400"
           d="M -832.85937,761.45096 C -837.79688,761.45096 -840.26563,757.06815 -840.26562,748.30252 -840.26563,743.99004 -839.64844,740.70488 -838.41406,738.44705 -837.17969,736.18926 -835.35938,735.06036 -832.95312,735.06033 -831.81251,735.06036 -830.73048,735.38848 -829.70703,736.04471 -828.68361,736.70098 -827.8672,737.60723 -827.25781,738.76346 H -827.07031 L -827.16401,735.92752 V 724.51346 H -824.93745 V 760.98221 H -826.76557 L -826.95307,757.41971 H -827.16401 C -827.7734,758.71659 -828.56246,759.71268 -829.5312,760.40799 -830.49996,761.1033 -831.60934,761.45096 -832.85932,761.45096 Z M -832.71875,759.50565 C -830.93751,759.50565 -829.56642,758.68143 -828.60547,757.03299 -827.64455,755.38456 -827.16408,752.95878 -827.16406,749.75565 V 748.30252 C -827.16408,744.45879 -827.62892,741.64238 -828.55859,739.8533 -829.48829,738.06426 -830.90626,737.16973 -832.8125,737.16971 -834.64063,737.16973 -835.95313,738.12676 -836.75,740.0408 -837.54688,741.95488 -837.94532,744.72441 -837.94531,748.3494 -837.94532,752.00565 -837.53125,754.77909 -836.70312,756.66971 -835.87501,758.56034 -834.54688,759.50565 -832.71875,759.50565 Z"
           style="stroke-width:1.10554" />
        <path
           inkscape:connector-curvature="0"
           id="path3402"
           d="M -803.84375,748.20877 C -803.84377,752.49003 -804.51955,755.76737 -805.87109,758.0408 -807.22267,760.31424 -809.15626,761.45096 -811.67187,761.45096 -814.15626,761.45096 -816.0586,760.31424 -817.37891,758.0408 -818.69922,755.76737 -819.35938,752.49003 -819.35937,748.20877 -819.35938,739.44317 -816.76563,735.06036 -811.57812,735.06033 -809.14064,735.06036 -807.2422,736.2088 -805.88281,738.50565 -804.52345,740.80254 -803.84377,744.03691 -803.84375,748.20877 Z M -817.03906,748.20877 C -817.03907,751.88065 -816.60157,754.65409 -815.72656,756.52908 -814.85157,758.40409 -813.48438,759.34158 -811.625,759.34158 -807.98439,759.34158 -806.16408,755.63065 -806.16406,748.20877 -806.16408,740.84942 -807.98439,737.16973 -811.625,737.16971 -813.53126,737.16973 -814.91016,738.09161 -815.76172,739.93533 -816.61329,741.7791 -817.03907,744.53691 -817.03906,748.20877 Z"
           style="stroke-width:1.10554" />
        <path
           inkscape:connector-curvature="0"
           id="path3404"
           d="M -776.58594,760.98221 V 743.6619 C -776.58596,739.39629 -777.83596,737.26348 -780.33594,737.26346 -782.05471,737.26348 -783.29299,738.00957 -784.05078,739.50174 -784.80861,740.99395 -785.18752,743.19316 -785.1875,746.0994 V 760.98221 H -787.39062 V 743.6619 C -787.39064,741.50567 -787.69533,739.9002 -788.30469,738.84549 -788.91408,737.79082 -789.85939,737.26348 -791.14062,737.26346 -792.82813,737.26348 -794.0547,738.02911 -794.82031,739.56033 -795.58594,741.0916 -795.96876,743.57598 -795.96875,747.01346 V 760.98221 H -798.19531 V 735.55252 H -796.32031 L -796.13281,739.09158 H -795.92187 C -794.90626,736.40411 -793.1797,735.06036 -790.74219,735.06033 -789.33595,735.06036 -788.22658,735.43536 -787.41406,736.18533 -786.60158,736.93536 -786.01564,738.02911 -785.65625,739.46658 -785.04689,737.90411 -784.29689,736.77911 -783.40625,736.09158 -782.51564,735.40411 -781.3594,735.06036 -779.9375,735.06033 -778.01565,735.06036 -776.6094,735.79864 -775.71875,737.27518 -774.82815,738.75176 -774.38284,741.11504 -774.38281,744.36502 V 760.98221 Z"
           style="stroke-width:1.10554" />
      </g>
    </g>
  </g>
</svg>
