<?xml version="1.0" encoding="UTF-8" standalone="no"?>
<svg xmlns:rdf="http://www.w3.org/1999/02/22-rdf-syntax-ns#" xmlns="http://www.w3.org/2000/svg" version="1.1" xmlns:cc="http://creativecommons.org/ns#" xmlns:xlink="http://www.w3.org/1999/xlink" viewBox="0 0 15.999994 15.999974" xmlns:dc="http://purl.org/dc/elements/1.1/">
<metadata>
<rdf:RDF>
<cc:Work rdf:about="">
<dc:format>image/svg+xml</dc:format>
<dc:type rdf:resource="http://purl.org/dc/dcmitype/StillImage"/>
</cc:Work>
</rdf:RDF>
</metadata>
<defs>
<linearGradient id="a" y2="184.8026" xlink:href="#e" gradientUnits="userSpaceOnUse" x2="979.8044" y1="182.4686" x1="974.1975"/>
<linearGradient id="e">
<stop stop-color="#fff" offset="0"/>
<stop stop-color="#aaa" offset="1"/>
</linearGradient>
<linearGradient id="d" y2="184.6266" xlink:href="#b" gradientUnits="userSpaceOnUse" x2="977.4031" y1="180.7934" x1="967.6506"/>
<linearGradient id="c" y2="181.7098" xlink:href="#b" gradientUnits="userSpaceOnUse" x2="977.9335" y1="178.3186" x1="968.8881"/>
<linearGradient id="b">
<stop stop-color="#5a5a5a" offset="0"/>
<stop offset="1"/>
</linearGradient>
</defs>
<g transform="translate(-964.95901,-169.96088)">
<path stroke-linejoin="round" style="color:#000000" d="m969.5 182.5h11l-4-5h-11l4 5z" fill-rule="evenodd" transform="translate(-.0409998 2.96088)" stroke="url(#c)" stroke-linecap="square" stroke-miterlimit="0" stroke-width=".9999474" fill="url(#a)"/>
<path opacity=".4809384" stroke-linejoin="round" style="color:#000000" d="m969.5 185.5h11l-4-5h-11l4 5z" fill-rule="evenodd" transform="translate(-.0410002 -3.03912)" stroke="url(#d)" stroke-linecap="square" stroke-miterlimit="0" stroke-width="1.0000962" fill="url(#a)"/>
<g transform="translate(-.541 .46088)">
<path d="m972 171 1-1h7l1 1v7l-1 1h-7l-1-1v-7z" fill-rule="evenodd" stroke="#a00" stroke-width="1px" fill="#a00"/>
<path d="m974 171.85 5 5" stroke="#fff" stroke-width="1.7" fill="none"/>
<path stroke-linejoin="round" d="m979 171.85-5 5" stroke="#fff" stroke-width="1.8" fill="none"/>
</g>
</g>
</svg>
