<?xml version="1.0" encoding="UTF-8" standalone="no"?>
<!-- Created with Inkscape (http://www.inkscape.org/) -->

<svg
   width="170"
   height="220"
   version="1.1"
   viewBox="0 0 170 220"
   id="svg20"
   sodipodi:docname="read_online.zh_TW.svg"
   inkscape:version="1.3.2 (091e20ef0f, 2023-11-25)"
   xmlns:inkscape="http://www.inkscape.org/namespaces/inkscape"
   xmlns:sodipodi="http://sodipodi.sourceforge.net/DTD/sodipodi-0.dtd"
   xmlns:xlink="http://www.w3.org/1999/xlink"
   xmlns="http://www.w3.org/2000/svg"
   xmlns:svg="http://www.w3.org/2000/svg"
   xmlns:rdf="http://www.w3.org/1999/02/22-rdf-syntax-ns#"
   xmlns:cc="http://creativecommons.org/ns#"
   xmlns:dc="http://purl.org/dc/elements/1.1/">
  <sodipodi:namedview
     id="namedview20"
     pagecolor="#ffffff"
     bordercolor="#000000"
     borderopacity="0.25"
     inkscape:showpageshadow="2"
     inkscape:pageopacity="0.0"
     inkscape:pagecheckerboard="0"
     inkscape:deskcolor="#d1d1d1"
     inkscape:zoom="6.999691"
     inkscape:cx="80.432122"
     inkscape:cy="179.07933"
     inkscape:window-width="1920"
     inkscape:window-height="1144"
     inkscape:window-x="0"
     inkscape:window-y="0"
     inkscape:window-maximized="1"
     inkscape:current-layer="g19" />
  <defs
     id="defs7">
    <linearGradient
       id="linearGradient5124"
       x1="220.34"
       x2="272.34"
       y1="437.69"
       y2="437.69"
       gradientTransform="matrix(.80184 .21485 -.21485 .80184 -64.832 -39.717)"
       gradientUnits="userSpaceOnUse"
       xlink:href="#linearGradient4839" />
    <linearGradient
       id="linearGradient4839">
      <stop
         stop-color="#f8f8f8"
         offset="0"
         id="stop1" />
      <stop
         stop-color="#c4c4c4"
         offset="1"
         id="stop2" />
    </linearGradient>
    <linearGradient
       id="linearGradient5126"
       x1="588.35"
       x2="536.34"
       y1="410.41"
       y2="410.41"
       gradientTransform="matrix(.80184 .21485 -.21485 .80184 -64.832 -39.717)"
       gradientUnits="userSpaceOnUse"
       xlink:href="#linearGradient4839" />
    <linearGradient
       id="linearGradient5128"
       x1="327"
       x2="195"
       y1="162.32"
       y2="161.72"
       gradientTransform="matrix(.80184 .21485 -.21485 .80184 49.143 206.34)"
       gradientUnits="userSpaceOnUse">
      <stop
         stop-color="#f2f2f2"
         offset="0"
         id="stop3" />
      <stop
         stop-color="#a6a6a6"
         offset="1"
         id="stop4" />
    </linearGradient>
    <linearGradient
       id="linearGradient5130"
       x1="63"
       x2="195"
       y1="206.91"
       y2="206.91"
       gradientTransform="matrix(.80184 .21485 -.21485 .80184 49.143 206.34)"
       gradientUnits="userSpaceOnUse">
      <stop
         stop-color="#f8f8f8"
         offset="0"
         id="stop5" />
      <stop
         stop-color="#c4c4c4"
         offset=".83333"
         id="stop6" />
      <stop
         stop-color="#9b9b9b"
         offset="1"
         id="stop7" />
    </linearGradient>
    <linearGradient
       id="linearGradient5132"
       x1="299.09"
       x2="67.058"
       y1="159.1"
       y2="159.1"
       gradientTransform="matrix(.80184 .21485 -.21485 .80184 49.143 206.34)"
       gradientUnits="userSpaceOnUse"
       xlink:href="#linearGradient4839" />
  </defs>
  <metadata
     id="metadata7">
    <rdf:RDF>
      <cc:Work
         rdf:about="">
        <dc:format>image/svg+xml</dc:format>
        <dc:type
           rdf:resource="http://purl.org/dc/dcmitype/StillImage" />
      </cc:Work>
    </rdf:RDF>
  </metadata>
  <g
     transform="translate(90.008 -730.43)"
     id="g20">
    <g
       transform="matrix(.39043 0 0 .39043 -70.168 664.23)"
       id="g19">
      <path
         d="m-29.431 503.79 146.26 75.38 164.36 7.85 74.64-278.55-164.36-7.85-146.26-75.38c-24.883 92.85-49.762 185.7-74.641 278.55zm0 0 146.26 75.38 164.36 7.85 74.64-278.55-164.36-7.85-146.26-75.38c-24.883 92.85-49.762 185.7-74.641 278.55zm0 0 146.26 75.38 164.36 7.85 74.64-278.55-164.36-7.85-146.26-75.38c-24.883 92.85-49.762 185.7-74.641 278.55zm0 0 74.637-278.55c-24.879 92.85-49.758 185.7-74.637 278.55zm310.62 83.23 74.64-278.55zm-310.63-83.23 146.27 75.38zm146.27 75.38 164.36 7.85z"
         fill="#ff7e28"
         stroke="#ff7e28"
         stroke-linecap="round"
         stroke-linejoin="round"
         stroke-miterlimit="20"
         stroke-width="7.0773"
         id="path7" />
      <g
         fill="#e6e6e6"
         stroke-width=".70773"
         id="g10">
        <path
           d="m-19.789 498.9 45.993-4.86 92.956 76.47 118.73-19.75 37.4 27.21c23.63-88.21 47.27-176.41 70.9-264.61l-37.4-27.21-118.73 19.75-92.955-76.47-45.993 4.86c-23.633 88.21-47.267 176.41-70.901 264.61z"
           id="path8" />
        <path
           d="m-19.789 498.9 138.95 71.61 156.13 7.46c23.63-88.21 47.27-176.41 70.9-264.61l-37.4-27.21-118.73 19.75-92.955-76.47-45.993 4.86c-23.633 88.21-47.267 176.41-70.901 264.61z"
           id="path9" />
        <path
           d="m-19.789 498.9 45.993-4.86 92.956 76.47 118.73-19.75 37.4 27.21c23.63-88.21 47.27-176.41 70.9-264.61l-37.4-27.21-118.73 19.75-92.955-76.47-45.993 4.86c-23.633 88.21-47.267 176.41-70.901 264.61z"
           id="path10" />
      </g>
      <g
         stroke-width=".70773"
         id="g18">
        <path
           d="m-19.789 498.9 45.993-4.86 70.901-264.61-45.993 4.86c-23.633 88.21-47.267 176.41-70.901 264.61z"
           fill="url(#linearGradient5124)"
           id="path11" />
        <path
           d="m237.89 550.76 37.4 27.21c23.63-88.21 47.27-176.41 70.9-264.61l-37.4-27.21z"
           fill="url(#linearGradient5126)"
           id="path12" />
        <path
           d="m26.204 494.04s33.405 13.24 56.642 32.36c23.234 19.12 36.314 44.11 36.314 44.11s23.81-15.11 53.49-20.04c29.69-4.94 65.24 0.29 65.24 0.29l70.9-264.61s-35.55-5.23-65.24-0.29c-29.68 4.94-53.49 20.04-53.49 20.04s-13.07-24.99-36.31-44.1c-23.24-19.12-56.645-32.37-56.645-32.37z"
           fill="#e6e6e6"
           id="path13" />
        <path
           d="m190.05 305.9-70.9 264.61s23.81-15.11 53.5-20.05c29.68-4.93 65.23 0.3 65.23 0.3l70.91-264.61s-35.56-5.23-65.24-0.29c-29.68 4.93-53.5 20.04-53.5 20.04z"
           fill="url(#linearGradient5128)"
           id="path14" />
        <path
           d="m97.1 229.43-70.901 264.6s33.405 13.25 56.643 32.37 36.308 44.11 36.308 44.11l70.9-264.61s-13.07-24.99-36.31-44.11c-23.23-19.11-56.64-32.36-56.64-32.36z"
           fill="url(#linearGradient5130)"
           id="path15" />
        <path
           d="m26.199 494.04-45.993 4.86 138.94 71.61s-0.83-1.56-2.42-4.2-3.93-6.37-7.02-10.69c-1.54-2.16-3.27-4.46-5.17-6.86s-3.97-4.87-6.213-7.39c-2.246-2.51-4.678-5.07-7.26-7.58-2.581-2.51-5.321-5-8.226-7.39-2.904-2.39-5.978-4.68-9.115-6.87-3.138-2.19-6.355-4.28-9.554-6.24-3.2-1.97-6.387-3.81-9.479-5.52s-6.073-3.3-8.887-4.72c-5.628-2.85-10.521-5.09-14.016-6.63-3.494-1.54-5.591-2.38-5.591-2.38z"
           fill="#b3b3b3"
           id="path16" />
        <path
           d="m119.15 570.51 156.13 7.46-37.4-27.21s-2.23-0.32-6.03-0.73c-3.8-0.42-9.15-0.93-15.45-1.27-3.15-0.17-6.53-0.29-10.06-0.36-3.53-0.06-7.21-0.06-10.97 0.04-3.75 0.11-7.58 0.3-11.39 0.63s-7.62 0.78-11.33 1.39c-3.71 0.62-7.33 1.4-10.82 2.29-3.49 0.88-6.88 1.88-10.08 2.94-3.2 1.05-6.23 2.16-9.07 3.29-2.85 1.12-5.5 2.26-7.91 3.36-4.83 2.19-8.73 4.25-11.43 5.74-2.69 1.5-4.19 2.43-4.19 2.43z"
           fill="#b3b3b3"
           id="path17" />
        <path
           d="m190.05 305.9-70.9 264.61s14.46-31.31 41.02-41.65c26.57-10.34 65.24 0.29 65.24 0.29l70.9-264.61s-38.67-10.63-65.24-0.29c-26.56 10.34-41.02 41.65-41.02 41.65z"
           fill="url(#linearGradient5132)"
           id="path18" />
      </g>
      <path
         d="m 88.450978,677.05242 v 2.84131 h 13.878712 v -2.84131 z m 0,-7.37648 v 2.78667 h 13.878712 v -2.78667 z m -20.927349,26.17284 4.58981,-0.81961 q 0.437125,2.73203 0.764968,5.95583 0.382484,3.2238 0.437125,5.62798 l -4.863013,0.92889 q 0,-2.40418 -0.273203,-5.68262 -0.273203,-3.27844 -0.655687,-6.01047 z m -5.846544,-0.76496 4.972294,0.76496 q -0.273203,3.82485 -0.92889,7.59505 -0.601047,3.7702 -1.475296,6.33831 -0.819609,-0.43713 -2.349546,-0.92889 -1.529937,-0.49177 -2.513468,-0.76497 0.983531,-2.51347 1.529937,-6.01047 0.546406,-3.497 0.764969,-6.99399 z m 11.310603,-0.32785 4.316608,-1.36601 q 0.655687,1.80314 1.256733,3.93412 0.655688,2.07634 0.983531,3.60628 l -4.480529,1.58458 q -0.218562,-1.58458 -0.874249,-3.7702 -0.601047,-2.18563 -1.202094,-3.98877 z m 32.620442,-9.12498 4.86301,4.09805 q -1.85778,1.47529 -3.71556,3.00523 -1.85778,1.52994 -3.55164,2.73203 1.63922,2.40419 3.66092,4.37125 2.0217,1.96706 4.37125,3.22379 -1.03817,0.87425 -2.29491,2.40419 -1.25673,1.58458 -1.96706,2.84131 -2.34955,-1.63922 -4.37125,-3.98876 -1.96706,-2.34955 -3.551636,-5.19086 v 4.69909 q 0,2.18563 -0.491766,3.497 -0.491765,1.31137 -1.912421,2.07634 -1.366015,0.71033 -3.333076,0.87425 -1.912421,0.16392 -4.53517,0.16392 -0.163922,-1.31137 -0.655687,-3.05987 -0.491765,-1.69386 -1.092812,-2.95059 1.475296,0.0546 2.895952,0.10928 1.475296,0 2.021702,-0.0546 0.87425,0 0.87425,-0.76497 V 684.81138 H 82.385871 v -20.0531 h 7.813606 q 0.491765,-1.42065 0.92889,-2.95059 0.491765,-1.58458 0.764968,-2.84131 l 7.485762,1.31137 q -0.546406,1.14746 -1.202093,2.29491 -0.601046,1.09281 -1.202093,2.18562 h 11.747729 v 20.0531 h -9.671386 v 1.7485 q 0.382484,1.14745 0.764968,2.24027 0.437128,1.09281 0.928888,2.18562 1.36602,-1.31137 2.67739,-2.73203 1.31138,-1.42065 2.18563,-2.62275 z m -25.13468,2.56811 h 7.2672 l 0.983531,-0.21856 3.824842,1.36601 q -1.311375,6.39295 -4.261967,11.0374 -2.950592,4.64445 -7.2672,7.32184 -0.546406,-1.03817 -1.639218,-2.40418 -1.092812,-1.36602 -2.021702,-2.18563 2.568108,-1.42065 4.58981,-3.93412 2.076343,-2.56811 3.333077,-5.68262 H 80.47345 Z m -8.032168,-6.22903 q -0.874249,1.14745 -1.803139,2.24027 -0.87425,1.09281 -1.80314,2.13098 l 4.58981,-0.54641 z m -10.873479,11.41989 q -0.163921,-0.65569 -0.546406,-1.7485 -0.327843,-1.09281 -0.764968,-2.24027 -0.437125,-1.14745 -0.819609,-1.96706 1.092812,-0.2732 2.076343,-1.14745 1.038171,-0.92889 2.349545,-2.45883 0.491766,-0.5464 1.366015,-1.63922 0.928891,-1.14745 1.967062,-2.67738 -3.005233,0.32784 -4.261967,0.65568 -1.202093,0.27321 -1.803139,0.54641 -0.218563,-0.92889 -0.87425,-2.73203 -0.601047,-1.80314 -1.147453,-3.00523 0.819609,-0.16393 1.529937,-0.92889 0.710328,-0.76497 1.529937,-1.96707 0.546406,-0.76496 1.639218,-2.78667 1.092812,-2.07634 2.294905,-4.86301 1.256734,-2.78667 2.130983,-5.62798 l 5.955826,2.45883 q -1.366015,3.27843 -3.223796,6.66615 -1.85778,3.38772 -3.770201,6.28367 l 3.606279,-0.27321 q 1.092812,-1.7485 2.076343,-3.60628 0.983531,-1.91242 1.80314,-3.7702 l 5.573341,3.497 q -1.529937,2.84131 -3.387717,5.68262 -1.85778,2.84131 -3.934123,5.57334 l 4.043404,-1.14745 q 0.655687,1.85778 1.256734,3.98877 0.601046,2.07634 1.038171,4.0434 0.491766,1.96706 0.655687,3.44236 l -5.081575,1.58458 -0.327844,-2.34955 q -3.715561,0.49176 -6.065106,0.87425 -2.349546,0.38248 -3.715561,0.65569 -1.311374,0.2732 -2.021702,0.5464 -0.710328,0.21856 -1.147453,0.43713 z m 72.999837,-33.71325 h 7.04864 v 15.73649 h 19.39741 v 6.61151 H 141.61628 V 700.985 h 23.27689 v 6.61151 H 114.89703 V 700.985 h 19.67061 z m 54.25812,30.27089 v 3.11451 h 10.38171 v -3.11451 z m 6.44759,-8.85178 3.44236,-2.62275 q 1.91242,1.09282 3.98876,2.56811 2.13098,1.42066 4.0434,2.89595 1.91242,1.4753 3.11452,2.73203 l -3.66092,2.89596 -1.63922,-1.58458 v 8.85177 h -4.31661 v 4.48053 q 0,0.87425 0.10928,1.09282 0.16392,0.21856 0.71033,0.21856 0.21856,0 0.87425,0 0.71033,0 0.92889,0 0.60105,0 0.76497,-0.65569 0.21856,-0.71033 0.32784,-3.22379 0.76497,0.60104 2.13099,1.14745 1.42065,0.49176 2.45882,0.76497 -0.10928,1.09281 -0.2732,1.96706 -0.10928,0.87425 -0.38248,1.58458 l 2.62274,-0.0547 q 0.87425,0 0.87425,-0.92889 v -25.845 h -15.354 v -16.61074 h 21.63767 v 42.51039 q 0,2.18562 -0.49176,3.44235 -0.43713,1.25674 -1.7485,2.02171 -1.25674,0.71032 -3.16916,0.87424 -1.85778,0.21857 -4.42589,0.21857 -0.0546,-0.76497 -0.32784,-1.80314 -0.2732,-1.03817 -0.60105,-2.0217 -1.03817,1.20209 -3.33307,1.20209 -0.65569,0 -1.80314,0 -1.09281,0 -1.69386,0 -2.13098,0 -3.27844,-0.54641 -1.09281,-0.5464 -1.52993,-1.80314 -0.38249,-1.31137 -0.38249,-3.497 v -4.53517 h -2.84131 q -0.38248,2.67739 -1.36601,4.80838 -0.98353,2.13098 -3.00524,3.7702 -2.0217,1.58458 -5.57334,2.73203 -0.38248,-0.98353 -1.36601,-2.29491 -0.92889,-1.31137 -1.7485,-2.0217 2.78667,-0.71033 4.31661,-1.69386 1.58457,-0.98353 2.34954,-2.2949 0.76497,-1.31138 1.03817,-3.00524 h -2.95059 v -8.63321 l -2.0217,1.20209 q -0.71033,-0.76497 -1.85778,-1.63921 -1.09281,-0.92889 -1.91242,-1.4753 2.89595,-1.42066 5.68262,-3.55164 2.78667,-2.18562 4.20733,-4.31661 l 5.02693,1.58458 q -2.56811,3.44236 -6.28367,6.22903 h 15.90042 q -1.69386,-1.36602 -3.60628,-2.73203 -1.85778,-1.36602 -3.60628,-2.40419 z m -8.96106,-10.27243 h -8.96106 v 2.40419 h 8.96106 z m 0,-3.71556 v -2.24027 h -8.96106 v 2.24027 z m 25.08003,3.7702 h -9.12498 v 2.34955 h 9.12498 z m 0,-3.71556 v -2.24026 h -9.12498 v 2.24026 z m -40.16084,-6.50223 h 21.20056 v 16.72002 h -15.08081 v 32.94828 h -6.11975 z m 72.07096,12.02093 h 30.21625 v 11.63845 h -30.21625 z m 7.5404,20.38094 v 1.69386 h 15.13545 v -1.69386 z m 0,4.04341 v 1.7485 h 15.13545 v -1.7485 z m 0,-8.03217 v 1.58458 h 15.13545 v -1.58458 z m -25.13468,-13.33231 h 14.5344 v 4.9723 h -14.5344 z m -0.60104,7.48577 h 15.73649 v 4.91765 h -15.73649 z m 29.72448,-24.26043 h 6.39295 v 2.45883 h 12.56734 v 4.09804 h -12.56734 v 1.85778 h 11.14669 v 3.7702 h -27.48423 v -3.7702 h 9.94459 v -1.85778 h -11.74773 v -4.09804 h 11.74773 z m -6.44759,16.99323 v 5.13621 h 3.7702 v -5.13621 z m 7.75897,0 v 5.13621 h 4.09804 v -5.13621 z m 8.14145,0 v 5.13621 h 3.82484 v -5.13621 z m -4.09805,29.342 2.18563,-3.11452 h -9.34355 l 3.71556,2.34955 q -1.52993,1.14745 -3.66092,2.24026 -2.07634,1.14746 -4.37124,2.02171 -2.29491,0.92889 -4.42589,1.52993 -0.71033,-0.81961 -1.91242,-1.96706 -1.14746,-1.14745 -2.18563,-1.91242 2.73203,-0.65569 5.57334,-1.85778 2.84132,-1.20209 4.80838,-2.40419 h -5.5187 v -16.50146 h 26.99245 v 16.50146 h -6.88471 q 2.62275,1.03817 5.19085,2.07635 2.56811,1.03817 4.31661,1.85778 l -3.33308,4.26196 q -2.0217,-1.09281 -5.08157,-2.51346 -3.05988,-1.36602 -6.06511,-2.56811 z m -34.64214,-14.5344 h 14.64368 v 16.5561 h -9.50746 v 2.24026 h -5.13622 z m 1.91242,-29.28736 5.5187,-2.18563 q 1.52994,1.69386 2.9506,3.71556 1.42065,2.02171 2.18562,3.55164 l -3.2238,1.4753 h 6.77544 v 5.19086 H 223.4679 v -5.19086 h 8.36001 q -0.81961,-1.52994 -2.0217,-3.33308 -1.14745,-1.80314 -2.34955,-3.22379 z m 3.2238,34.42357 v 6.28367 h 4.26197 v -6.28367 z"
         id="text1"
         style="font-weight:bold;font-size:54.6406px;font-family:'更紗黑體 UI TC';-inkscape-font-specification:'更紗黑體 UI TC Bold';text-align:center;text-anchor:middle;stroke-width:0"
         aria-label="線上閱讀" />
    </g>
  </g>
</svg>
