<?xml version="1.0" encoding="UTF-8" standalone="no"?>
<svg xmlns:rdf="http://www.w3.org/1999/02/22-rdf-syntax-ns#" xmlns="http://www.w3.org/2000/svg" version="1.1" xmlns:cc="http://creativecommons.org/ns#" viewBox="0 0 15.496272 15.497098" xmlns:dc="http://purl.org/dc/elements/1.1/">
<metadata>
<rdf:RDF>
<cc:Work rdf:about="">
<dc:format>image/svg+xml</dc:format>
<dc:type rdf:resource="http://purl.org/dc/dcmitype/StillImage"/>
</cc:Work>
</rdf:RDF>
</metadata>
<g stroke-linejoin="round" stroke-linecap="round" transform="matrix(1.395066 -1.366399 1.366399 1.395066 -1413.9362 1250.008)">
<path style="color:#000000" d="m961.8604 56.03607s1.3781-1.49823 3.2604-1.76058 3.5841 1.78013 3.5841 1.78013" stroke="#00f" stroke-width=".9960949" fill="none"/>
<path d="m960.716 54.82044 4.5038-4.57407 4.5738 4.47984" stroke="#646464" stroke-width=".7501467" fill="none"/>
<rect style="color:#000000" fill-rule="evenodd" fill-opacity=".3921569" transform="rotate(44.40522)" height="1.022964" width="1.022542" stroke="#6464ff" stroke-miterlimit="0" y="-639.9971" x="724.2002" stroke-width=".2557612" fill="#6464ff"/>
<rect style="color:#000000" fill-rule="evenodd" fill-opacity=".3921569" transform="rotate(44.40522)" height="1.022964" width="1.022542" stroke="#6464ff" stroke-miterlimit="0" y="-633.3398" x="724.2002" stroke-width=".2557612" fill="#6464ff"/>
<rect style="color:#000000" fill-rule="evenodd" fill-opacity=".3921569" transform="rotate(44.40522)" height="1.022964" width="1.022542" stroke="#6464ff" stroke-miterlimit="0" y="-639.9971" x="730.8575" stroke-width=".2557612" fill="#6464ff"/>
</g>
</svg>
