<?xml version="1.0" encoding="UTF-8"?>
<!-- Created with Inkscape (http://www.inkscape.org/) -->
<svg width="672" height="250" version="1.1" viewBox="0 0 672 250" xmlns="http://www.w3.org/2000/svg">
 <defs>
  <marker id="Arrow2Lend" overflow="visible" orient="auto">
   <path transform="matrix(-1.1,0,0,-1.1,-1.1,0)" d="m8.7186 4.0337-10.926-4.0177 10.926-4.0177c-1.7455 2.3721-1.7354 5.6175-6e-7 8.0354z" fill-rule="evenodd" stroke="#000" stroke-linejoin="round" stroke-width=".625"/>
  </marker>
  <marker id="marker5366" overflow="visible" orient="auto">
   <path transform="matrix(-1.1,0,0,-1.1,-1.1,0)" d="m8.7186 4.0337-10.926-4.0177 10.926-4.0177c-1.7455 2.3721-1.7354 5.6175-6e-7 8.0354z" fill-rule="evenodd" stroke="#000" stroke-linejoin="round" stroke-width=".625"/>
  </marker>
  <marker id="marker5394" overflow="visible" orient="auto">
   <path transform="matrix(-1.1,0,0,-1.1,-1.1,0)" d="m8.7186 4.0337-10.926-4.0177 10.926-4.0177c-1.7455 2.3721-1.7354 5.6175-6e-7 8.0354z" fill-rule="evenodd" stroke="#000" stroke-linejoin="round" stroke-width=".625"/>
  </marker>
 </defs>
 <g stroke="#000" stroke-linejoin="round" stroke-width="2">
  <path transform="scale(1,-1)" d="m277.4-146.74a90 90 0 0 1-44.866 101.09 90 90 0 0 1-109-18.742 90 90 0 0 1-8.5231-110.27 90 90 0 0 1 104.83-35.27" fill="#f60" fill-rule="evenodd" style="paint-order:normal"/>
  <path transform="scale(1,-1)" d="m571.92-123.81a90 90 0 0 1-79.035 88.14 90 90 0 0 1-97.993-66.427 90 90 0 0 1 52.604-106.06 90 90 0 0 1 112.18 37.82l-77.749 45.333z" fill="#f60" fill-rule="evenodd" style="paint-order:normal"/>
  <path d="m563.03 170.92c0.55299 30.272-13.885 80.122-105.61 60.215-36.692-7.9637-96.312-52.395-82.642-120.9 14.34-71.869 76.392-105.72 135.93-90.745 63.871 16.065 79.728 54.875 85.331 96.207" fill="none" marker-end="url(#marker5394)" marker-mid="url(#marker5366)" stroke-dasharray="3.66401, 3.66401" style="paint-order:normal"/>
  <path d="m211.77 212.34c-47.648-16.371-89.79-53.167-85.852-95.888 2.8382-30.786 42.936-61.544 73.46-56.625 43.981 7.087 48.661 47.491 46.792 77.391" fill="#f60" fill-rule="evenodd" marker-end="url(#Arrow2Lend)" marker-mid="url(#Arrow2Lend)" stroke-dasharray="3.66401, 3.66401" style="paint-order:normal"/>
 </g>
</svg>
