<?xml version="1.0" encoding="UTF-8" standalone="no"?>
<!-- Created with Inkscape (http://www.inkscape.org/) -->

<svg
   width="203.46458mm"
   height="146.05mm"
   viewBox="0 0 203.46458 146.05"
   version="1.1"
   id="svg1"
   xml:space="preserve"
   inkscape:version="1.3.2 (1:1.3.2+202311252150+091e20ef0f)"
   sodipodi:docname="preferences_theming_no_dark_theme.svg"
   inkscape:export-filename="preferences_theming_no_dark_theme.png"
   inkscape:export-xdpi="96"
   inkscape:export-ydpi="96"
   xmlns:inkscape="http://www.inkscape.org/namespaces/inkscape"
   xmlns:sodipodi="http://sodipodi.sourceforge.net/DTD/sodipodi-0.dtd"
   xmlns:xlink="http://www.w3.org/1999/xlink"
   xmlns="http://www.w3.org/2000/svg"
   xmlns:svg="http://www.w3.org/2000/svg"><sodipodi:namedview
     id="namedview1"
     pagecolor="#ffffff"
     bordercolor="#000000"
     borderopacity="0.25"
     inkscape:showpageshadow="2"
     inkscape:pageopacity="0.0"
     inkscape:pagecheckerboard="0"
     inkscape:deskcolor="#d1d1d1"
     inkscape:document-units="mm"
     inkscape:zoom="1.2719831"
     inkscape:cx="642.6972"
     inkscape:cy="239.78305"
     inkscape:window-width="1920"
     inkscape:window-height="1138"
     inkscape:window-x="0"
     inkscape:window-y="0"
     inkscape:window-maximized="1"
     inkscape:current-layer="layer1" /><defs
     id="defs1" /><g
     inkscape:label="Layer 1"
     inkscape:groupmode="layer"
     id="layer1"
     transform="translate(50.363232,-81.443939)"><image
       width="203.46458"
       height="146.05"
       preserveAspectRatio="none"
       xlink:href="data:image/png;base64,iVBORw0KGgoAAAANSUhEUgAAAwEAAAIoCAIAAAC+qXAIAACda0lEQVR4nOzdCVyUZeIH8GcAkRsG&#10;lHsAuVQUNUvRwXQ3rwY8Kdmyw1JDy93AtP+aa63bmlZqQZfCaru2Vq6WaSWUR66t4EFhCqIyeHF4&#10;CwKDcszxf973HYa5gAFnmBnm9/0gPvO8z/u+z8sA8+N5npkhCgAAAADbQ8zdAQAAAAAzQAYCAAAA&#10;W4QMBAAAALaoExnos88+ezBubMqChTdv3jRdhwAAAAC6gaEZaP369T7Bgzb8+/un0tbHPhB3+/Zt&#10;k3YLAAAAwKQMykAfffSRp7ffOfEFWpbU30tZvmHYQ8Lq6moT9w0AAADAVDrOQFlZWR4eHiVi8d17&#10;986UnD9WcLr86q3kP60fMerhmpqabugiAAAAgNF1kIH+9a9/ubu7FxUV3bhx44cf9m7/+tsPsz7/&#10;YPNXh389M/HZN+Pix9XW1raxa3YKURGmiw3rDreTwc3Nge1iSrZmjbF6bMRDmVDLXWsFXQUAAGiL&#10;A2nbl19++cILL7z77rv29vYvvfSSt7d3X7/AsqvVt2qbt+48MPvxqVtr74qmzPgx+1tXV1d9B6CP&#10;kbmpkaQ0Iz5qTkYiU2xfzoKELJouMkUdtDM3obAoYUGO5ffzPuUs4K2KEWvfbVytQtHRnQkAAGDZ&#10;2sxAe/fuffbZZ+Pi4rKzs1955RUal6ZNm3bkyJEzpRW93P0c3Xw3bZU+PGb0wSONCVNm7Ptxj6Oj&#10;Y1uHikxdkZK2ak9paochiMaLmKguXkl3Sl6Rvn1VRqnIgAvqaXJ2FaVvybS96wYAgJ6nrQGioUOH&#10;urm5xbEEAgFtGRoayu3Sy62vi/+gPv0nxs9cMvH5d/wfeuajjz7SOYD6tI6qzBRSUoTKySRxulDZ&#10;C3qzde5MuZvG1vb3bTlFuu4kjXY7nQqdBh1QXova5akVNQ9GN7QcU7ON1pla9mIvQPdQ6h3T6m2b&#10;X+T0bGVD2ky1T+uXpeOvntpUpnpvmUtKwVQYAAD0AG2OA2VlZa1fvz47O9vBwSE8PJx+rqur8/b2&#10;vnPnjr20PtTfw9vPp+pmZcmZk172dyZNer2t41ClGauyhMli5dhBXpFyJiVnQdT2ZLEily3GZ0Tl&#10;KrJJ6+SL1tZSUWo7+yq3phWvUCgymdmahLU5qZkidhaupR1HZ8fotWmDsxW5nZ7WEmVm7+JpzfBp&#10;Hzx3RkrCrpxMkYgZPRGSInYorHTPdhKzRe1IdC9lF5juEpKuWcnWxmcwXxbdy2lLXtqqZOYrxXwp&#10;eEXp7Bet9cti0FcvU+PuUJOlvBNoQ4NmOAEAACxT+xHp5s2bMTExNPr4+vqOHDly7Nixo0aNYmr6&#10;+PVy8XrwoZGbNm2qr6/Xt6v6mmjVSILeIRNVEyNtVZWZZppDLro7sjV6RjTaHB7SHABSP7XegysH&#10;VdiBGabcUqV+otYK/T1Xnkf3ctoZB9KuVLTXz46Po9UVnTIAAIC1aW9NNDVlypTi4mKufOPGDUdH&#10;x+bmZrqbk5PToZ9+Gj16dHV1da9evdrYW7kmum1aC6BzjLfV8JOKchWppRnxPF6exobIVFrfwZFE&#10;r6avilqQk932waOSyZw9pdHFRcmvZiaSVWvFpWQ7Sd5i/qGTLn/1AAAAeogOMtDhw4d37tz54Ycf&#10;0gK92dTUxNU3NDQsWbJk//7948aNEwgE3377rb29fefOHBk9mKStynhV/8Li+9na2iwxWajZrI0d&#10;aeARk/g5JaVE1Kl4Epm6JT0+KiGPpj39B6c9IHPmrGJjDy0XrV1LSPKrmueOHpynmrpblcXNhbGH&#10;4qbR2NqUFZm0VudySFSMMK9YTNszi5WV+3bca8O+enqJZqQkcLu2dgsAAMAadZCBHBwcxowZk5iY&#10;OHfu3O3bt6vqnZ2dZ82a5eLiQmOQl5dXpwMQQ5QppgEiipfG3mIGJoy1VYVmm+xinrIZO/Shs+OM&#10;XbyErJYbnc8ETAraHpXWVq9ETAhK286N/DAhiJbFWmcRZWan8BJ4Wco10dvVDsXjMWVmOE2k/3KY&#10;p9xx+7YuVe6YgV89Ju8k0FYaY0Z035J4blda38NfHQAAAHq09qfKkpKSaAaqq6vr37+/apfp06dX&#10;VFRwDd566y2Tz9cBAAAAGFsHGYhmHblcTgtSqXTNmjVcBnr22We7pW8AAAAApmLo+8ZTNAxt27bt&#10;xIkTpusNAAAAQPfoRAYCAAAA6DGQgQAAAMAWIQMBAACALUIGAgAAAFuEDAQAAAC2CBkIAAAAbBEy&#10;EAAAANgiZCAAAACwRby79RIzvUsHAAAAgNl08J6pAAAAAD0SMhAAAADYImQgAAAAsEXIQAAAAGCL&#10;tDPQzetX9bZramz08vYxfX+AcafqtmPv3ubuBQAAQE+GcSAAAACwRchAAAAAYIuQgQAAAMAWIQMB&#10;AACALUIGAgAAAFuEDAQAAAC2CBkIAAAAbBEyEAAAANgiZCAAAACwRSbJQGdLSlavfT8wwP+p5Fmx&#10;g2O0tjZLpWvf/+CBobGiSRNNcXYAAACADpkkAw2Ijk5OmpH+8YZfT/z29t//+uCwYepb3/j76uO/&#10;/PrToZ+bmpunJyaYogMAAAAA7TNyBjonFvePiqKFKaLJl8vKd3773adbPlfPQE1NTfm/FnBlV1dX&#10;454dAAAAwEBGzkBvvfte8mMzpzw6SS6XX79xg9ZcvHxZvUHesWPu7u4e7m6Pz5g+4XfjWqp/fT/x&#10;ze+V5YGL/vF2UqABJ/vl4/F/3UsGzv9s3dQgI14DAAAA2AAjZ6DAAP/0jz65fLns2vXreceO0xov&#10;Dw+FQsHj8Wj5f3lHNvzj0/R314QKgnV2VUafym+XPfved3Edx5pf3//r3il/2734IeNewX3Z8vmX&#10;fn37/m7sGCcnJ3qzsbHxv/87fO36jTlPPWnurgEAAIAGI2egp5Jn/Xrit53ffqequX7z5gcbMlNf&#10;Wnj8l18/ydz07ltv6gtArYKmzZqSuePYlakGDAUNDDVkuKgbefP59Hr3Hjg4afzvaezb+9N/q6qq&#10;+Hy+ufsFAAAA2oycgWIHx6x586///OzzC5cu8T09aSCgUSA8LOyXX0+8/+Ena/7+11CBwOCD/fp+&#10;4g7yKPn+B8GaPYtGXvnu5Rc2nWbqJ63ZMyqXmzt7Yfp/F2z8YFoA0di6aGR7+yq3hi4QfJy5l1YN&#10;4o7AuLpz6cKPzzAl5QiT9o46DTQ9Onninpwfqu/coTGIXnhVdbWHu/ujkybcz5cUAAAATMH4zwt7&#10;6IFh9IMWFApF+scbIsPDAwL816d/uPpvb4SFhHS4e+W3O74fGP+ZcoDnzMXQjQf2BDB56IXc3/1j&#10;9weBzDKgl78N/GDPG4TmGOXKIa2tV0dOa2df5daPL886sGcRu6ho5/Fpynzz37EbD6wLaOmLzo6B&#10;Oz8OfePAugfb6ryjg8MU0aPfszGI3nR3d08QPdq7Vy/6pbi/LyoAAAAYmQlfI5HH4y3+40uFRcVv&#10;rV335oq/nC0p+ebb79P++KKdnZ2+5mc+fmH6x0xh0po9qsVAA3/3EJtIrly5SM58r2xAyKOjNHbV&#10;v7X9fQcueoyNMg+NmkJ2VFwhI8kv/z0z6enWAKRvx4dCBv3w5suhqnEjbTTryKQye3t77qa9HU8u&#10;lSp64YUoAQAALI6pHp7lcvn7H23Yf/C/vXv3WvfWqrPi0vSPPqER4ZcTJ+7U1IaHhT7/7FOarxvU&#10;4dPBuNkolV+Nt9Xwkz74wZ6pld8uG594Ru9c2L2Ghr37f7pTU8OtAaqurt574KdJEx5xZpdIAwAA&#10;gOUwSQaiAWht+gd7Dxwk7GhQZET4nh/3cvNB12/cpJ/PnCtZ9vrf3lvzlu6rSOsXGNiPbNr6bdJI&#10;vQMw97O1tdlDvxuo2ayNHYOmvf0ZWfbOlauEaB9w/8FDXABKfHQSvbnnh700BtHKqaLJBl0mAAAA&#10;dBfjZyAagNZ/+DEXgKikaVPo55dfXHDs+C/cEuknZj3Wx8dn4z82f7HjqzWD3zDsqA8u/sf8l19Y&#10;OD6TvfXoGwf+ZKytKgFJ6964nKhsxg7z6Ow4+ijzikSMSWv26ElUVVVVffr4PDpxggM7HUaT0A/7&#10;9t+6dduwawQAAIDuw7tbL1G/ffP6Vb3tmhobvbx9OjycQqH4YEPmt3tyuJuJkyct/tNL3IsDJSQl&#10;NzY2Pj5z+ovz59KbR44f/8enWz7d+PH9XoElcXJylisUzU2N3KAXvfBejr3teLyGhnudOs6dqtuO&#10;vXubpo8AAADAMPI4UNan/1IFoCmiyWmLXuQCEBUWEnJOLJbU13M3R48cKQhq74WCrJFW1qFJqKmx&#10;wVydAQAAgHYYOQPl7NvHFUSTJqa+tFAVgKi5c55+7Y2//bB3vw+fP/fZp2lNcJCFvcQhAAAA2Awj&#10;Z6A/JCV9sePryRPHvzR/rtZz4B96YNh7a976fPuOgz8fjh0UM+LB4cY9NQAAAIDhjJyBnkx+nH60&#10;tTV2cMzbg/9q3DMCAAAAdAFevg8AAABsETIQAAAA2CJkIAAAALBFyEAAAABgi5CBAAAAwBYhAwEA&#10;AIAt6kQGSviHzHT9AHVfPGbuHgAAAPR0GAcCAAAAW4QMBAAAALZIOwPdauN9451d3EzfGVBqbmqq&#10;vVNl7l4AAAD0ZLy79RL1284urubqCgAAAEC3wVwYAAAA2CJkIAAAALBFyEAAAABgi5CBAAAAwBYh&#10;AwEAAIAtQgYCAAAAW4QMBAAAALYIGQgAAABsETIQAAAA2CJkIAAAALBFyEAAAABgi5CBAAAAwBbd&#10;Vwaqqa66cbWiXiKRy2XG6hBYFDs7e1c3d9+AIE++t7n7AgAAYExdz0BXyi/dvnlDEBYe7sm3t7c3&#10;Yp/AcshksrqaOxWXL9RLagMFYebuDgAAgNF0MQPVVFfRADRwyHAHB8ym9WQ03Xp5+7h5eJ45VeBK&#10;/8NoEAAA9BRdTDA3rlYIwsIRgGwEvaODQ8NvXK1EBgIAgB6jiyGmvl4S7sk3blfAknl48csulJi7&#10;FwAAAEbTxQwkl8mwBsim0LtbJsPKdwAA6DkwmQUAAIzp8xZfOpWnU31j787CMUnjXciNk/kXjX5S&#10;wYg4byI5tHO3lyDS6AcHaB8yEAAAANgiZCAAAGDs3vw+V9Aamyktl5jupOX5x0x3cID2mTADnSsp&#10;+XHf/rMl5+rqJB7u7gP69580cUL/qCjTnREAAEznermEnRQjKTPHLVr+rqp+6erN+77JYoutyakl&#10;SP03NmmKd8suqpZbM1bGCkVqzXbfIv4idsatZepN+yxsS+YUmzK2zk5daKK5ObApJslAMplsy9bP&#10;9x04oKqpqq7OO3qUfkyeOOGZ2bOxnhoAwNr4TmKjCZX1zZ6nnknhso7mKiK3cUnT1Rb30JtTvJW7&#10;HDp+/oXfTp3i2n2yedMGNgPpcPm/la+3nOXQ2N/lcFGJnqXllTnc5jMBCMAITJKBuADU29Fx2tQp&#10;Y0YLvb35t6uqco8c+fa773/ct1+hIM8/+4wpzgsAAKbDDd6w4zFu5eViGnRy8s6wAUg5JMMN8+Tm&#10;Hkh8IlJ9Fy4nuZCqk/nH6C7LUp/LO1XQxkncls6bFCt8v2XUh9FyFuUgE3cEk18t2ADjZ6BzJSVc&#10;AFrx2rLIiAiu0s/XN2n69NhBg996++29+/cLR4/CpBgAgFW5wQ3JDB8i1Hn6mO/QEXH6dpEIBMyv&#10;+qiIwXSXKRMnMWWB4C4hbQ/kaJylrKwsVkgulVXQGuGQAdzwUkdHADCU8TPQ3v3MFNi0qVNUAUgl&#10;KjJi6pTEr3Z+s2//AWQgAICewrRLc8JCguln1dDRvtwjCEBgFMbPQGfOnaWfx4wW6t0aP3o0zUBn&#10;zp41+nkBAKCbiYQDUwjxVhsHEg4J3rD5a1OfBcAojJ+B6uqYZ1F6e+t/Jw0fHx/6ubauzujnBQCA&#10;7leef6yNF1c0poM7D4iUK7JbnzgGcL/u1kvUPxSG+fXIz21tevHll5945tlr16/r3Xr12jW6lbYx&#10;8ERgOdq50wEAus20uWlDHhq5cG6SuTsCVs/440AD+w/IO3o098iRpOnTdbfm5h2hnwdE9zf6eQEA&#10;oKfSHWp6ad58c3UGegzjZ6BJEyfQDPTtd9/HDhocFamxLFpcWvrtnj08Hm/yxAlGPy8AANgGvDoi&#10;GIfxM1D/qCgacX7ct/+tt9+eOiVxjFDo4+196/bt3LwjNAA1NTW5u7v7+/kZ/bwAANBTqd7HA8CI&#10;TPIaic/Mnq1QkL3793+18xv6oarn8XgeHh61tbV/X/P2668t8/T0NMXZAQAAADpkkgxkb2///LPP&#10;xI8e9eP+/WfPldTU1Hh4uA/sP2DSxAkBfn6r3n6nvKICMQgAAADMyITvmRodFRWt74UQV7y2bNXb&#10;b5eXV7y5es2KZcv4fC/T9QEAAABALxNmoLZ4uLuv+POfudGgte+/v/rNv3V/HwAAAMDGmSEDUR4e&#10;HiuW/fnd997z8fYxSwcAAADAxpknAxE2Bq1audJcZwcAAAAbZ7YMBAAAAGBGyEAAAABgi5CBAAAA&#10;wBZ1MQPZ2dvLZDJ7e3vj9gYslkwmxd0NAAA9SRczkKure11NtZd3H+P2BixWXc0dF1d3c/cCAADA&#10;aLqYgXwDgiouX3Dz8HJwwGxazyeVSivLLgWHhZu7IwAAAEbTxQTjyfeul9SeOVUQHBru4cXHLElP&#10;JZPJ6mqqaQDi+/T19PI2d3cAAACMpuujOIGCMFc3jxtXKy9fKJHLZEbsE1gOO3t7V1f34LBwBCAA&#10;AOhheHfrJeq3nV1czdUVAAAAgG6D1TwAAABgi5CBwAyWrt6875ss9ZrVSxYvXP/3wp27vQSR5uoV&#10;AADYlC5moIKj/zNuP8AqDB/1sFGOs275PEI/CBGMGNSae9b/3SgHBwAAMETXx4GM9XAI1gLBFwAA&#10;ehLMhYEFEZfXzU6Kc2GmxuYmPrGA1pSWS0RJ412YjTdO5l8k7NDRzoyts1MX0sqtGSsPlzlsXL+C&#10;tOyi2x4AAEAvZCCwHG6fbl4lzj+Wk3dmWWoCl4F+nxTHTZbRyj3bMtnK1mZPpz5Ho89JtV30tQcA&#10;ANADGQgsh2TNynfofyLhwBTicqe89BbxdyJu45Ke4janzByn00wSHz9etcsvR37T1x4AAEAPZCCw&#10;cJ2d0sIUGAAAGAQZCCxXpMCtgfgaPqUVGRzUqfYAAGDLjJmBFArFtm3bnnzySSMeE2zcwZ0HREnj&#10;l6//lLBzW4uWv9tu85pOtgcAABt2t16i/qEwzK9HftatlMvlU6dO/eKLLww8SHaKdmeE6WKDdzW4&#10;LRiJ3jsdAADAShl/LuzLL7+knw0ZDRJlKhSZ9P+cBbxVMeLcVLw+MAAAAHQXk6wHojGoqalpzpw5&#10;pjg4AAAAwP0z1Zror7/+mn7udAwqzYiPSstjiynZikxR25U6O+hsAgAAAGiTCZ8X1vkYlLMgKm1w&#10;tiJXxGWb+AxmgkxvpWqPtS3bAAAAADrBtM+Nd3R07ETr0pIikrKCyzORqStS0naJaUlfpSoDRcUI&#10;sxLisZgIAAAAOsmEGehJlumOz4hMzVWklmbE83h5mAsDAAAAw5kqA3UlAEVGDyZpu3IyRey016qs&#10;lBXMs8b0Vmrul5orJvFzSkqJCKNBAAAAYBCTZKCujgCJMsXp8VE8HlMWpou5ZT56K1vkLOAlZLGl&#10;lGwFAhBAJygUCnN3ASwUj/uNC9DjmfE1EsG64DUSewY5S9ZCCqBG9Y3BfZ+Y+7sVwLSMPA7UHWuA&#10;AKCruB/72jtVN69dqZdIaBYyd4/A4tjZ2bu6uff1D/Tw4hOMCUGPZswMRH9UEIAALBYXgCrLLtbe&#10;uR0QHBYe7W3vgHdNBm0yqbTmTnXF5QuetfygkHCCGAQ9F34DAtgELgDVVN+mASg6ZphCIW9qbiRN&#10;DebuF1geHs/N3b3/oCHnTp90c/fy5HsTxCDooZCBAGwFzUC3rl/1DwqTSpsVWBANbVEopHIpDT0B&#10;waE3r13x8OIjAEFPhQwEYBMU7Gro+npJUKgLAhB0iH6TOLu43rsrod82PJa5ewRgfMhAAD0fF3qY&#10;GCST0ccyZCAwBM09MplM9c2DGAQ9DzIQgG2RyxGAwCDIytDjIQMBAACALUIGArAJan/T44976BxM&#10;hEFPhQwEYFswvwEAwEEGAgAAAFuEDARgazAQBADAQAYCc5o+b/GlU3m0IBwSvGHz14IRgwp37vYS&#10;RHbP2UvLJaKk8S5smevA0tWb932Tpd5m9ZLFC9f/XdUr2uFJEb0WLX9X7wG7uf9d1HEEOv7u+C/D&#10;Pns/OUinhuxa+OyhRzQ2tb+jypXtLz+XcZotDnrpPx/MCO5a5wEAjMe8GShnAW/XDEWmyChHSsgi&#10;wnRxbqplP/6AEpc/dmasjBW+z93Mz8vr9g7E5bdElqWr19DP65bPI/RDK82s/zu3C01IKRMHJD6x&#10;QP041pF71Cg6DkF2doRnZ6e+cKilJujxfx59QnrvnlRu4I6syl0vPrshYn1uQTx78/KXW44rZo00&#10;sL/5a8d/QXPVLP2pyxQ7AoCtsORxIJprVsUYFGpyFiRkpWQbJUxBN1my8nU2ACnvs0iBGxEIu70D&#10;61TZZd3y19pvv2Hbvn7kXOIT+keAbIW8uaG+uZP7XNnxzoao93OXPSC5W89W+CY96dcsNfQd62mu&#10;sqP/Oq/LO/YQn27596efbW2nwdw5z8x99ulu6w+ABTJOBvqS1U6DJ1lGOVcbhDFRpjw8GFVpuaT4&#10;1C5uBEiLuLxudlKcCzMJNZcbcVHNT6XMHMdNQglGDHp7yep3168mas1UE1url7yycP2b3NiM2mzX&#10;jZP5Fw3pgF57ck+f2vfZhs1fa9ULRsR5E7dxSU+p+qbbf90+0P7vzNg6O3UhrdyasfJwmcPG9StU&#10;16LVPifvzLebV+ieuusMXA6k0GnJ1OSvnfBF2BZ2cKVy14tzNhQSErvoxfCPDykrqYpdLz7N1f9z&#10;w8xAUpl/8PS0ucMkTdKW48iamWLL7tT01T++ygwLsQdfFJbxcTZR7l65dsKK3fTG05PfT1x1eDGh&#10;DUgi2b0nbN3+VPL+5KV72P2ZTSOYsJX6PDfdNn31KrJcfccR9/MFs1IL5s/r5eiYuenTtrbSANTc&#10;1NTNvQKwKMbJQFy+aSsGGRCA2CGf9MFpacxDHTujJWYntwiJ4qVxIzylGfFRaexkCXeb2YWkkKys&#10;cgEpL2dbbmenwnKUe7Y0ZGjvrFsB3Uw4ZLi+ardPN68S5x+jD/zLUhO4DKE+P/XUMynsyI3bnQu5&#10;JzWb/T5pfDY7sLRh2z7vlsP9PimOC0O05Z5tmerTWKoO0PZsBJEcanNKy43mLRpWdDeU5x/TnAvT&#10;0399fWht9nTqczT6qF+LVnu7kLFd+gK3yYC5MKro/WcmaybEwYuZp9Vzgyu0kL92DjO6s2U0ufR5&#10;ShKxW6ycAit6/9+/23k0N+zIO8MX7zgy8+VRdna82NBAmdYEWevupHzHc7MWb9/y3qwgevDijLI5&#10;BUf/QpS7v7L86DqHUVv67dg42/9efeNx2uB8xJcFRwMaJA1kWW7B6/RQR94a9c/tyQ/NqtyREbmu&#10;YDM9Imm+d49o7CgltqepqfH5Z5+hBd0YRAPQ888+TRuYo18AFsRoc2FtxSCDR4Dy0opXKBSZ7Mqe&#10;tTmpmZmKbNI6F5azIGp7sliRG8kU4zNKRanMLkUxYoUiUmvWTJTJHIarzHhVlBrJ5J2WnTm6R7Oa&#10;xRw9Rt6pAn3VkjUr36H/iYQDU4jLnfJSLgosS32OVnqrNaNhSL3ZLeL/yJBgbmbtxScmrl7PNCot&#10;lzixgzTcPikzx+ntAG1PP2iUabuzkk0ZW5NSn87fGdXRuh/t/tOO6euDejNJfPx41S6/HPlNq/2i&#10;JxaIhMYbBDJU7FKaHgSqmzRn/Etje+W1S7Fpbwyrq5cQv8fnPPbhZ607vpHkJ6mrHxb/GPl3ZSUh&#10;doQUXiwjJEBrdzLteXZ34jNt3oz0g1cJCWJ3n/1gvaSOKHeXNgU1yYlC1lBXr3y8jp0Y51NPAxD1&#10;v1XDl+ewlYMX07OERAxdvnRO8KefzAxk6iRaO9qiZjYGOTr2/vCTDapKLgA1IwABGHc9EM06jo6O&#10;W7ZsUa8xeApMmP4qOxwjmpFCVpWUEpH6Y01pSRHJy4ripXE3U2ZwuyQn6ntAah0IEqYz++7Znpey&#10;IletpZ6jIQN1q0iBW8yQGYV5Oar1QG2hOebl1AQxO4U0fd4LnT+VxhSYegcaWjKWIUeJErh/kPHV&#10;uKSJeo/WtT4Yr30nGTQXppDdq6uvU91skhO12TEF+3aaCqmMHV6RN0nVtipkjU3MO5JJZXKmFSGB&#10;oybEfnT4+B/j1OejmFcdlsu50RlZk1RGeKRl92YpUd9ddUZltxVyukXBTKW9tNz+wyO58aTyi5Q3&#10;ZbQmcOamI0+Uf5Hy8ITT01b/8OoIrR1tVHNj41N/mEULXAxiAtAzT9NKc/cLwCIYeU30Y489Rj9z&#10;McjYa4C0Jq1y9LcqzYhPINkKBTt5Nsfgo0F3Wzgv5enU57ZmEC4G0axTXX5Kt5m4vHwCO2nFruBp&#10;84ljNNP8dKqCC1WquTA26PhqTYGpLF+S3qlMIxIOvLQk68V5j3VqaU77fdDTPjhIq73R1wMZMBem&#10;4Jop9NS0FIICI4qWf5GfuGQEqfjm828I/YtCbav6LvK+j8+ZNnrpo/LVOUu5XFK5+6urIRHko5/z&#10;F40Ywdz813fT5r6iUEj17a73mPS/q+WFsf18JbWSyoN7C8kjzIka70kafR/bsMth0RtXrij0XIWN&#10;ampqnP2Hx5vY3PP8M081NTWYu0cAlsL4zwujMaiJXWdnzAAUGT2YpHEzWx20FBfnccujmeEfkszs&#10;m5gs1NzX8KOBydBIEbXzALv4dyVpeXkevc02bg4ZOiJOOCRy+JD2njiWlfGvp5kps5Wrl7xS1VJ5&#10;kD3F8vXMegjVsmXOi09MDAvJpkfmbm5c8nKHY0J0l6UXyrRi0B9mvqK+JlpXO33Qp0arffjvnm+/&#10;V+YhH/Hn96bFvSLaTUjsn15+jPzUTtPmBxcX7Ah/bpZIubJp0KLtH40I3ZH2grJm0JIdH42UNrTx&#10;RLGRY6f/ZfGzovTEN39Os2+tHvXk0s+f/sPEj8igxKRYtib/g7HKqbGpGf8NIs0CtR1tcU20uuam&#10;pufZp4BhDRCAOt5dZkK+lbOLqyG7FRz93/BRD9/32VWvD6S+oKe1rJzU0l4TzdUQvbu0rnYWpqSQ&#10;opgtqgaa66S1j4YhoY4Z6U43OfZ5VbFik04nWRuFQiGXy2UyWVHBsYj+MR01d+jt3lteX98s161R&#10;2+Tg7ObsSLfJLnwx76my5/a/+JD6Vq2D2Dk6uzorI4zs3t27TfLWGmmjnl1ay/ZOns696MM4swpI&#10;rYFdLxf33vbMVFozsZM31DfbKftDH+jv1d2jiUptR1tcE20U588VDx4eZ29vb2dnh7dNhZ7HvBkI&#10;rIm13OlLV2+uP59tzCeTW79OZqDOOZqR8H9lf/zP+oSAjtuClUEGgp7Nkl8jEaATVG+7YfI1xVbO&#10;SOtjrn6VNu/DYq487YPDMwLvNul/7WgAAEuFDAQ9xO7Nhr7goa0zzirhwCezDj+nnNxqaqi9h9km&#10;ALA6yEAA0AXy5vqazr5rBgCARUEGArAteK44AAAHGQjAxuAVcwAAWMhAADYBT+qBLsM3D/RUXc9A&#10;I9+qNGI/wPJtHG/uHsB9s7O3l8nldnZ25u4IWAG5XGZvb99xOwCrhXEgABvi4uLWUC9xcXM3d0fA&#10;CjTU1zu7uJm7FwAmhAwE0PMx73CqUNDPPr7+lWUXnVxcMRQE7ZPL5VW3bwWF9uMmwjAdBj0SMhCA&#10;TaCPYTT3uHl4enjxxWcK/QMFtIyZDtAlk8kktTVXK8sCBKFu7p54hWjowZCBAGwFF4P8g0KcnF2u&#10;VVyuuHxBJsNLG4I2e3sHdw/P8OgYL+8+CEDQsyEDAdgE7pGMG/jh+/T15Pso2CfJK/BUeVCjmvmy&#10;Y9FvGB7L3P0CMAlkIABboYpB9LFNLpcj/UBbuAzEa2Hu7gCYivVlIGFCUPoDGjWn9tWcn+h88ZOb&#10;26rv47h8t00vOe+/z4MAWDbVX/mqBzYkIVCn+sbAUmiwBdaXgfKyK0dm0/+dXvuLe0vucXpt4n0f&#10;t1oy/y3JfR8FwNKpHtu49IMHOdCF7wqwEdaXgQDAKPA4B2CNrHHs1mJ/2/SgDOTttuklzyHM1Nj1&#10;+cfZZ7vwlTWE1Ke9dSePGzradm/CE0zlN9sqt/r0/XqiI1Hu4tAysMQ229f8ykRXou9oxpl6AwAA&#10;MJjWkxisJQlx6Yd7fTJieWGox2Qgx1fG3HvsrcryCK/jT7gJj7OJh1nfUzmfJpUIr00jHfKOazUL&#10;ith3feRbUqLcpUHjaH3qRr51h2gczfP8tsr554lgZN+vCXnPXBcKcN+qb9+6ea2yXiJRKOTm7gsA&#10;KPF4dq5u7n4BQZ7ePlqbFKzaO1U3r12hP7lyucwsPewaOzt7el19/QM9vPjEwmJQj8lATe99Kymn&#10;/59v+Ia4h/BJHnGIII4zXwp6hdt+okGnWa+LYnaAR7lLg8bRjjQQraNV1PztPFNXfrzum4l4qwGw&#10;VhWXL1TduhkkCAkJj8JrJAJYDplMVl9XW375Ql1dTXBouKqeC0CVZRdr79wOCA4Lj/a2d7Cmx26Z&#10;VFpzp5r+5vGs5QeFMNdlOTHImr6OncdNgak4ma8nABah+vYtGoCiBg52sKrfoQC2gP5N4uHFd3Fz&#10;F58pcnf35EaDuABUU32bBqDomGEKhbypuZE0NXR4NAvC47m5u/cfNOTc6ZNu7l6efG9iMTGo5/4e&#10;rJaeJ55zR0ryjhvjlXDp0YJ9no6QrGHmwtxnYi4MrNPNa5VBghAEIACLRX88A4NDrl+tVM2I0Qx0&#10;6/pV/6AwqbTZWpYBaVAopHIpDT0BwaE3r12hOc9CAhDpyRmINKz5pGbTS37HuafNn7jNPqP+Po62&#10;rf74E0Ez2TXR3xBno3QRoJvdvVsf4u5p7l4AQHvcPDwryy5yZRp65HJ5fb0kKNTFKgNQC9p5ZxfX&#10;e3cl9HIs57U3eXfrNV4Uh3bRkN0Kjv5v4YHwjtv1SMwTxBw+1Zhlswkbx18YPuphc/cC7gv9yY0d&#10;PtLcvQCADhQWHKe/b7mJMKlUWlRwbOCQB6w6AxF2/uvMqRODh8c5ODhYSAzqweNApiIc7Tmkoqbc&#10;3N0AAADbIZdbdwAiFvl8fmQgAzk8McfvlWCuXJ/2lgQZCAAAwKohAxlIum1L5TZzdwIAAGyK2tiJ&#10;xQ2idJnqJRPNDhkIAADA0lnePFJPgAwEAABgxaY+llxV3frmTXy+1/df7zBjf6wIMhAAAIDla3Mg&#10;SD0AUXfu1PSkiTOT6noGOv6XICP2AyxfwdEL3XxGwYhBhTt3ewki9d404pFBTW3hdztyr7NFv1Gz&#10;pw7yYEoVP2+6FDZ/TEhrM1pzgp88NdZD780u0D2Fnv7E84+e58+aMajlNBWHN14KWzgmmNSe3rX9&#10;6DWi3m16wB+LB0xmtmr3ue3O0wP+cI6t7J8wP+yS/i6RssObs4n6kTt1mT8Wt9zwH612LZ07SPt3&#10;x/3gDvVA9Xb9127s04HBOpVqOtX4eHr8a8oX0Itd9K+NSYGd2dm6YRwIbAVyT8fYJOH96LyFwcqb&#10;hRUklikHhw348VLFmJAuPOgbSt8p9PRnFMk7VTaIe2yuLTxRHT9uDNvsQkTyvBnsQ3LZ4cN3CGGL&#10;vv7VP/5cMW+sgd2mx/mBJMyfF6I8VxtXXXu6oLp/DDlRWBvcpRDgG69MDzRJ7NhY3VaWaidnmOXu&#10;QO4xM4XBuUahUMSPn6Rb36eP967/fKldezxjzGtlS3fkzhbQG5Wfz09eSP65wWZiEDIQAHBqCw8x&#10;gaM1MXgMUj3ghQwZVXCqggSb8FFX5xT6+hNDPKs2F5weEsIM9JzK5T+w0KO28DumWWtXx4xRHTPi&#10;gVHnT5yuDTZssKW2+pof30t1LrqPh56rri2/QMLHDSOHfiqvje3KKI5K8NjkUVXbL5WNCW5juKVN&#10;5rg7wOrdulUll8vt7OzU6q7s2Jr92Ps/P95Hcree3uTPej1t/x92HE1KHWWuXnYvZCCwPtPnLb50&#10;inmZ7q0ZK2OFotJyiShpvAuz5cbJfOYF5gUjBqXMTPnqm3TuJlsT503cxiU9lTJz3KLl79IacXnd&#10;7KQ4utfqJXMTn1hAa/QeZ2fG1tmpC13Ycx0uc9i4fgVp2UW3vXrHKkjYt5tXbNj8dXd/dbqstvz8&#10;9f7DtR7yKg5vPMFnppY8BBHVhwwY+Widuorh4kvrLFX/BGZuhRlOIANI8Vl+wvwhNRqNNU+htz/c&#10;Y/Oh8tpBgssnzsU8wAwC6W2m5DFoOH/zT6cFBk05BYfF/PCjRmM9V117+QKJGOfhQcIJ0w3VXOEJ&#10;/qPh539grrRlhktvpVb3BBF+R7nhFmZ+7SxbyczfEeWU2fbNuex0nubWYH0d06E2PxjTGiW17yDt&#10;I6v3rfUUFZr90Th+66Xpu69VXwF6umE1331x5AZR7aLdXuebB9R1NAxUcDS3w2PclUg0jlOZf/D0&#10;tLnD7kll3G25tO9DE2L3V1QQEpS/dsIXYavH/bR8QyEzR/bPDTPZwaHKXS/OYWoISVi3n0Ylttmi&#10;sIyPmdm01mZWAhkIrExO3plJEb0WbT6mqvl9Uhw3yUU37dmWyQYat+HhTq+3BCCqPP+Y5lyY26eb&#10;V4nzj9FdlqUmcBlI73FUzZ5OfY5Gn5Nqu2i1twsZq96xirwz3fllMQ7VKIgeHrEP8Hd1OPLBjM1M&#10;XjhVbQmOapaq4vCu07Uhg2jljSr+rIXzPZiApdFY5xR6+8PGmt9Okyoy6hEmY7U2qz3NPcSqJpsY&#10;IWMmX9p0qFBgyCRO8Nj5s+jD8MYjqsdgnS7RZEbCH2FuCSLIocu1qqGyG7knwmfPn+fBPK6rTqe3&#10;Ur+QMfPYbMHkhsIhU8fOn0zU5p40t9Jc0uHdQb/yzPDYDGUM/a6QORQTMs6Hz1o41aON86qHKvVT&#10;BGv2p6L10pgVVNzspP77Wq3Z5qrRLfc7s0vYJa32nlrfPKChw7kwSV1tp190x86OFxsaKFN73r1c&#10;KidFl64qFEF2dqQ44/NHdh7NDSvf8fysddtHrp9Fg9GcnyftyN0iIOTImjnfVMbNZJuVzSk4+hdy&#10;5J3hi3ccmfmyFY0hIQOBlYkSCF7+5lBYeKZq8MaJHeDhtqbMHMf+L4mPH9/uYSRrVr5D/xMJB6YQ&#10;lzvlpbeIv97jqDVTHpPb5Zcjv2m1nxz/lHrHaDOR0HoGgTjXq1tW0rQIHrNQ9ZAUHOZ9QjXy0QYP&#10;vv/ZH3epli3X1lSRG8XbNyv/Ph0Qxv7nGyHw0NNY9xS6/WGFhPXP/uEojSlazTwGTV04iB1n0hA8&#10;9tFLG09VxI7ROZC+C4idOi+WCQ2bf+ZikGaXuIkwrveh4eQL5rDcF8g3fhzbhka0AUcv1XL91lup&#10;xZfPVbYux/aN122lu7X9u4P5yrcMj6nOTtihtamae7Rz3vZO0XJpwWEx5EQNc3D997Vas2o+d79z&#10;u1TwtdsLdL4foDMUCoVEUj/lsWS5XN5Os74+Pjv/83nr7cKLZYQEaDSJ7af8qY9d+kaSn6Su3mfa&#10;3BnpB6/SmmuXyOlvZ8Wv57ZPpWnHjmk2+8F6SR0ZFv8Y+XdlJSHW84wpZCCwXMOHCFVlNuvc9RJE&#10;0r/4xfnHNmzbN3RE3NaMlc6Ch1VTUfets8fRbq/esVihyBhd6kZq8zJtCA7j//hbxSBugITvp7aF&#10;ecTlhzGPXINmzB9Ue/q7jZtuMEMpTA03zaFSoXZGzcbBmqdopz/cAyr3QOnh6U0u1OiPF6r2Q+JP&#10;7Pi5YrLqxG10vrVjj4y+8MWlirHBwZpXXfHbkRvXCDNQ1EJ3NU9tTTUhYVo90FvJzffxh3uoL8eu&#10;LfzukE4zvVvVO9ZV7Z+306do+742qH2wzvcDqOloLkwhV5wuPtt+AKK8fXxaDxU4akLsR4eP/zFu&#10;REtN5fEDhWHP00zEHEYha2xi3qZMduliKeGNYt/1lEz78MiflXG5+V5943GmWbOUOaZUJmeaWNMT&#10;860vA+Us4CVkadQI08W5qYY82YfuuiqGaasqmKaLYCRREaNeW/lnbknNxn//J23mLNWmF5+YSD+X&#10;lV1IFLo1EN+WqauuixR07jiRwUF626s6VkHOWNl6IGbuo//GHzYT1cNP7enCourc2/yWZ8irr5P1&#10;8OTfyD50OpTdVHbq6LUBk1UPZh6Dps4m3/1Eg0kwDShHlUuY2zpra2MPrVPo6U/toFjth8bgYaNP&#10;fLH9sGebT+RmL23cqF3bf7ymHOpoo/MVpwuVy8BrL1+44R+u7HNrlyouFbe+XgDh1ta0pLQb57lp&#10;I41lTHorVZTTVezT0FqWYzMtSYRWwza2trdsmYmGLQmy9nTB2f7DmWEwJlZq3B3tn7dTK6M9Or6v&#10;DWmv9f0AKh3OhckV8qIzxe23oQb0j2o9lLzv43OmjV6aIdzHTWDlr3vuE97irSPlChnTpujAsSsz&#10;ZwSQyvyfiqY9H6dQyAMjyEdZ/54xdKZq5EjB9U2hXbYO1peBRJkKRSZRCzTm7hCYzLrl86bPKxo6&#10;Io6WhUOCF7F5gl2O8xy7XTkMc3DnAVHS+OXrPyXsnBS35FnXH2a+or4mWpeBx2lRo9U+/HfPq3cs&#10;xxrXAwWPWZjM37V980buJn28f4Dk3lZroLZONmTMrPjvdnyx6aiyJbeMQ+P1dZjpqbHJNHy0DJyo&#10;ltNytBtrn0JPf6bq6TUzBeZ5eOOmzdxN/9Gzxuo+enJDOy3jN/o7H+xZvanlXLSrOiujPS+d8w+f&#10;pXZsj9Bw31xmuIiWfb2rD23cxCz4jeFiDWmr8kaucgLINz655els7EgV0x+//jHKMSrm2enZyjXI&#10;ult1vlath+VWHAezX3nucpgFUuzZPWKnTq7epLw72LGWNo6s5xTq/dHXkgS3d18b0j7skp7vBzCY&#10;XC4vLDrdYbOoSPVHTXnzg4sL3ls/fKJy3Hrme7mbhkvuNXODSbGRZevGTmRyVdJ7B0dKG2RkxJ93&#10;pKXMmjv2E3Z74ps/p9kb+TK6F+9uvUT9trOLqyG7FRz93/BRD5umSwbqQgbCONB9sYA7He4XvRNj&#10;h4+8r0NUHN5VM8S0Kza64RSd1UGX9L52Tre8oI5t3h02oLDgOP19q1AoaLKRyWRFBcci+se01Xjs&#10;pAT6+bNNGxf8afG9e/faP3Lmh+kD+0drVDk4uzk7csXmezWNUq5Y8P6kbWFffPxMPweNejtHZ1dn&#10;ZfBprpc0kN7uveX19WxqclAr63f+XPHg4XH29vZ2dnaW8Lap1jcOpEdpRnxUWh5bTMlWZIrarlQn&#10;VjZQTaW1zrIpd2CiEkkhWVmDsxWvlrQcTv/RAGxE8JgZpl6o0Q2n6CwL7BLHNu8O0OfZ+Qs7bEOT&#10;R0S/ftq10nuSOv3JSdHMrHXWIG+6V9ekXtFYJ1UdSK1sHXpABspZEJVGQ0quiMs98RncSI+eSvW9&#10;8tJWJYsVikhm65yMRGar+ixbxqsitn1eUQzTitYlKA8HAADQ3dpZZOPj7X27qsqQgwwcMMCxt6PC&#10;sBU7io7O2wNYfwYqLSkiKSu4cBKZuiIlbZeYlvRVamQgYfoWNuSob20dCBKmtzRLTmR3i4oRZiXE&#10;Y/4MAPQIHjtfz7PX9FUCdFXbweXH73cbOK8kl8m0FsC0bcSyIw/LJZJ2JrZ6AOvPQPeLyVBkBjtc&#10;lECyFQoRU5qj3SoyNVeRSjfweHmYCwMAAMtRX1drgqNKG2sNTEtWzPozUGT0YJK2KydTxE57rcpK&#10;WcHMZ+mtVJe3fU9pamokKd2zPY8dMcopzhPGRNEtTA1J1nuq1FwxiZ9TUkpEGA0CAIDu07PnpMzF&#10;+jMQEWWK0+OjuHFAZn2zqM1KdcLBxXN4PGaRc0q2gtkqejV9VVQUL40IU1KE2q0110sjAAEAQPey&#10;ppfdsRrW+9x46G6403sAIzw3HgBMT/XceEoqlRYVHOsXNcDcnTKCi+Kzg4fHOTg48Fjm7k5PGAcC&#10;AEPZ2dvLZDJ7e+t+WTOAnk0mk2r9kDI/uXK5nZ2dubpkFHK5xf3yQQYCsCEuLm71dTUeXt7m7ggA&#10;tKm+rtbZxU29hv7kNtRLXNzczdUlo2ior9e6LrNDBgKwIX4BQeWXL7i4eTg44GcfwBJJpdKrlRXB&#10;YeGEfYtShUJBP/v4+leWXXRycbXeoSC5XF51+1ZQaD9uCswSJsIIMhCATfH09qmrqxGfKQoMDnHz&#10;8LS0cWkAWyaTyerramgA8vLu48X34SppVqC5h/60enjxxWcK/QMFVveTS69LUkuvqyxAEOrm7mkh&#10;75LBQQYCsC3BoeHu7p7X6S/asotymczc3QEAJTt7excXt+CwcFUA4nAxyD8oxMnZ5VrF5YrLF2Qy&#10;a3pLCnt7B3cPz/DoGJrtLCoAEWQgABvk6e1DP8zdCwDoGJcYuIEfvk9fT74P904XBr7fhdmpZr7s&#10;WPRCLOQZYRxkIAAAAMulikE0Q8jlcmtJP+q4DMRrYe7utEIGAgAAsGiq0RRVgLCWJKTqsEUthVZB&#10;BgIAALB0qgzBpR9LCxPts9jeIgMBAABYDYvNE9YIGQgs1O2qqhJxqY+3t7u7Gy0E+Psbq+Dh4X6u&#10;ROzv5+fp6XE/BS8vz7PnSvx8ffl8r44LXl5nS0r8/Hz5nhoFX9++PnzvM+fOGb/Qt4+PT58zZ89q&#10;FnzOnKWb+vr4eHdY6NPHp/jMWfofLXa5QE9JL/Z08RmjF+j3RkCAf9HpYoMKPt4Bfv5FxRqFQP+A&#10;wtOnvb35QQGBXS7Qu1gQFHyqqEizEHSqiG7iC4ICu17w8hIIgk8VFnW5EBIiOHmq0MvTMzQ05H4K&#10;YWGhv5085enh0a9fWFcKYWG/nTpFf3D6hWoXwsP6nTh5kv5IRvQL70IhMjy84LeT7u7uURH3VYiO&#10;jPj1xG9ubm79oyK7UIiOiiw48Zu7m1uUTiE6OurXghNurq79+0d3ueDq4jJw4IBffi3oemHAgF8K&#10;ClxdXQb21yi4uDgPGhiT/+uvhhVcBg0ckP9rgXphcMzA47/86uzsHDsopssFJyenobGDj+X/YvRC&#10;7969Hxg65Ojx/LYK5G69RP1DYZhfj/xsYEvoMbrzTr92/bpEUt/Q2NhtZwQAAFuDcSCwRBcuXhw+&#10;bFhvR0dzdwQAAHos68tAOQt4u2YoMkWqW6tixLmpkWrbXi2Jj9qerKrs4GBqu4PF8PP16927t+qm&#10;XC6/VHr22pWKpsaGdvbq3dvJLzA4LHKA9b6cPAAAdBvry0CiGSkJu3IyRWwIKi0pInlFe0pT2RRD&#10;bwljXiWRolxFqpl7CfdHKtV4FVQagOoldQ+Oeri3k3M7ezU23Dt3+uSl0nPh0QNN3EEAALB61peB&#10;SFSMsKiklIho6inds31wenpRsZgQ7hZJ3oIhnZ7g6rVr0VGtd+X1KxXDOwpAFG3Qf9DQgqP/QwYC&#10;AIAOWWEGikxMJnPYoR8m9MRsiSZp3LiQuDhv8AzmcVM1w8UW0genpWXRWmF6y6RXaUZ8VFoeU5M+&#10;WHXYlkoqJZuZa1ObdFObMqPN1kbnZkapWnONwbjUAxDV2NjQYQDi0GaN7c6XAQAAcKwwA5HI6MF5&#10;u5ihH3ExSX41UhSdsooZFxLvykqZkandOC+teIVCkcnEmIS1OalstolKG5ytyBWxsYeQdKZZayVb&#10;G59BE49q0i1nV5GQFKnFLpKztqU1mERdnSTA32hHE4wYVLhzt5cgUu/N+zxa9zQDAACjs8YM1LIk&#10;iOzKGsyGnhiyak9pImEXA2kTpr8qUu5D2KhESoqE6VvYusjUFSlpq5gSs64oZQUXadhaJmO1TLqJ&#10;dxUlr0jeTs+Rmtgy3RYjzEqIx2pqk9GaC+thkHsAACyBVWYgLp3kxBRx4z7M5NjaPXuKjL0YSDnp&#10;Fl1clPxqZiJZtVZcSlpWHKXmKlJLM+J5vDzMhZlCDw5AAABgIawzAzHpJCohTZgu5m5GD85KSCMp&#10;2YY8bjIzacpZsdKMVVncXBitbFlVxNamrGgJV3PmrGJjDy0XrV1LmMk31ZFSc8Ukfo5yfTYYk3Hn&#10;wtoyfd7iS6eYVV1bM1bGCkWl5RJR0ngXZsuNk/kX1VuqNq1e8oqqcunqzfu+YZaapcwct2j5u4Qd&#10;4EmZmfLVN+nquwtGxC1racDd9CZu45KeUu0lLq+bnRTHHnxu4hML1E+n6gk98s6MrbNTF7qwvT1c&#10;5rBx/QrSsks7PQcAgLZYZwZiEokwjSQnKrMHM9GVRWYYNhwjysxO4SXwstg10Slku7JSnB4fxb0L&#10;C7N4WtRyGpK2nRv5YUIQLYvZUzKri7LYJinZCgQg4+uGubCcvDOTInot2nxMVfP7pDhuiopu2rMt&#10;k4sjLZvGZ7M5acO2fd4tleuWzyP0gw0oTz2Tws5tuQ0Pd3q9NYU40ZjF7ag6VHn+Mc25MLdPN68S&#10;5x+jJ12WmsCdVF9PWps9nfocjT4n1XZpp+cAANAmvFcGGKg77/QrV6+q3zz4w27D99VtHPxQTHWZ&#10;WOumuKwu8qGR33+5kavkbg5p+fjorVdV7emmZ+cm6R4tO7e4pb2yRv1EtPzs3DTV8dvqj25Zb0/a&#10;2SU/70RbPQcAgHZY6TgQ9HDGnQsbPkSoKpeWS5zIXS9BpBch4vxjG7btGzoibmvGSmfBw52aSKLH&#10;eTk1Qcy2nz7vBX1N3AiRXLpwvktd7uyUFqbAAAA6DRkILJFx58KiIka9tvLPGzZ/Tcsb//2ftJmz&#10;VJtefGIi/VxWdiFR6NZAfPVOJEUK3H46VVGYl6M+FyYuL58wZDhhw1DxqTx9p5VkrPzzqn8f6uzk&#10;FD1dWz3R3z44qFPtAQCAgwwElsi4i4HWLZ83fV7R0BFxtCwcEryIDUPsYprn2O3KQZSDOw+IksYv&#10;X/8pUVvmzMnK+NfTTOOVq5e8UsXWiIQDN24OoccUDolUH2fSd+rF3+97jEtgnD/MfEV9TbSudnqi&#10;T00n2wMAAAvrgcBA3XmnnysRq9/MO/hjw727huxIm+X990fTdAoAAHoUjAOBJdKaC+vrH3Tu9Mn+&#10;g4Ya8p6ptLHpOwgAAFYPGQgskdZcWHBYRPnF0oKj/2v/vcB6Ozn18QsMDo0wce8AAKAnQAYCS6T1&#10;vDAnJ6fQiOjAkH4KhaKdvXg8Xq9evRwdHU3ePwAAsH7IQGCJblfdbmwK6a2WZhxZZuwSAAD0MMhA&#10;YImio6KkzVKiUPTu3dvcfQEAgJ4JGQgskY+39/UbNy5cvBgYEKBQkMtlZWGhIR0WQkMEPJ7dpcuX&#10;u1yws7O/eOlSiCDY3t6hywVBcHCvXg4XLhq/EBwU1Lu34/kLF7tccHLqXXr+QlBgoLOzU8cFJ6fS&#10;CxeCggKde2sUAgMDXJ1dxOfPG1IICgxwdnYpNawQGODv6uomLi01rBDg6uoiLj2vXnBzcy0Rlwb4&#10;+7u7uxm34OHhfq5E7O/n5+npcT8FLy/Ps+dK/Hx9+XyvjgteXmdLSvz8fPmeyoK3F//MuXO+vn19&#10;+N5GLnj7nDl71rdvHx+fPjoFuumcb9++Pj7eHRb69PEpPnOW/keLXSjQnpwuPkNPSS/WFAX6uyUg&#10;wL/odLFBBR/vAD//omKNQqB/QOHp097e/KCAwC4X6F0sCAo+VVSkWQg6VUQ38QVBgV0veHkJBMGn&#10;Cou6XAgJEZw8Vejl6RkaGtLlgqeHR79+Yb+dPNX1QljYb6dO0R+cfqEaBfqTGNEv/MTJk10uRIaH&#10;F/x20t3dPSoiHM+NB0PhTgcAgJ4E40AAAABgi5CBAAAAwBZZbwYqzYiPSuPepkmYLs5N1ffeCjkL&#10;eKti2tjWJrpTQhZbSslWZIqMdVgAAACwJNaZgdj8MzhboRApb2bkkFR9aaUrR04gygOzhxXd72ER&#10;mAAAACyRNWag0ow5TABqHaKJTDVawhAX5wljoox+WAAAALAwVpiBSvdsz0tZoTs8ozY5pmcSS89W&#10;ZoSGpJCsLLVAJZqRkpAwJyNRY9ymdV+dA+vZpF6VTRLYebUoXhq33cBuAAAAgIlZYQaiVEM1rXIW&#10;sLNjuSIuhMRnaEw/tbU1ryhGrFCoj/aIMhVi2oKXppZRorYnixW5kUwxPqNUlKp+WO1NdN+WKpYi&#10;m7TOhRneDQAAADAt68xAecViQjQiQ2lJEWkZHIpMXZGStku9RZtbhcmJuskjMjVXkcpkFN4CGoOi&#10;6L55WUwoYqXM0Dyp5qbSEmaMKreNNNO5bgAAgKVTtPsmhhaFx+MZ0swUV2TgqbufFWagyMRkYdqu&#10;nMz7Xq3c/llSt6Rvj6KneZXoTIHlqLXT3FRaYso+AcD9Onvp+p5dm5ak/UXt5jZaEI0bGfPAaL01&#10;R06cyzv0Ay3MnjE5IGwALXx34NhDEZ5cGWwTFxRUccHCkxAXQWgnuYLeRGKiKzLk1GZkhRmIHULh&#10;JfCIKn2UZmSIoweTlmBUmrEqK2VFpvoe7W5Vl5OREcUthWaWHQmTo0gkofuuynhVpLtAmj2sxiY2&#10;n+lv3KluAIAJ/HP77mgft7tqNTt2bXqdzUN/T3+3X78oZ68+ujWl4qNL0pgp8H9v3/JM2IBbdxrd&#10;yM2AsDjzXANYAO4lhmvvVN28dqVeIpHLZebuUcfs7Oxd3dz7+gd6ePGJThYx6RW1f2rzssYMxC3a&#10;iYmPavlCMq8PJEoVp7fUsLe1dmhvq3rD6GLV/ZOSrWCiTCS7b8uMFzPuo3VY9U2i1NzsYp6yhq1g&#10;V1m3rIk2tBsAYALPJ0+nn38qPMrdPHvp+iOxQ7nyhHHTL14U2/FlWjUxD/TROsh3e796Pvmp7uoy&#10;WBwuLlSWXay9czsgOCw82tvewQoeSWVSac2d6orLFzxr+UEh4UQti5j6ito5tdnx7tZL1G87u7ga&#10;slvB0f8NH/WwaboEFgp3OvQMf09/ixvpOXLinCepUk2B3T6fb+cdpVUTP36K+lzYpWpeGF+BWTCb&#10;xcWFmurbV8ovRscMUyjkMrmMWPZEmBKPZ29nT8PHudMnaRDx5HvzWN1xRW2c2pin6CorSK8AAGY0&#10;+oH+9IMr7z++ZXTyHPP2B8yLJoZb16/6B4VJpc0WvgxIg0IhlUtp8ggIDr157YqHF199HMi0V9T2&#10;qc0OGQgAwCDfHfj58UmJukukwXbQiCCXy+vrJUGhLtYUgFrQPju7uN67K6FXoRoH6p4r0j216c5l&#10;OGQgALBRfL7X7fNirlxdfYfv7WOnU6NqzC6FrmWXSO9RXyLd/d0Gc1E9c0ouk9FHcGvMQIRdiyOT&#10;ybjO0zhCuvGK1E+teqaYeSEDAYCN6uPl9U3hyfjxU2h5/6HdS5+bW0/ctWpUjbEUWq+a6qobVyus&#10;5blRenHPWvINCPLkexu+l1xulQGItP2k9264IgtMjchAAGCj+nj1njlj/vr0DFqeP2Oas1cfZ0K0&#10;ariWR06ci4sK58qRUaO4BrNnTDZTxy3FlfJLt2/eEISFh3vy7e3tTXouGrY6lVEM30Umk9XV3Km4&#10;fKFeUhsoCOti/8A6IQMBgG15veUFEqkBYX4D0lLVt+rWEHZZtHpZ/abNogmDBqCBQ4Y7WMMzw9tB&#10;05uXt4+bh+eZUwWu9L92Y5PaSIbFDWl0FjcbZZYrspCJMIIMBAAAXXDjaoUgLNzaA5AKvZDg0PAb&#10;VysNHG2yvFmd+9XzrsgQPeTbFwAAulN9vSTck2/uXhiThxe/7ALe78i2IAMBAECnyWUyU68B6mb0&#10;cmQyw1d297xhE4OuqLm5+bvsnH0/HTxXIrazs4uMiEycPHHyxPGOjo6m7p8pIAMBAAB0Ulcj0JH3&#10;Ji0lq3JfGdn5XY+/O/7LsM/eTw7q4qk7YMAV3b59e+ny10tKS1U1hUVF9OP7nB9Xr3zdx8ennX0t&#10;EzIQmIdgRJxq1n31krmJTywwRx8GFe7c7SXQ9wa3AABtU3QtBFXu+uzytMfIl9srR8zqdJSxsyM8&#10;OztTrdvp8IqkUunSvzABKCgw4OVFL44cMUIhl+f/WvDRho1FxcWvrXzzk/T1Vjc0iAwE5iI51NX8&#10;gewCJqL++iUW8rwV6Ekqjv/Mm7B8Nlnzt+NXZs0MNHd3Omf3d3tKxKUBAf5bP/3UydlRzswb2o8d&#10;Ixz54ENzXph/uvjM9zk/TJ+SaO5udg4yEADYOtUL12pVcjEIYQj06MpozJUj/+VNeM3XnzzCW5Nf&#10;MWN6MFOZv3bCF2Grx/20fEMhIbGL/rmByUZ6K7nzXtnx8vOXnvrxVW4y7XjGmM9Dt2XMCDb9Ff2w&#10;/yf6+U8vvujYy17WLOUqZXIpvfnSgoXLVrx+4OCh6YnIQN2jNCM+Ki2PKwvTxbmpkdpbtydr1+Ys&#10;4K2K0a4ES1FaLhEljXdhy1szVsYKRYQd8nl7yep3168mLVNm7CSa27ikp1Jmjlu0/F3V7tPnLb50&#10;Kk99X62apas37/smi97U2lHz1DdO5l/MyTvz7eYVGzZ/3T0XDmbEvWm2Qi6/cf3KjasVdTV3Gu7d&#10;o/VOzs7unnzfgCBfv0CenZ3lvL0RWIiuzIVV5h/kPfJ6gExORk7grTlSOe1xZjrMzo4UZ3z+yM6j&#10;uWHlO56ftW77yPWzgvRWckcJenLutFEHjy8dOYLeOJqX/djcnwSkSW76K7p46RL9/OADQ+UKjbOt&#10;fmd99t69tFDw28kxEyYnTJr02v+9ct/d6SbWmYGUEUeRy6aZnAULxIRoBJvI1FyF9qucgYVhcgxX&#10;4jLK75PGZ7MFNpHE5e+MYme73O5cyD2Zf4zmkmWpCTQDlecf050Lo1snRfRatPmYqoYGoJSJAxI3&#10;v6+qWbd8HqEfbK566pkU9d1/nxTHHZAeZ8+2TLuQsSa/erAAXP65frWi9Eyhs4ubf5AgckAsTT90&#10;U8O9u9W3b1VevkA3RccM7evP/BWOGNQzTBAxYxX7c/Z083kr8g/xxr8WKCdy4jtqPG/WjvzH00aw&#10;W2KXvpHkJ6mr95k2d0b6was057RVScmbh8c/tuTno2kjRpH83EtpTw9v6s73KZFKm+nfCOo1f166&#10;+Ky45MLFS7Qc3i+M3uy+3tw3a8xApRlz0gZnK1TDOaLMTLP2B7pGYz0QzT1O5AY3fhMpcJs+85Xy&#10;cjG7VULzCq0UCQemEJc75aV6lwFFCQQvf3MoLDyTW1tNj1Z8alfi5ovqbdgU9RwtaL0CGnvq1kDG&#10;jBI9sUAkxCBQD0fTj0wmO3+u6Oa1K4MfGMn36au+1dXNg34Eh4ZX3bpx+rdfau5UhUfH2NvbIwYZ&#10;JGcBL4FkKzJFrTeZIdjWIXvdGqvT6WGg/G0fnT5Jno5PV9WEHk2lOYY5lqyxiXm3Ltmli6WEN4o7&#10;uN5K9rP0wScX//tvO68Ek20Xxr8WICX3PwhkyBVFhIefLi7Ozy8Y//tx6vV2dnZv//3NOS8wv3tp&#10;gd60otdbtMIMVLpne17KCpHuBmaqi6SQrCwakGbsUk17tcyaCdPTB7ccQjWRltL6YwpWjMYmcf6x&#10;Ddv2DR0RtzVjpbPgYa0GNOi8nJogzmdS0fR5L+gcgJkC65aegkVgp7/kNADVVFfFjZ3Qq1ebL23i&#10;3cd31NgJJ47/70JJcUT/QXbsvFh3dtXasL9dB6ektNbkLGDykELE/Iqek5FIfy3r1pivv13V6bmw&#10;/CO7Y9N2Zc0KUd6u/CIl+XD+H+NG0OMUHTh2ZeaMAFKZ/1PRtOfjFAppW5XMeRWk2f+hR+xWf7WN&#10;8CYu7yszWgTq4IpEkybQDPSPf/7rgWFD+XxPtT0VgQF+3PAPLXDvRW8trDADUcKYKPb/1nij/Fsi&#10;ryhGrFDQUs4uZdOcBVHMoFGuiG1MCBPBc9Yqq8Bi0BDTQHwL83K4ubDd36xat7zToeTFJybSz2Vl&#10;FxKFbjFDZuzZlql6yr24vHzCkOFEOUSUp3tq9cZYD9SzcVNgN65V3rx2pf0AxOnl6PjAyIeP/rzP&#10;k+/d1w+TYu3jFiLkLMhS/Q7elZUygx2rF72avmrOntLUaJ0aawxBnXQ0L3voI0/2kdRKlBWeIx+J&#10;XZeXv2SEPSGxkWXrxk4sprVJ7x0cKW1gp7b0VirJ/afPjRifSt494i9v7q7IMTVB9O332SWlpS+l&#10;vTL/+WcfHDZUoeD9cqKg+MzZl19aOGn8I7SNtLm5m3pjJNaZgfKKuQVA7E8bO/yjJExO1PxZKi0p&#10;EqZvYdNOZOqKlDS2ZVSMMCshHqujLczBnQfYhckrCZHk79zXTss/zHxFa020ap5LNaKze/P7zOrp&#10;9Z8Sdr2RSCjauDlk6Ig44ZDI4UOEek+9nG1MDxv+u+eNfXFgQZhZMKm09EzhoGEjHBx6KQwYt3fo&#10;1WvQsJFFvx3n+/g6ODggAxmO+R0c8ypXjowenLdLXEq0a7TWc1qHTk73xP9f7u/ldfda1y7LAmd+&#10;VGDXKGk4To8V+uSGguXMw3HzvZpG5hlXCn2VI5YdGSOvr2dCj6yxWUEeGzusWSbttiui3/QZ69em&#10;LnmVxqC/vfW2+qbI8H6Jj042Wk+6kRVmIPpDQ7aXlBJRl39q2OhUmhHP4+VhLsxcyvNPa9Vw81nt&#10;NFOVVaubVUTCgSI9+2rU7FZbH611QN1TYz1QT6UcBLp+xdnFje/dx/BHMr5PHxcX11vXr/gFCizn&#10;Xa9tELeiuX1a65317qJVaeol0rKGmnuaNfKm+pYxIaJorpfUae+iUyltrGtJPJW7t1xM++tiKTFe&#10;BDKEm4vTP/+xcfd3e3L27i09f8GOxwsP7yeaPDlh8kQrffMQK8xA7PBpVNSCaEPSC/NXRsLanNRM&#10;Zi5sVRY3F8ZtSc0Vk/g59xWmAMD60ATDRpngzi3pUCj8AoJvXr/qG2CEl2IBa2fEB3yF2uf2K1lX&#10;v0qb92HxoFe2ZfhJjfCUeK0zdtBGoZA3N82YljgraYadvT3dRy6XNUubm5uarDIBWWcGYsdxoheo&#10;/g4Tposz24wxoszsFF4CL4tdE51CtjN1LU9JYJdEIwABaHjn67Mf/1DWbG3z+oZS0OQje2dy08zo&#10;QZ198oqXT59zp08WHP2fHcs0/TMz+sAWHBrex9ffWAdUn+3i5sV0azp1wC4M2OgdFrrfgR+jPfVp&#10;xLIjD8slEs1lPXorOYFPZh1+zl7WqH/rfTD4ipobG+mHUc9tNlaZgRiiTIUiU6dKpKes3jKVfdGg&#10;SN19AUCJBiC+f1hvJ1dzd8Q0FHKFXO7lkt/bsXdnH8Z6OzrRP4P7+AX04AxE/6KvvHTBiBmIXX+5&#10;KydTJGKejUKSxTT66NbYMmmjap10B5UceXN9TQ/9A8UMrDYDAYDJ8Kzn5T06R9E6w8AtDOrU3uzL&#10;4/JUb6yBJUEGiUzNzVYO26coX9dNt8b69LyfkJ53RYZABgIADX8UhX6Uc7mHzoUp2NdXkd2JUDQ0&#10;3nNxcOvUzo0N9+gD963rV7kXS+yRGcjezj4otN99H0Z9VF7fsL2egXxr0/P+Tuh5V2QAZCAA0PB/&#10;Sf3ph7l7YSpyuVwmkxWdOF59+5azS+fm+6pu3+rjFzho2AiagXrqXBi0rycFXzO+JbDlfBmRgQDA&#10;5nj59L1xtSIwOKTjpmroLn6BAhN1CbrN/T8N3s7eXiaXW2kOpn8F0BCvVdk9V6T31OaFDAQANoSb&#10;w+J79y2/IK6+fcPLu2/H+7DuVN1qarhH2/fUWTAwnIuLW0O9xMXN3dwd6YqG+npnF+1Z4O65Ir2n&#10;Ni9kIACwLTTBuLi6BodFnjtdODxujEOvXh3uIm1uPnf6t+CwKLqjlf71D/ePfudwa+F9fP0ryy46&#10;uVjfN4NcLq+6fSsotB+X42n/aU33XJHWqS3kDwlkIACwIdwoDv1FT3/p362vK/rt+OBhI9uPQTQA&#10;FZ443qdvgI9vAPcIYSG/vqH7cd88bh6eHl588ZlC/0ABLVva/I5eMplMUltztbIsQBDq5u6pevff&#10;briitk5tCZCBAMC2cL/0XVxcfAOZ9UAFx36OihnqxffR27i66lZp8SmafvoEhtBdLOrXN5gF9/3j&#10;HxTi5OxyreJyxeULMiO+aZfJ2Ns7uHt4hkfHeHn30fo2NvUVtXNqs0MGAgDbopoF4PP5tOzk4lpy&#10;+pSzs3NfvwAPvk/v3s50a0Pjvdrq2zevXWloaAgKi/Tk9/Hy8uJ+fVvUb3DoZty9zw2T8H36evJ9&#10;VK8XZeaetUt9yIdSf3EHU19RO6e2BMhAAGBzuN/ItECTjaOjY28n17uSmqqq2xVllxobmbe27O3k&#10;7Orq7tXHz8XN08PTkxsBsrQ/Yc2LeSaRzOKe5nM/ZDKpIZejCg3cYhoLTz/quG97Xgv1emLiK2rr&#10;1GaHDAQAtkj1S9nV1dXZ2fnePc973n2bmpro4zphHw9oNnJmqdKPRf3uNjuaEetqqr28+5i7I0ZT&#10;V3PHxdWgJ0apxjZU3xIWnoRU/WxrPbLprqjDU5vZ3XqJ+ofCML8e+dnAltBj4E6Hnod7yUSqmXnr&#10;a0YjiyvTSm4r98cxqLtTdbvoRD79EnXb6Uy6C70Qejn/397dgDVxJfrjPwFFXiJvvitRiolaFGy9&#10;S7HBaltru4G1Aruybl+WVrrR/r3b0Fp/2+Wy+/jcH392W3Ul/91bhad0663XurhV3F5Je922q1ui&#10;lrt2FcTWpGgBW0tVFIKikMz/zEwyDHkjICEJ+X4eSidnzpw5E4L5cs5Jcq190GexBA4fXtFg79UR&#10;g3EgAAhe/B++9J/C0NBQxuEPXz/9y9U/xMTFd5k6zp4+mTArKTo2LnAnxWjG7bzefrH5ArsaJjZ+&#10;sIePvofH6LsiNwI3Axm1GYpCPbepLDPU+sPn7unWSUqS+3WFlmRWWLdd9dLxKAAYUULWEcegoHom&#10;GJrpssQoaXTbNxe/ajpn4eYQA1FIaGhU1PiExKQhBCAIdIGZgbj8s6CGsX4qn1Gr1RGNaoCDfMQa&#10;fdgu52uzBhd1xPEIUQnA65B7BismLp5++boXAEMUiBnIqM1nA1C5EHrkGv9PBnJNsbqw5JAxALoK&#10;AAAQDAIwAxkPVenVxY6jPqLJMbU1IXFjJzV5VZlsOS3cdM5ahRucMbjdK++bx7I2x7VWtqCwsIKI&#10;Z7Zs51WWlS3woPsOzTq9BLovu5qvqJAUqn+urvi9bZs7ql/Ncj8dAgMAAPBjAZiBKGWywr5It46b&#10;HatV8UkiQ2uNKPrCkjwDw3CJRtJQxm5yMWSLTpPtdm+5qpxhygkffbSbVNbWGovZUqGO6LzsaQkp&#10;c9Flo7akQplnkBO5k2aFS6iivamVs5sZWkUtU0OE+S96KvG8WL+aRhUGlwAAAAYpMDOQvtFASL+n&#10;feO5BmIbHOKmnaqtNZRlu7iAoMpWk4bkLO4gdrvknDHb7V6iMggjNkpbslGWbVL1q0PONdA2VMJp&#10;Sxz7WqiQFLIb6hrGtrDHvlnhEvQV1sq0erbLy3dSExkIAABgcAIwA8mz8pSF1bpylVdngIzajEzC&#10;rbqmW/l30FD/l4MN0KzdxJbOdbOYAgMAALgjAZiBuAEXSaaECCnAqNUa5iwgtmDETjupi8vv7CSG&#10;Rj0/48YuPyJ5LvsyZ4HeOivGntb1XNjAzcrZS7CbHnN5Ug9rAgAAgAuBmIEIUZUzhuQMhe1lrOxQ&#10;i0pjKLOVcLfv9BSbyvYq2OkmpVqtdNuVGjaQVXBrotWkauBmS1w1qypnL8E2xcUN9GSrMzNt66DF&#10;2441h3yhAAAAQQqflQEewg8dAABGk8AcBwIAAAC4M8hAAAAwcj6/8O2h6jc2Fv6b6OZeuqFadl/y&#10;vfc71HS+C2BYIAMBAMAI+WPVwTkTpDdEJfuq3/gVl4f+b9lrd92liIid6MkugGGBDAQAACPk2bxV&#10;9PtH9cf5m59f+PbhlIX89iPLVp0/b0i+d+KAuwCGCzIQAAD4Rnv7tbj4Cfx2XFzslS8NnuwCGC7I&#10;QAAAABCMkIEAAAAgGCEDAQCAb4gnucSTX+53AQwXZCAAAPCNibGxB+pPZSz/Ad3+65GDLz+zlnCv&#10;AqMbTncJrrdfbfumtctksljMPun5nQsJCY2Sjp88bUZMXLyv+xK8kIEAAMA3JsaOy8l+bluZlm4/&#10;l/24+NXvbnZ93XLhyndtssSkpJi40NBQr/aQhq3BZhQPDzGbzZ3Xr7V+1dRl6pguSxxi/+AO4bMy&#10;wEP4oQOAz127euX0P0709PSM2Om8egi9EHo5QzgLDAuMAwEAQMBo+6ZVlpg0ZswoefKiF5IwK6nt&#10;m4uYEfOJUfIwAgCAYNDVZUqKifN1L4ZTdGxcc9M5X/ciSAViBtKtk5QkG2o1crpt1GYoChfUMOWq&#10;QR7ojc4AAIB3Wcxmb68BGmH0cszmQF3ZHegCMQP10a1TVOUZGAQQAAAAGKQAzkBGbUYmqUEACmir&#10;Cl68cFpPN5SpCTsq3/V1dwAAIIgEbAY6xA0B1YqmwLhpMfbplKhrmE3nMhSNxbYpMuuE1Rx222Ct&#10;piyzzWD1HcgeyR9Cj8isEBexTRA1qajgJt6MQiNlC0bskkcXY4tJlbt8v3ZzinI7f7NOr0tTejKn&#10;yZKlza/ffzBWNugEPOQDAcBLGIYRtiUSiQ97AsEmQDOQvrBQT8OJ6HnMOi1WK2c3M7SktlgtqdaV&#10;q9jnVF11hbqYVtaxB5bQWoycDTH52iyaguiB7IIiNk2xhRlaLhqpyhmmnPDRR7tJxYUlfUMyeyh3&#10;Lush7BGElPnoXghoGzf/igtA1tAjl0mJzNMABACjAB99xAGIv8nHIIQhGAEBmoGUZTV5VZnWvMIy&#10;nmsg+gqFpJDfr84mmmx1Jh+CdNUNZZvKbQfu4o6Qa4rVhdXs+7DTA9XF/JOvUCgXDwQpbRFHmZcl&#10;t56LNqMSjigZmWseTYwtpsbT1fwIkF25Knd5JLe925aQZGnzf7ux9LVtpXS7dOParDXrZGnp8US6&#10;LPdJdc6yDUWv0QrqHPWfD5Sdqjv/cmnl4QPsD47fRUTTbbu12zM1LwoHJj347F8qizEBBzDyrO/N&#10;YrG0fft12zetndevdd+8ScvDIyLGx8RNnjZj8pTpkpAQCcfXnYXRLEAzECEKTW1No0Sxbk7fS8LU&#10;di8P21RWkq81KkhJQ94uh5kPNjSRbBeNW5caMdxAT/6w9x0IuwBokWPhQ7nLa7jow4Wh9Lr9Cm7S&#10;SnqtqfZU3Qmd/uwrmkyagVrqTvSf0pIuSgr/Vd15urW1qIDQLy45Pfm0+lhLz6Ozx26oPMG3Lz6Q&#10;tjZiFwsAAj7/fPtNq/FsfUSkdOoMmXxeCk0/dFf3zRvtVy5f/KqJ7pqTvHDS1OlkFA0IXbhwgX5P&#10;TEz0cT9AJGAzEKUqN5TZJq/kcxaQQmHWiifPyiP5W7YQIopA+qpDRg2tYzxUpeeHf9gDrZNmRm1J&#10;hbq4nBBdo16ZrKA72Wokz+689Fz6zC06TbmKOwJzYUOiP33SroTmnnDSxo/9yGXSVTkvtbQYuJRj&#10;ommGFqqUd6tJ5LUWo8NqHlNGxnJ+i8tJz9AN/u3GFDLZCweOJCaV0+RkdzramkqJQSCAEUXTj9ls&#10;/vKLhu8ufb3g3vviJkwS742SRtOvhFlJVy+3nfnn/16/djVpTnJoaKinMYgdvyd9fwzbhvP7Vn/2&#10;q+liFwSTQM5A7FQUNxiUQeijmAtEtskwfkhIrilewP1G9D3ClQsa8yUSPV+F+z3hkxT/G8b+OrCF&#10;qk1lJVxbSrVa6XhaVXmNWpIpqeDWRKtJlfcvdLShESc5Nbter0vxeBG0J2iKekGTaeAGhFYV/Iw/&#10;kaHuxI69hxempe8WLT8CgJHHTX9ZaAC63n41fekjY8eGuaoZP3Hy4qWPfPbp35vONc6eOz+Emxdz&#10;2zb/XnFqdV+Jbp11OJ/mHX71pye7ILgEYgZSlTMq8Q3rgjoaiBiNY211tkpUl90uL+9fw8mBjkX9&#10;TiosmWZpnJwUBrS+QP2U5pndWsLnEhpf2ltOd5PJfDCiNw8eKNladH5QbRpaWh7hpti49UZ6ofz5&#10;NSvo9+bmphRRotXpz2I9EMCI4afA2i5d/O7S1+4DEG9sWNi99z1w/OjhmLj4SVMGnBTj/9HWrauo&#10;thawr4XJ5v6ZZv+ozednAAbcBUEmEDOQx4zakoayXeUDV4SRp1Lerdj/IbcCejOxvT/Qx30lprr9&#10;h90c/uOcl4Q10eI2d1bOXJiWrkyVL0pl844wNUZI2ylufEg4MOnBZ712cQBgj50F6+01nq2ff0/a&#10;mDFj7V4O5tSYsWPn33Nfwz8/jZswecyYMYNaGMS+diV5E7/Nrl+wvtplgF0QbEZrBuLfwIed28JD&#10;22/xE1XuSwi7kPmM47aw9tmuwsHKfq81U8mIqn+D4gOxHghgZFgHgb79OiJSGhc/kXgQgHhxEyZG&#10;RkZd/vbrKdNlwsvmfeIRVdaAdf6qOyS+yS+CtmNXiCXSvjVaM5CLiTEAAPAFmmC4KJPAEE8DEH/Y&#10;lGkJ3337zeRpCV7rGgSv0ZqBAGCIXn338/94v7mnp8fXHYFRhKHJx/zqY7dz5sz3eAzIKnbCxK+a&#10;zvEjSZ6PA4knucSTX+53uWE3xuMJuzEevDbeDyEDAUA/NADFTU0cFx7l647AKMJYGIslNrJuXNg4&#10;zyfCeOPCwru7bw76jIpkZYX1bXK3FJI8g1z41CSNk10QpJCBAMCeZLB/qgO4YX04WT8Zw5PV0GI0&#10;PUnYh6STD9Zwh33rlHX8uJHa7sO13eyCIIMMBAD9/Ktq1h90X2EuDIYPuwSIYczXZjPdt25GjpEO&#10;6uBb3TfDxo3zrK7rNzGx22u/C4IUMhAA9PN/cufSL1/3AkYVi8ViNpsbPvu0/crliMjBTbNevXJ5&#10;fEwcPkgVvAEZCAAARkLshElt37ROT5g5qKPoIVOmy7zUpZGE1dB+CBkIAAC8i/8E+Lj4SS1NhvYr&#10;bbHxkwY+hnPt6uXb3TdpfXyGPHgDMhAAAHgdTTCRUVEJifIvztQvSl8yZuzYAQ/p7en54sw/ExIV&#10;9MCQkJAR6CQEG2QgAADwLn4Uh+aYCZOn3ujqbPjnpwvuuc99DKIBqP6zTydOmjZh8jQ+AGEcCIbd&#10;cGYghmH27t37k5/8ZBjbBACAUYDPQJGRkZOns+uBTp44qkheGBs3wWnl9quXjY2nafqZOH0mPcSD&#10;z40HGIphHgd655136HePY5BunSSzwnZDXcOUq1xV497YarDv4sB+aFhV3hAOBACAYcWHGJpm4uLY&#10;F3mFR0adO3M6IiJi0pRp0XETxo2LoHu7b93saL/y3aWvu7u7ZyTKY+ImxsbG8gEIGQi8YfjnwgYZ&#10;g9iPNWUzCptX1ulcpaChwYeGAQD4DX4oiG7QZBMWFjYuPOqG6frVq1damy/cusW+E/S48IioqPGx&#10;E6dESmOiY2L4ESC7QaCQ0FCz2RwaGuqzyxhuZnPvaLqcwOKV9UA0Bt2+fTs/P38Qx8jnLCBV54xE&#10;hTEbAIBRio9B9HtUVFRERMTNmzE34yfR5wsaa+heGgVoNorgCOnHbgSIhqTO6+2x8RN9dAXDr/P6&#10;tcio8b7uRZDy1prod999l34fRAzSVVeoixk+ALFjQoV6dks0P2awFtoGjkQTaWwtBd3dWGyrbZ09&#10;m7NFmETra1NolK1E1KSiYoHLWTgAABhWwqQYRZNQZGQksX0IhvBGiMIiaMcpsMnTZrR+1SSNjh0z&#10;ZjS8pqe3t/di84WExCRfdyRIefEx5FkM0hcqJIXsBk0mtvzCLuJharlPuMvQGlUarloJLWPkbPDZ&#10;otOwkcX2XudslNFuqtUUqyX8p+D1BSqd7Sy0zUKadGpVfBjK0FpzlL4hmW3VS/cAAAA44sMNzT2h&#10;oaGOHwHm/i2hY+Liu0wdZ0+fTJiVFB0bF7izSGazufN6Ow1AcRMmxcTG+7o7Qcq7OTosLGygKqL1&#10;QJKMc3SbnGsg+gprMKLRKNtabRcXWlTZalJinTLrGwhSlvG7Mq0fBVzdULZJ/FEwRtqmupiPWHIa&#10;lgqrDXSDPTAvCwEIAMAHhKwjjkGerH2eLkuMkka3fXPxq6ZzFm4SLRCFhIZGRY1PSExCAPIhL2ag&#10;n3A8rS3PylMWNtJooiAOLxHTOalPM1MmqWEYFbvFDzWpNpWV5GuNClLSkLcL0QYAICAM4TVfMXHx&#10;9MsbnYGg4q0MNLgARBkPVemVeQp+cXRhiXaTyv0r2g2NemWywnogyePKaI4i+Vu2kAXFtf2P5dq0&#10;TpQZtSUV6mJ8YDAAAEBw80oGGkwAEtYDCWudVeWGsgyFbTKMHRJydhw76MNVUqrVSlshG4IKCxfU&#10;OBzBt8n/rcGeCCugAQAAgt2NLpP4i/HMP44ddSy0WCwrV67cs2ePh41AYHH6QwcAAAhQwzwONOgp&#10;MAAAAABfGM4MJJFIEIAAAAAgIIyG95gCAAAAGCxkIAAAAAhGyEAAAAAQjJCBAAAAIBghA4FvrCp4&#10;8cLp6lN1533dEQAACFLIQAAAABCMkIEAAAAgGCEDge8ZW0yq3OWR3HbpxrVZa9bp9Gdf0TxDHEqU&#10;qal/PX2a1lSmJuyofJfulaWl8x+cqM5ZtqHoNd9cAAAABCBkIPAxPgA9Yss0FB93+EyzY+/hom3F&#10;M2fOJCSR23nVUHeCFu7cVlyv1+3629fxxHRk/8FYmdtP2AUAAHCADAQ+drj2WCQhP1jxqFDy4d/0&#10;9PvSBx+i31dk3P+7beTo3z5OevBZenPB7NlCtebm5tlJSYeJdFnuk/xY0Yj3HQAAAthwZiCGYfbu&#10;3YuPy4Ah4EZ6Bu35NSsSZya8onmmaNub/334f4SRJAAAgAEN8zjQO++8Q7hPTvWsum6dpDqbKVcN&#10;bycc26bbmRV8sbLMUKvBvIkf4Ud6Xq98Y4fS+kBY/qDy8IGK5ubmFKV1lGjpgw+1ujhcpbxbVXdC&#10;lpY+Yh0GAIDRYfjnwgYZg4YFzTglyf2yjVFb0lC2q9y6M7OhzMBwe43aDEUGcRODHJsaWgfAU3KZ&#10;VLf/Q1Xu8oVcjrHOamnf4kd3+JIUpapVf9bx2JdLK2laohvxxPSbza+OcM8BACCgeWU9EI1Bt2/f&#10;zs/P90bjHjEeqlpQXMuHnpIKdQ1jSydyza6yKsUWncY7g0/gsYOV2wnZzm/TGGSoOyHey4/uuCp5&#10;fs0K+kU3suh/RQUj0V0AABh1vLUm+t132ZUZHscgbhylbEFhIfs3vW26iiusyavKLNTbFVpHXPjt&#10;4kYFN9GlkBTSsMNlGzYCZdcSfkuvLhbnHXlWnrLqnJGo5AM2RYbcAQAAAPBzXnxd2CBjkL6wsZih&#10;uYOduhLGafSFJXkGhpGzU1j52iynk02qcqaG9JuK0m0pXJDN2PYrkxUO52o00DA0YFO6oXYAAAAA&#10;/J13XxsfFhbmcV1l2SYu9qiy1aSEG6fhCndxuUKuKVYXVjsPLg501Q1lm8qFm04Cj5NY5LJXQ+gA&#10;AAAA+D0vZqCfcIapMeO5BkKyPaqpLWnI22WLKuzMV2G1rlwlzFCxs2MLigcdZTzvAAAAAAQAb2Wg&#10;YQpA+qpDRo1GLlrWo0hW2gZ2dNUVhJTZHdG3GprHDuBIMtf1vUpeUUjKDNz2QE0NrQMAAAAQCLyS&#10;gYZvBEi5oDFfImHfNVhdw3DBhc80EnYNslqttlZTZaszM7klyYZk22poAbtcZ51EIuFv0XZqrWNC&#10;AzTFlA+lA1gTDQAAEBhudJnEX4xn/nHsqGOhxWJZuXLlnj17PGxkIDVq9sVYgzxksEcMcwdGM6c/&#10;dAAAgAA1zONAw7oGaAhU5bUYhgHwCP3993UXwF8II+UAQWU4MxD9LcKHhQH4OT76CAEISSjI8emH&#10;Pgz4DYQhCCr+/LnxqnLGt4M6Pu8AwDDjh387rl397tLXXSaTxWL2dY/A90JCQqOk4ydNnR4dG0cQ&#10;gyCY+HMGAoDhxAegi83nO65dmZaQmDQnPnQM/gUAYu7tvX6tvfWrppiOuBkzkwhiEAQN/AsIEBT4&#10;AHS9/QoNQHOS72EYy+2eW+R2t6/7BX5AIpGOHz93fuoXZ05Jx8fGxMUTxCAIDshAAMGCZqDL334z&#10;dUZib28PlgFBH4bptfTS0DMtYdZ3l76Ojo1DAIIggQwEEBQY7t0rurpMM2ZFIgCBI/qoiIiMunnD&#10;RB8nEo6vewTgdchAAKOf8Fowi9lMn9qQgcApmnvMZrPwaEEMglEPGQgguFgsCEDgHMIxBBtkIAAA&#10;AAhGyEAAQUH0Jz7+1ocBYCIMggQyEEBwwXQHAAAPGQgAAACCka8zkG6dJLOC21LXMOX4ZAoA78NA&#10;EAAAy6cZyKjNyCQ1DPehXEatVkdUA4cgGppKkg21Grn3uwfet6rgxQun9XRDmZqwo/JdWdr8+v0H&#10;Y2Ve/+kaW0yq3PQ675xrxK5iiLwSgT59bfk7if+5PW+GqOxi9fqfHnnYrnCwjQAAeI1PM5ChUa9M&#10;VvDbcg1iTVDhUsjy/drNKcrt/M06vX7Ezi6XSQ11Z4axQX/PPSKMV0JQSAiRhIQwDKnbsnwPzTGr&#10;aY6R/eiPx9f03rzZaxlsIwAAI8GnGUiVrc7MzNdm2UZ1jNoMRWOxbUrMOuKTdShDUcg9Oaprakgm&#10;N3OmkBTyU2fsEbad7G3umJq8qky2kBZtOmfdryzD2JF/2bj5V1wAsg790VBCZErfdgmGA80xIfQ/&#10;lqWnu6vHx90JJm/uevvN/9ztpsLa/KfX/vSpEesPgP/z7XogVTljoClGUshHGLmmWC2p1pVzU2K6&#10;6gp1MSPXrStcUMPU2ibJmBrSNxemW6eoyjMwtXJ2M0NrVGloob6whJaxB0oyJQ1l7Ca36miLToP1&#10;Rv7C2GJqPF3NjwDZMbR0PpGbHklI6ca1WWvW0ZKXSysPH2Cjrzpn2Yai1wg36PLbjaWvbSslomr8&#10;wBJ34Evrt/07PyojFBLSdqruvPhE4pEbYUpuNxfLREdZS1yd1NZUejyRLst9Uuih41U49oQ2uF+7&#10;+wnN+kjuLJ80j9m5rVho3K6+Tn/2L5XFOyrfHYZ7f+Bhlrotj+xJLF32UdGOenrnlH7wk4svrvmP&#10;RrojZcMfd+RcZPfu4kZ6+JrWbdpy3ZblxQfpxlOPbc8q+eRFItr79T7Ns1pu6I02uOk+dqbs+Xy2&#10;/b4SoXuM073suUgWOXgocetfNYuH4Y4YbdY9VzA2LKz8jTdd7aUBqOf27RHuFYA/8/WaaCLX1DIa&#10;djhHso6NQdnqTD4E6aobyjaV06eOZGVFZobTFUDGcw1EX8EmKI46m/ufsmwXV5U2RRqSs7ij2O2S&#10;c0aiwkiQ31CmLnJWLH2zssRQd4I+5b+iyeTTw9aiAkK/uNDw5NNqLrVIrzXVnupf7aHc5TVcXtmx&#10;93C8rbmHctP5oENrHtpbLg4uAhqA1CvmZVX2BTKhKduyIYWrk/Ja6k70nwtzchXOetJX7SnNMzT6&#10;iBu3qx8yc+mw3O3Eo7mwkBDSqP2vh/cfr0089uqiFx9r+vk7J4/PJOz2vmM5S7iRHn7GKkS0TS0u&#10;Or51zOJdd+3b+cTUm123PrXtpQFo7d9WVJ2sZNNQz83O2+a6Lfk7FNtrd91P7759z6x+sWrX76xB&#10;inATak72sr36cjbtybRuU7d5uO6OUeT27VvP/vRpuuEYg2gAevanT9EKvugXgP/yeQbiyDW7yqoU&#10;XPjZVFaSrzUqSElD3i456ctIEone2SvH7Mp0I9lruBP60yedFZt+s/lV+j+V8m41ibzWYuRDwCua&#10;Z2hhvKgaDUPiapfJ1IdTE/gBm+fXrCjdxlaiCSacG57hj1HnLHM8Hz8ilVV5XlwSTtr4puQy6aqc&#10;l1paDFy4sT+p69U/9ldBu+esJ+JqpoyM5cIh/3vsn3b1N6xZp1IOxyCQp1Je/nXuFFNn1z0ZPyTn&#10;ExdP6DJ1Enb77YsX3RzVe9t020IYc3dnl/jZ9uL//u3M4wWvx7KNWEsuXSCPP3tPZ5eJkAmPF2SX&#10;ffwNIcJSaJd7U1ak0550e+OCR4ceLgaFhY37/es7hEI+APUgAAE48GkG0mm1Cn4ptPFQlV6Zxy6P&#10;lmflkfwtWwjhIxCPBiEDychnR3JEh8vnLCCFJdpNKiz0CTQ0WySnZtfrdcJ6IFdoInlBk2ngJo9W&#10;Ffxs8KeynwLzncH2xGs992jJMWO+dZv9YLFeM800FvYbv02s7x7MiNoRth03+G1JiIRYem+Llkaz&#10;b0JssfRy2+bbvWYiIaJjXe619QRc67l168kfr6YbfAxiA9DTT9FCX/cLwB/5dk30nEbh/djVNQwf&#10;ZeSa4gUS9iXzfLDp9wZCtEjOrqO2rYkuN5RlKGyTYWyJDy4ChmZ9gfopzTO7tYSPQTTrtLecdqxm&#10;aGl5hJs14wZsXL5wjIaqj0638qFKmAujhd1ksqspMOFAmsbEdfij+KboSQ8eKNladKdZxJOe9Kuf&#10;MMOu/jCuB/JgLozhqzHOt2ckpjScv8gw0wip++QAIYXsXqGas2NnpD+S8oe3DuSm5UyznmHG9Nnk&#10;D0frNqSlEXLx4FvvPb72JYbpFeq73Xvnd8Fod/v2rSd+/KPbXO559uknb9/GyBmAcz5fE+08t6iz&#10;Va6q9CvgZsrEe8sZlaii023wCyrl3Yr9H3LLfjcT2/sDOa22s3LmwrR0Zap8Uaq7F45VaN96ip0y&#10;21y68aWrtsKPuVMUbWOXRwgLlu0crNzOLmrm6vAroD/u65ipbv9hTy7nxzkviddEO/KkJyLX7eon&#10;PfisJ90YEVPz8h+//2VVNd38wQ9+aL/3vqWr/u3Fn6rKsv79aGGotcwy+Uc7tp5fsnbp6+ytx0t1&#10;L6el/WJf4c9Wq7hVTvM37vvDfb2iJT4Wt3vBAz23bz/LvQQMa4AA3JDcYKfc+0RERnly2Mnjf1+0&#10;+AGv9Miozcgnu/BCdv/jxR/6sOIWMqcY/GUKzC8wDGOxWMxmc8PJE7PnJg9Ufcy48eMsXV09Fhfb&#10;IRHSiDC2Ys/tnrEh3N6+aqHhMRFj6S523U7/Y6PGcq333Lx+q5eQkLCIqAguJfXecjyX+73gNV9+&#10;0bhgUXpoaGhISAg+NhVGPb/KQPy7/eCtfPxUoGSgl0sru76sGZ6XkY8Wg8xAELyQgSCo+Mfrwqwc&#10;ZrYAPCa8x48/rYP2R1hPAwDA86sMBDB0ByudvOMiOIFVxQAAHGQgAAAACEbIQADBBaNAAAA8ZCCA&#10;IIO5MAAADjIQQFDAa3zAc3i0QJBABgIIIiGhoWaLJSQkxNcdAX9ksZhDQ0MHrgcwWiADAQSRyEhp&#10;d5cpUjre1x0Bf9Td1RURKfV1LwBGDjIQwOgnkUgYhqHfJ0yeerH5fHhkFIaCwI7FYrl65fKMWXfx&#10;E2GYDoNggAwEEBToUxrNPdLomOjYOMPZ+qnTZXQbEx9Amc1mU8f1by42T5PNko6PwTtEQ/BABgII&#10;FnwMmjpjZnhE5KXWr1q/ajKbe33dKfC90NAx46NjkuYkx8ZPRACCoOLbDKRbJ6nOZsp9/ZHutBsl&#10;yf0+pMxPOgYwbPgnNn7gJ27CpJi4CQz3InkGL5UPbsLMVwiHPkIkHF/3C2AkjOJxIMdkAxDUhBhE&#10;n+osFgvSDwj4DCSx8XV3AEbIKM5AAGBP+KNfeJ5DEgpywiMBS6EhGN3oMom/GM/849hRD2u6VaMm&#10;6hrrhrKspkzJdYkWGaybtNRgt5cr4QiViLUVvqZaTYtlMtJ/X19lW12D0GCZWtTqYDrG7rZr1Xmz&#10;9md37E0AGKYfOvgLC4CNrx+MAL7hP+NA+sKSPBoY5Lp1kkxJA5sd5Ox0VuYWnSa7b69Rm6HI12bV&#10;amg9ReGCGqZWRQhbmKG1TnvpG5K5Y/vNhdHKVfT4Wq44Q2tUaQzC4ezRhJQNpWPlqnKGKSf8ubSb&#10;VOJeiZp1OPucLbauA/gM/uIHCERMAI7d+u2/Nv6TgZRlu7i4ospWk4bkLG4VD7tdcs6Y3bdXrilW&#10;F1Yb6Na5BqIu5lOEUMjWUOZlOawAMtLK+gqFpJC/qc5mS2iTKuHokiF1jKgMNAxVWKvxJ3Js1vHs&#10;WcnKiswMLFYCAADPMP1fxBAoSYhPPwz3/mTE/8KQ/2QgD7GBgmQP4UB1jfh1XsZzw9EXbUYmqWEY&#10;btAnfxBnJ6paRkOPkUj0djsARkD7lcvfXbrYZTIxjMXXfQEAK4kkJEo6fsq0GTHxE+x28RM3Hdeu&#10;fnfpa/qba7GYfdLDoQkJCaXXNWnq9OjYOOJnMShQMpC+6pBRo5ET46EqPT/8M2cBKazWlau4ubCS&#10;CnVxueuj5WxlfrKqr0TPz2ZxR7ubC3PN0KhXJivoBtsrkueqWcez813Q1BpIRj47moTRIBg5rV81&#10;Xb383QzZzJlJCrxHIoD/MJvNXZ0dLV81dXZeT5iVJJTzAehi8/mOa1emJSQmzYkPHRMoz90sc2/v&#10;9Wvt9F+emI64GTPZ6/KfGBQo96NyQWO+RKIn3IgKN26iKjeUZSj4O1JZZnBcXKPKVmdmKiSF3EgL&#10;V9k2HcWX1KglmZIK6+LlqqF0SrWpbC/XKL8Om++Vk2Ydzp5dbZtBozcQgGDktF+5TAOQ4u4FYwLq&#10;31CAYED/JomOjYuUjjecbRg/PoYfDeID0PX2KzQAzUm+h2Est3tukdvdvu7sYEgk0vHj585P/eLM&#10;Ken42Ji4eOI3MUhyo8skvh0RGeXJYSeP/33R4ge80yVHgflOP+yi6MbiUTTTNbI/dPCKc2dOTZg0&#10;OTo23tcdAQCXrrdfpX+rzJmfSrgMZLFYmr44Ez9pamRUVKAsA3JEQw/NG1favp09b77/vB05/hb0&#10;Ft2WQr2yTOHrbgCI3bjRNXN8jK97AQDuSKNjLjaf57f5DNTVZZoxKzJwAxDhLiQiMurmDRO9HP95&#10;K05koOHFDv4U6vltdQ0TYENXMOpZzGasAQLwc/SX1GxmVz0LrwWjv7k0MwR0BiLcUBC9LuGi/CEG&#10;BUQGUpUzgTKhJNfUMhpfdwIAAEYZiyWwAxDxy9fzB0QGAgAAABhmyEAAAAB+SjR24neDKEPmJxNh&#10;BBkIAADA//nfPNJogAwEAAAQwFb+MO9qe7twMy4u9r/f3efD/gQQZCAAAAD/53IgSByAqGvXro+m&#10;iTOvQgYC/yVLm1+//2CsTO705qAYW0yq3PS6oR4eTDrq39tX+y23OWXxEyvnR7NbrUffuJD43JKZ&#10;fdVoyWdxeStTop3eHALHUzjpT0bc8S/jVmfPt52m9ZOdFxLXL0kgHWeqq45fIuJu0wY/aJz3GLvX&#10;vs+uO08bfP8LrnBu5nOJF5x3iTR/UllDxC0P6jI/aLTdmHq/6FoG14jjj6Ov2eTvFywdQtecYu/Y&#10;ptmD+Mk69G2AFu78keOljvmfQaWaQVX+tCzjlzX8ZsqGt3bmTh/MwYENGQiCglwmNdSd8XUv/B6X&#10;JOK/X7A+wXqzvpWksNsJifM+uNC6ZOZwPbM64ewUTvqzmOhPN8/nn8k66j9rz1i2xPZkVpDNPZk1&#10;f/LJNUK4zclT2z842upxIKDtvE8ynyuYaT2Xi6vuOHOyfW4y+ay+I2FIT5+TM6zPu/RZed/OdldZ&#10;yk04cNoxW7NsjPvEaXQbiuj52c/NH8wBDn0bdAte4rcd8xTjca5hGCZj+aOO5RMnxlf/6R370k+1&#10;S37Z/PK+2idk9MbF/3oubz35446giUHIQADA66g/wgaOpaInCeEJeGbq4pOnW0mCF0OQwymc9SeZ&#10;xFytPHkmdSY70HO6Nu7e9dEd9e+x1fq6umSJ0Obsexd/+dmZjgTPBls62i9NiYsVzkWPiXZy1R0t&#10;TSRp2T3kyEctHSlDGcURJCzNW3y16kLzkoTB5hV3P46ERJrPrndYY+DIG4GHytD4bcdGzOXLVy0W&#10;S0hIiKjs6327a364/eiPJppudNGbcat/VfjXH+87nqtZ7KtejixkIAg8qwpevHCafTfu3drNKUoV&#10;N8+1PJLd03aqjn2DeVnafHWO+s8HyvibPPFUmusWrCV8/d9uLH1tWyndLt24NmvNOrsDW0niXyqL&#10;d1S+O7JX7zUdLV9+O3eR3RNE6yc7P4tjp5aiZbPbj3gw8tE3dWWdkembpZqbyQ5OsMMbZB5p/Dwu&#10;87nU6/0q9z+F0/7wz2RHWjrmy7767Ivke9lBIKfVrKLnL4qr/OiMzKMpJ5oe3v+gX2UnV93xVROZ&#10;vSw6miQRthvCXOFncd9P+vJ99kptM1xOC+26J5s95Tg/OMHOr33OFbLzd8Q6t1VVWctN5/Xfm+Cs&#10;YzatFxqnJD1hvQ/7pgiFCTL7pvr3k1a75/p7e461EWufO/pNIN4fV3vsCyK+HNsppt6/OP5YE1fT&#10;rm+tA7RAhGr83GW0/UPI4UHl/hIc+2Z97LnsmJNTOLvrnPbf4UDvGWgY6OTx2gHbuGEy9WvnYt3H&#10;Zx5fe8/NXjN/29I76XuPpPy1tZWQGXVbHtmTWLrso6Id9ewc2R935HCDQxern89nSwjJ3PpXGpW4&#10;ahsStf/Bzqb1VQsQyEAQYHT6s4/OHruh8oRQ8lBuOh9u6K5De8u5sCJdlBT+K1EAEqM5Rr1iXlbl&#10;dlELy2v6wlB63X4FF5Wk15pqT9WdoM2+osmkzdqdulV/1qtX6gPCKIgT0Sn3xlUPOPLBjs08tn6l&#10;aAmOMEvV+kn1mY6Z7ORD29W41eufi2YDVr/KDqdw2h8u1vzzDLlKFj/MPlf1Ves4wz95C5NNrJlL&#10;HrvwxpF6mSfLPhKWPreaPqXtPCY8nzl0iSYzkvQwe0s2mxz5qkMYKmur/SzpiecKotnnTuF0Tgud&#10;m7mkYP0Swj/R1qeuXPrcY0Q0F9Z/L30Wd/xxtNXSwES4WGC9S+mdz46QZVuf0d+r51pzaErUT3Ye&#10;rfLq/bafzvunm+cnivrYVtt+7/rnlth2cYnWdgr2zickw+nP0V0L1ru1/r0PCD/p2fpJ/4cQGzK+&#10;TFq9fmVfa+4uoe+udnzsueqY4ymc33VO+m//gPeiAefCTJ0dg37TnZAQScqs6WbR6+4tvRbScOEb&#10;hpkREkIatf/18P7jtYkt+55dvbXqvm2raTDKP/rovtpdMkKO/Sb/wMX0HK5ac/7J4/9Gjr266MV9&#10;x3JeCKAxJN9mIN06SWaF7Ya6Zsifse7ZB8uzn+VVlRdwnz8P/SlkshcOHElM4rMOu9g5nEiX5T7J&#10;71XnLOP+b8rIWO70cFq/8XR1VuV5cUk4aePHfuQy6aqcl1paDFwGMj35tJoWqpR3q0nktRaj3alp&#10;uUo5WgaBeN+2X7ObQklYsl745z0hMf4zYeTDhei4qZ9/UC0sW+64fpW0NfLPzdS8RO5/k2fLop1U&#10;djyFY384MxPn1rx/nMYUu2rR81eun8+NM/WTsPT7F3aebk1Z4tCQswtIWVmQwj7tVR7lY1D/LvET&#10;YXzvZyWRPWyz/B00OWMZV4dGtHnHL1inopwW2pkcxxf2LceenOFYy3Gv/Y+DS36E9tw2ucbe+bYR&#10;MnEHnJzI1k92Hq09jv/pWOfUEsVdzUhNEO2iW9evTuGSKHuGe5OP2e55lw8Vhxa4Gl8e2UeSVmdb&#10;u2r3EOKGA1f2b8nNJQhXShwfe9HOO+Z4Cld3nZP+OzyGfYdhGJOp6wc/zLNYLG6qTZowYf+f/qvv&#10;dv35ZkKm9auScpf1tz7l5V/nTjF1dk14fG122cff0JJLF8iZv6zO2MbvX0nTTghb7Yl/6TJ1knsy&#10;fkjevniRkBnDemHe5PNxIGUZH0rYOLQue8gpyBP4LK9AsyhVKWxzSeUGjSb0L35D3Ykdew8vTEvf&#10;rd0cIXtAmALzNm5hdd+p+dg0eojmZVxISIz74J+t8/kBkrgpoj3sc0ZcIvsswK4z7Tjz3s432tih&#10;FLaEnwITtIrO2L9yQv9TuOkP/1TNP+lEx8STpgGWvySkZny272jrY8KJXXS+r2MP39+050Lr0oSE&#10;/lfd+s9jbZcIO1Bk47iap+N6OyGJdj1wWsg/+8YtihYvx+6of++IQzWne8UdE/f8vY+4MQ/nd4X7&#10;Ew0bZ31ziR26u9Ru+xFGOz6E+hvgEsR3td1jb7Ad84CTx7DXDDQXxliYM42fuw9AVPyECX1NTV/8&#10;SMofPvn0X9PTbCUXP/2wPvFZmonYZhjzrdvsx5SZL5w3Esli7lNPyeO/P/YLa/Tsudl161O2Wk8v&#10;22av2cJWCaQX5vs8A9mostWk5JyRqDBIAzaK2Yt/ufkX/IKbnW//qTBntbDr+TUr6Pfm5qYspbSb&#10;TLZNgQ2M5pjk1GxxfVpCW6jX6/i5sIMHSrYWuUtUwqlbydlRtR6IncKYu/P9SiL8U95xpr6hvfZK&#10;nO0V8uJVpdExcW01R87M4nY1nz5+ad5jwpNN9PyVT5D3PqLBJIEGlOPWJcyuztpXOdruFE760zE/&#10;xf5pJuGe+z/bU/VJjLtXQkWnLFtcXfXBJeuwgYvOt56pty4D7/iqqW1qkrXPfV1il9oI7xdA+DkU&#10;W0pr+5KfZOm3jMlpocA64cKN2diWY7M1yWy7ii72Ol3kGz3/3njr3B9751u713Hm5OdzFy2h53R7&#10;osGip/jWGik6znzWaJ0Lc9k3FybPXrZy0enK6jN9oymiRwUbhfs9hJzfG453tfPHnpOORTucwuld&#10;5+Zu6P8Y9pIB58IsjKXhbKP7OtS8uYq+piyTfpT/+P0va5WH+Qmsuq3PvC55cfd9FsbM1mn48MTX&#10;OdnTyMW6jxoefzadYSzTZ5M/VLydvTBHGDli+L4x9tuBwW8ykK66Qpln4AMQO2lVyK47tc6PcVNd&#10;ZQsKC9l5M9vAUV81ZVnZAqEdZ8cSNamoWFDDZFdbp8w8aLCwauDJNfCyrUUFqwoaFqal021lasIG&#10;Lm1wq3Oe4fZbh38+3v+hKnd50bY3CTcXtqHoNffNHqzcLktLj+fq88M5fAuRZDMhprr9h10daHdq&#10;3ehbD5SwZH1eXHVV5U7+Jn2+v5fUXhFVEK0qnblkdcZ7+/a8cdxak18S0e/9ddjpqaV5NHzYBk64&#10;1b597Cvbn8JJf1Y66TU7BRbzyc43KvmbU+9f7WTwgB/asY3fOO98Qkz7G7Zz0a46rIyOufDF1KTV&#10;orajZyVNrmWHi+j25Pj2IzvfYJcSJ/OxhrgqtC3cYWevbC9n40aq2P5MmZtsHaNiX8tdY10T7bjX&#10;4b7qw4VCLuFxdz5/RexM2UznJ7oTCUu/z+bURm5NdDJpGqhvLtGfyPX39u1sog+59j39HxUpKx9r&#10;f8P6EOLGWpxeguNdneDw2Etw0bFoh1MkOLnrnHL6GPYRi8VS3zDwO4Ao5OInNkvPv7x48nfbFq2w&#10;jmrn/K72jUWmmz38YFKKvHnr0hVsrsr93cf39XabSdov9hWqV69d+jq3P+vfjxaGDvNljCzJjS6T&#10;+HZEZJQnh508/vdFix+447OL1gP1rQYSLe7Rrcs4t6lWY2CrCZEmk9htcdGFlAnhxuHYhr75NiED&#10;edjgHV/iKDJMP3TwJfpDTFl03x010fpJ9fVU765+GIFTDNYAXXL6Xj4j8u5//nNfsYuo2heJR+NG&#10;rm+DvKv9505zrf7kp/TfW4ZhaLIxm80NJ0/MnpvsqvLSRzPp9/98Y+e6n7948+ZN9y2X/77s7rlz&#10;+hWNiZBGhPGbPTev3+rlN09uf3Rv4p7/ePquMf3KQ8IioiKswaeny9RNxo0fZ+nq4lLTGNG2c19+&#10;0bhgUXpoaGhISIg/fGyqz8eBuFEYQkNHta5cxYYg47kGoq9QSAr5/epsa7VNXEISpszIuQZl2S6u&#10;TK4pVheWENfH5mU5ZhnPGgQAOwlLsr39IpgROMVg+WGXeH7TMXZKccrifq/j85u+2fPbjt2Znz63&#10;fsA6NHnMvusu+9Lem6ZO58mJ6WHXOvdjuX2z87a44FZnr9CQaDsw+DwDceSaXWUZ+VqjyjrwYvcS&#10;Md1g2rqTYwEAwHOiTzJhJ4P8e2glwLlZZDMhPv7K1aueNHL3vHlh48IYz1bsMAOddxTwjwzEDb0s&#10;kORrs2o18jkLSGGJdpPK/UQUrabP3KLTcFNXJRWElPGFnhzreYMAAANLWPqck1evOSscZbi3EvB1&#10;J4LjriZulhp/8N8HPZxXspjNdgtgXEt75dgDFpPJzcTWKOAvGYgQ1aayEgWXgsoNZRkK24QWO6zj&#10;vH55jVqSKangljCrSZW10KNjPW8QAADAr3V1dnih1d5bHR6mpQDm2zXR/opdFN1Y7NU3KwpAo/yH&#10;HhyGYU00AHif45rou+bc7etODYPz585iTbS/020p1CvLFL7uBgAAgFUgve1OwEAGEvS9sxA3i4bX&#10;xQMAgI/5w2DJsPOfi0IGEuCjNGD0CwkNNZvNoaGB/bZmAKOb2dxr90vK/uZaLCEhIb7q0rCwWPzu&#10;Hx9kIIAgEhkp7eq8Hh0b7+uOAIBLXZ0dEZFScQn9ze3uMkVKx/uqS8Oiu6vL7rp8DhkIIIhMmTaj&#10;5aumSGn0mDH43QfwR729vd9cbE1ITCLcnBHDMPT7hMlTLzafD4+MCtyhIIvFcvXK5Rmz7uInwvxk&#10;Ogz/DgIEkZj4CZ2d1w1nG6YnzJRGx/jbuDRAMDObzV2d12kAio2fGBs3gS+kWYHmHvrbGh0bZzhb&#10;P3W6LOB+c+l1mTrodTVPk82Sjo/xk1eE8ZCBAIJLwqyk8eNjvqX/0Daft5jNvu4OAFiFhIZGRkoT&#10;EpOEAMTjY9DUGTPDIyIvtX7V+lWT2RxIH0kRGjpmfHRM0pxkmu38KgARZCCAIBQTP4F++boXADAw&#10;PjHwAz9xEybFxE3gP+nCw8+78Dlh5iuEQy9EwvF1v6yQgQAAAPyXEINohrBYLIGSfsT4DCSx8XV3&#10;+iADAQAA+DVhNEUIEIGShIQO+9VSaAEyEAAAgL8TMgSffvwtTLjnt71FBgIAAAgYfpsnAhEyEAAA&#10;AAQjX2cg3TpJZgW3pa4ZxOe008NKkg21Grmw4abOEPo0tAMBAAAgYPg0Axm1GZmkhmFU3LZWR1Qe&#10;hyAAAACAO+HTDGRo1CuTFfy2XINxF3Clx8zsPNKhq7952eTuPf0mjQ9VLYhct2z82FDMlwMAwAB8&#10;moFU2erMzHxtlmjaiZuHqsmryizUE6Iss81IGbUZCrbE7ZSZs0oGa5nbply1zk3UDWqODryj/Ehn&#10;VV3X+PCQydHu3iHeYiF760wSCdnwUPSI9Q0AAAKUb9cDqcoZNqRICsXhQ19YkmdgGDmbTPiApFun&#10;qKJFtXI2lmRojSqNY1NsbVslga0pNsxs0WnoGZw05exA0n+iDnxM13CDBqABPyuQVqDVaupvIAMB&#10;AMCAfL0mmsg1tYyGDTCSddYYpCzbxY3YyDXF6sJqA90610D0FWxS4qiznTRjPFSlVxfb5xhbU6ps&#10;NSk5ZyQqx6aM55wdSKryFSTPUIsA5B++6zS7HwGipsWE3jaTKyZzWwc+AwsAAAbm8wzEkWt2lVUp&#10;qnX9J52MNLAQa+Cxm5HS3cHJ+jdlPOesDjt7pm+k+QtrlPyFxe17os6bOvbXK+Ou37C8vO+K415Z&#10;2vz6/QdjZXKnN0eA52fka14mU1W56XVuDzG2mAasAwAAbvg0A+m0WgW/FJodxlHmKQihsUNfdcjI&#10;lvJDO2xambOAFJZoN6ncrJqWZ+UpB6rDVnNoyvmByrxdtcVbJBlavETeX1hcvzH8UkX4y4/FhoVK&#10;YiNCNI/EvPQnJzEosMhlUkPdmTuvAwAAbvh2TfScRuENL9U1DJs2aAZSLmjMl0j0fBk3YKMqN5Rl&#10;KGwzWOw4jmNbck1tTaPEWsf1OmbHplSuDqRVz2UoJFVlyEH+wGJhv8dGhmxeGVd+tOPsNz18ec69&#10;UeuXRfMPo+s3Le/+o8t3fQQAgIByo8sk/mI8849jRz2sOUg1avYlXN5pG+6M137oA0sraV2+7evc&#10;1y+d/66H3uy6Zfn5nssrfvf1X/7ZJdRpvdrz0zfbaDVa2e7whO8ltzcbHG8+vrYw9Xv30a/TtTX0&#10;pqG5U87dTP1eol0Lopof0W2+PlVT27h+bS7f5qe1J+W21l5/53/4+v/9zk67vXxJ/9PdJzQo9E3c&#10;Z7t+Or0u19fSr/Hd71Sn9u+Gq8YBAEY9/1gPBDAQs4VER4TERrKvDYsMk/z2h/HGtp7UhDB+72fN&#10;t399sN10y+J5gzr92Udnj91QeUIoeSg3nV+1Q3cd2luetWad05rrydSjf/tjipIdMPzwb/r/p+A5&#10;rlj6ZmWJoe4ErfyU5pnSjWtPcduvaDK5dqx7+UU8GRnL6Vkeyl1eo91M27Gt7FE4XdmzquBF9Yp5&#10;WZXb3VyLYx0XjUuvNdWKO+Z4JwAABA9kIAgMFoZp+q7n5+9cLlszYUJUKI1BQgB6v+HG1v+53mN2&#10;u2ragUIme+HAkcQka9ahWSGcSJflPsnvVecsc1VTpbxbptm3oeg1ut3yZU1K0btcLdNvNr/K71UT&#10;E005tu3Iay3fCXvlMumqnJdaWgyXydRw0sYHKaHQMQPRXjWers6qPO/mQhzrcNfitHHTk0+rRR0z&#10;2l0aAEBQ8bcMpCrHG/KAM/x6oAuXe1/Yc0X7kwkTpexL5Wnqeau284+fdLqPP4tSlcI2lw9u0EAQ&#10;S4ih7sSOvYcXpqXv1m6OkD1ASNupOidpg1t93FeTZouijRWH9pY3k6Sfrnh0sBdi+LKBPDh9sEd5&#10;ieOl+bpHAAAjx98yEIBzwmvjL1zp/dc9V37/kwmxkSG/1V17v+HmgMcqZi/+5eZf7KhkB2x2vv2n&#10;wpzVwq7n16yg35ubm7KU0m4yWTwFZkeomaIkKzLu/7+b3+om/1u++ReedV9aW/th1ho5P2aTomQn&#10;rejp6vU6frrq4IGSrUXO41dyarabXjmtQ0s8adzppQEABA9kIAgMZtFr4y9c6dmw5/IEaehnzbc8&#10;OXZrUcGqgoaFael0W5masIELQ9yamGe4/dbhn4/3f6jKXV607U3CzYXxs11Oa9KQMWn2w3eRLzx+&#10;bx7TyabuIq4D+7Wv80X86SLJZrq3bv9hV0cerNwuS0uP53rlaqjGsY6HjTteGgBA8JDc6DKJb0dE&#10;Rnly2Mnjf1+0+AHvdAn8lA9/6Fn/36XvOj199+dJ40MPvTDVq/2hXi6tzH9wOiaPAAACF8aBIAB8&#10;f37428c9feMf1fxwr3aGcIuKvutbDQ0AAAEJGQgCwFplBMMwHzTecj8aNGl86PeTxz2rjPBqZ1YV&#10;vHjh9P8c2X/Qq2cBAABvQwaCABAVMW79UknB/WGM60/MoCQSydixY8PCwrzamYNu36oHAAACBTIQ&#10;BIYwjq97AQAAowcyEAAAAAQjZCAAAAAIRshAAAAAEIyQgQAAACAYIQMBAABAMEIGAgAAgGCEDAQA&#10;AADBCBkIAAAAghEyEAAAAAQjZCAIABaL5YLx80tft96+1e2m2rhx4VOmJyTK54WEhIxY3wAAIEAh&#10;A0EAoAGoy9T5L4sfGBfu7vNQb3Xf/OLMqQvGL5Lm3D1ifQMAgACFDAQB4NuvWxcNFIAoWmHu/IUn&#10;j/8dGQgAAAaEDAQB4Nat7gEDEI9Wu+V2vgwAAICHDASjnyxtfv3+g7EyudObd9iamE5/9hXNM8rU&#10;hB2V7955a3fe1SEbwnmHcO3GFpMqN73OFxcIAECQgQCGkVrzTI12c4pSNYRjfRV3hssQrl0ukxrq&#10;znivSwAA7iEDAQwjk0ym8HUffCWYrx0AAhIyEASvVQUvXjitpxu7uQEMbmpmeSS7p+1U3XlxTWFX&#10;6caXHAv5+rK09HgiXZb7ZOnGtVlr1r1cWnn4QAXdp85ZtqHoNdJ/pKf/qE+McKxQWWBo6XwiN507&#10;NdssLXFs2fMLcVvZWuL0wsV7aefVOeo/HygTGre7dg+PsrsfPOkYrf/bjaWvbSslojvE7sABfuoA&#10;ADbIQBCkdPqzj84eu6HyhFDyUG46/3xMdx3aW84/v9p2LecnenbsPRzvon5L3QnxM/rWogJCv7in&#10;7SefVrud5Lpud6yI9M3KEkPdCX7pTEbGclrBruVjLT2eXwiNC+oV87Iqtztemm11jkLcBxd7pYuS&#10;wn8lijJ2/ffwKDGPOya91lR7qu4Et/wok16a488RAMBDyEAQpBQy2QsHjiQmWSMCfaIN50Yy+L3q&#10;nGVCTbrr4dQEfoDh+TUrSrcR9/V5/BphuhFP7oTpN5tfJdzSmVU5L7W0GPhkI255UBfSeLo6q/K8&#10;uCSctPGXJj7FQHtNNI256vEQjhpMx0w09tFClfJuNYm81mK0u3wAAM8hA8HotyhVKWxzT6436LNp&#10;LCGGuhM79h5emJa+W7s5QvaA05kjt1zWp2d5QZNp4PauKvjZHfXexvBlA3lwumPL3MriO7yQAGZ3&#10;+ZgLAwDPIQPB6KeYvfiXm3/Bv2Z759t/KsxZLex6fs0K+r25uSlLKe0mk+1mjnj0Wfaj0631ep14&#10;LowWuqpP2EU8LY+kLiLWEQ49X7go9VFhIMfjwSFpbe2HWWvk/EhJinI7PdaxZc8vJDk1W7yLvwr+&#10;0miDBw+UbC06L67vZq8rQzhqsB1zJFx+itJNLQCAfpCBYPTbWlSwqqBhYVo63VamJmzgwpAwoySM&#10;mny8/0NV7vKibW8S0XJjXoX2rafYyptLN7501Vbopr5KeffOypn0jMpUuTAKtb5AzTeizskWGhH8&#10;OOclZ2uiTSebuou4nu/Xvu605UFdyMHK7ez6ZW4XP2rCV44km+m56vYftuuV+72uDOGowXZM4Hj5&#10;AACeutFlEn8xnvnHsaMe1oRRw4c/dP3HH3TfvOFJTVpN/7cPvN0fAAAYBTAOBAFg0tQZX5w5NXf+&#10;Qk8+M5VWHrGOAQBA4EIGggCQkDi75bzx5PG/u/8ssHHh4ROnTE+YNXvEOgYAAIELGQgCQHh4+KzZ&#10;c6bPvIthGDfVJBLJ2LFjw8LCRqxjAAAQuJCBIDCEcXzdCwAAGD2QgQAAACAYIQMBAABAMEIGAgAA&#10;gGCEDAQAAADBCBkIAAAAghEyEAAAAAQjZCAAAAAIRshAAAAAEIyQgQAAACAYIQNBALBYLBeMn1/6&#10;uvW2+88LGxc+ZXpConxeSEjIiPUNAAACFDIQBAAagLpMnf+y+AFPPjf+gvGLpDl3j1jfAAAgQCED&#10;QQD49uvWRQMFIMJ+bnzE3PkLTx7/OzIQAAAMCBkIAsCtW90DBiAerXbL7XwZAAAADxkIRj9Z2vz6&#10;/QdjZXKnN++wNTGd/uwrmmeUqQk7Kt+989ac7jW2mFS56XWDOUQovEymDuHYO3HnDQ7hLh3wLgIA&#10;4CEDAQwbteaZGu3mFKVqCMd6GBfkMqmh7syQejfEY4c9GA3KEO7SO7mLACCoIAMBDCOTTKbwdR9G&#10;GdylAOAtyEAQvFYVvHjhtJ5u7OZGGrg5lOWR7J62U3XnxTWFXaUbX3Is5OvL0tLjiXRZ7pOlG9dm&#10;rVn3cmnl4QMVdJ86Z9mGotdI/wGV/oMrMcKxQmWBoaXzidx07tRss+Jjxb1av+3fhQYdDxEM9lg3&#10;HXN971lLnN6B4r20M+oc9Z8PlNF7z641W2/73aUDNuJ4mR72k9b/7cbS17aVEtGd5rRLADCaIANB&#10;kNLpzz46e+yGyhNCyUO56fwTJ911aG+5OD08lLucn5HZsfdwvIv6LXUnxE+9W4sKCP3inl+ffFrt&#10;di7put2xItI3K0sMdSe4ZTGZdoHGaa/cHzLYY111jOYD9Yp5WZXbHRu0LcdRiA9xsVe6KCn8V3Xn&#10;HX8WPLuzu2/E6WV63E/ptabaU6ILd9UlABhNkIEgSClkshcOHElMsmYd+owYzg058HvVOcuEmnTX&#10;w6kJ/EjA82tWlG4j7uvz+MW8dCOe3AnTbza/Sv+nUt6tJpHXWoxCsHDaK/eHuL8iD4/lD288XZ1V&#10;eV5cEk7a+AblMumqnJdaWgzirrrYa8rIWE4cfhZODdjInfXTRHOq+MI96RIABDpkIBj9FqUqhW3u&#10;WfAGfdqLJcRQd2LH3sML09J3azdHyB5wnAIbiMv69CwvaDIN3N5VBT+7o94HAW4Vc9/Pwh8mnvyw&#10;SwAw7JCBYPRTzF78y82/4F9cvfPtPxXmrBZ2Pb9mBf3e3NyUpZR2k8l2U2A8+nT40enWer1OPHNE&#10;C13VJ+yqmpZHUhcR61CEni9clPooP+qg05+9s8Ehl70agWP5w5NTs8XXzt8bfIP0kg8eKNladF5c&#10;381egfCzSFE67vS0kTvp52C7BACBDhkIRr+tRQWrChroH/R0W5masIELQ8JclTCc8/H+D1W5y4u2&#10;vUlEC5l5Fdq3nmIrby7d+NJVW6Gb+irl3TsrZ9IzKlPlwijU+gI134g6J1toRPDjnJecLj12w2mv&#10;hv1Ypx07WLmdXbDMXTs/TMLfG5FkMyGmuv2H7Rpxv9fxZ+GU+0acGmw/B9slAAhsN7pM4i/GM/84&#10;dtTDmjBq+PCHrv/4g+6bNzypSavp//aBt/vjbwzNnfLvJY78sQAAAQ3jQBAAJk2d8cWZU3PnL/Tk&#10;M1Np5RHrmJ/Y+faf+Km3ET4WACCgIQNBAEhInN1y3njy+N/dfxbYuPDwiVOmJ8yaPWId8y3hDWyG&#10;MF9zJ8cCAIwOyEAQAMLDw2fNnjN95l0Mw7ipJpFIxo4dGxYWNmId862Dore9GcljAQBGB2QgCAxh&#10;HF/3AgAARg9kIAAAAAhGyEAAAAAQjJCBAAAAIBghAwEAAEAwQgYCAACAYIQMBAAAAMEIGQgAAACC&#10;ETIQ+IX2K5fbvmm90dXFMBYfdkMiCYmSSidNnRE3YaIPuwEAACMAGQh8r+XClzQDzZDNjBofExoa&#10;6sOemM3mrs6Oi83nTZ3XZIlyH/YEAAC8DRkIfIymH/qluHvBmDG+fzTSBBYdGxcpHW842yAdH4vR&#10;IACAUcz3zzoQ5Nq+aZ0hm+kPAUhAOzM9YWbbNxeRgQAARjE/euKB4HTz5o2o8TG+7oU9aXTMxWZ8&#10;mjoAwGiGDAQ+ZjGb3awBunXr1sub/s+77757+fLlYTzpjBkznsnPLyr65dixY51WoF0ym83DeEYA&#10;APA3yEDg12gAKi8vH/ZmL168+P+Wlkokkl//+lfD3jgAAAQEZCDwa3/+85+91/hbu3YhAwEABC1k&#10;IPBrV65c8V7jra2t3mscAAD8HDIQAAAABCNkIAAAAAhGyEAAAAAQjJCBAIaTLO2ulrqRfmMhWdr8&#10;+v0HY2WD+HCPIRwCADDKIAMBAABAMEIGAgAAgGCEDATgLasKXrxwWk83dms3pyhVxhaTKnd5JLeL&#10;LyHcnNRvN5a+tq2UbpduXJu1Zt0QGhG4OoU6R/3nA2Wn+k/SGVo6n8hNjxSd9+XSysMHKuiGOmfZ&#10;hqLX3J697dSIT/kBAAwvZCAAr6DpQb1iXlbldqHkodzlNX1JIr1uv4JbjiO91lR7qu6ETn/2FU2m&#10;XQbyuJEBTrEoKfxX9pFF+mZliaHuBF8zI2M5rbm1qIDQLy42Pfm0+lhLz6Ozx26oPCFqP51fRUR7&#10;e2hvuWNiAwAIIMhAAMOPBovG09VZlefFJeGkjR+Ykcukq3JeamkxcAHFRNMGLVQp71aTyGstRiHT&#10;DKaRAU5BI45DH02/2fyqXU0uhz1DC+O5GgqZ7IUDRxKTrFmHa1+6LPdJ/nh1zrLhvdMAAEYYMhBA&#10;sDN82UAenE4jzguaTAM3XLSq4GeEi0eGuhM79h5emJa+W7s5QvYApsAAYDRBBgIYfjQ9JKdmi2eL&#10;aEk3mVyv1/ETVQcPlGwtGiBMDLaRQZ5CWlv7YdYaOT/alKLcrtOffSR1EbGOP+mFes+vWUG/Nzc3&#10;ZSnZ9jEFBgCjBjIQgFccrNwuS0uP3/YmsS0o/nj/h9yC4s2EmOr2H/ZGI4M5helkU3dRWjrd2q99&#10;nXCTcTsrZy5MS1emyhelKmmJMDUmDP/w7Rdx/RHWTQMABKj/H4HHTgYiORbzAAAAAElFTkSuQmCC&#10;&#10;"
       id="image1"
       x="-50.363232"
       y="81.443939" /><rect
       style="display:inline;opacity:0.949367;mix-blend-mode:darken;fill:#c0ffd4;fill-opacity:1;stroke:#c0ffd4;stroke-width:1.64009;stroke-linecap:butt;stroke-linejoin:round;stroke-miterlimit:4;stroke-dasharray:none;stroke-dashoffset:0;stroke-opacity:1;stop-color:#000000"
       id="rect17271"
       width="27.096718"
       height="3.9430695"
       x="9.1167631"
       y="139.8983" /></g></svg>
