<?xml version="1.0" encoding="UTF-8"?>
<svg width="300" height="165" version="1.1" viewBox="0 0 300 165" xmlns="http://www.w3.org/2000/svg">
 <rect x=".31474" y=".31476" width="299.37" height="164.27" fill="#e1e1e1" fill-opacity=".25" fill-rule="evenodd" stroke="#000" stroke-width=".62947"/>
 <path d="m243.38 76.093c0 33.761-27.369 61.13-61.13 61.13s-61.13-27.369-61.13-61.13c0-33.761 27.369-61.13 61.13-61.13s61.13 27.369 61.13 61.13z" fill="#00f" fill-opacity=".3046" fill-rule="evenodd" stroke="#000" stroke-opacity=".33" stroke-width="1.6595"/>
 <path d="m183.34 76.092c0-33.761-27.369-61.13-61.13-61.13-33.761 0-61.13 27.369-61.13 61.13 0 33.761 27.369 61.13 61.13 61.13 33.761 0 61.13-27.369 61.13-61.13z" fill="#ff00f5" fill-opacity=".28161" fill-rule="evenodd" stroke="#000" stroke-opacity=".32759" stroke-width="1.6595"/>
 <text transform="rotate(-90)" x="-82.685898" y="38.87318" fill="#ff00f7" fill-opacity=".5977" font-family="'Liberation Sans', Arial, sans-serif" font-size="17.24px" font-weight="bold" stroke-width="4.31pt" text-align="center" text-anchor="middle" style="line-height:0%" xml:space="preserve"><tspan x="-82.685898" y="38.87318" dx="0 0 0 0 0 0 0 0" dy="0 0 0 0 0 0 0 0" fill="#ff00f7" fill-opacity=".5977" font-size="14.367px" stroke-width="4.31pt" text-align="center" text-anchor="middle" style="line-height:1">Elementi</tspan></text>
 <text transform="rotate(90)" x="82.314102" y="-265.07828" fill="#0000ff" fill-opacity=".6" font-family="'Liberation Sans', Arial, sans-serif" font-size="17.24px" font-weight="bold" stroke-width="4.31pt" text-align="center" text-anchor="middle" style="line-height:0%" xml:space="preserve"><tspan x="82.314102" y="-265.07828" dx="0 0 0 0 0 0 0 0 0 0" dy="0 0 0 0 0 0 0 0 0 0" fill="#0000ff" fill-opacity=".6" font-size="14.367px" stroke-width="4.31pt" text-align="center" text-anchor="middle" style="line-height:1">Principi</tspan></text>
 <text x="118.01412" y="94.333763" fill="#000000" font-family="'Liberation Sans', Arial, sans-serif" font-size="11.772px" stroke-width="2.9431pt" text-align="end" text-anchor="end" style="line-height:0%" xml:space="preserve"><tspan x="118.01412" y="94.333763" dx="0 0 0 0" dy="0 0 0 0" font-size="7.8483px" stroke-width="2.9431pt" text-align="end" text-anchor="end" style="line-height:1">Colore</tspan></text>
 <text x="129.6754" y="32.589062" fill="#000000" font-family="'Liberation Sans', Arial, sans-serif" font-size="11.772px" stroke-width="2.9431pt" text-align="end" text-anchor="end" style="line-height:0%" xml:space="preserve"><tspan x="129.6754" y="32.589062" dx="0 0 0 0" dy="0 0 0 0" font-size="7.8483px" stroke-width="2.9431pt" text-align="end" text-anchor="end" style="line-height:1">Linea</tspan></text>
 <text x="120.19669" y="48.025234" fill="#000000" font-family="'Liberation Sans', Arial, sans-serif" font-size="11.772px" stroke-width="2.9431pt" text-align="end" text-anchor="end" style="line-height:0%" xml:space="preserve"><tspan x="120.19669" y="48.025234" dx="0 0 0 0" dy="0 0 0 0" font-size="7.8483px" stroke-width="2.9431pt" text-align="end" text-anchor="end" style="line-height:1">Forma</tspan></text>
 <text x="114.86609" y="78.897591" fill="#000000" font-family="'Liberation Sans', Arial, sans-serif" font-size="11.772px" stroke-width="2.9431pt" text-align="end" text-anchor="end" style="line-height:0%" xml:space="preserve"><tspan x="114.86609" y="78.897591" dx="0 0 0 0 0" dy="0 0 0 0 0" font-size="7.8483px" stroke-width="2.9431pt" text-align="end" text-anchor="end" style="line-height:1">Spazio</tspan></text>
 <text x="124.87799" y="109.76994" fill="#000000" font-family="'Liberation Sans', Arial, sans-serif" font-size="11.772px" stroke-width="2.9431pt" text-align="end" text-anchor="end" style="line-height:0%" xml:space="preserve"><tspan x="124.87799" y="109.76994" dx="0 0 0 0 0 0 0" dy="0 0 0 0 0 0 0" font-size="7.8483px" stroke-width="2.9431pt" text-align="end" text-anchor="end" style="line-height:1">Texture</tspan></text>
 <text x="134.41736" y="125.20611" fill="#000000" font-family="'Liberation Sans', Arial, sans-serif" font-size="11.772px" stroke-width="2.9431pt" text-align="end" text-anchor="end" style="line-height:0%" xml:space="preserve"><tspan x="134.41736" y="125.20611" dx="0 0 0 0 0" dy="0 0 0 0 0" font-size="7.8483px" stroke-width="2.9431pt" text-align="end" text-anchor="end" style="line-height:1">Valore</tspan></text>
 <text x="115.2655" y="63.461407" fill="#000000" font-family="'Liberation Sans', Arial, sans-serif" font-size="11.772px" stroke-width="2.9431pt" text-align="end" text-anchor="end" style="line-height:0%" xml:space="preserve"><tspan x="115.2655" y="63.461407" dx="0 0 0 0" dy="0 0 0 0" font-size="7.8483px" stroke-width="2.9431pt" text-align="end" text-anchor="end" style="line-height:1">Dimensione</tspan></text>
 <text x="174.98042" y="32.589405" fill="#000000" font-family="'Liberation Sans', Arial, sans-serif" font-size="11.772px" stroke-width="2.9431pt" style="line-height:0%" xml:space="preserve"><tspan x="174.98042" y="32.589405" dx="0 0 0 0 0 0 0" dy="0 0 0 0 0 0 0" font-size="7.8483px" stroke-width="2.9431pt" style="line-height:1">Equilibrio</tspan></text>
 <text x="183.67584" y="51.112812" fill="#000000" font-family="'Liberation Sans', Arial, sans-serif" font-size="11.772px" stroke-width="2.9431pt" style="line-height:0%" xml:space="preserve"><tspan x="183.67584" y="51.112812" dx="0 0 0 0 0 0 0 0" dy="0 0 0 0 0 0 0 0" font-size="7.8483px" stroke-width="2.9431pt" style="line-height:1">Contrasto</tspan></text>
 <text x="188.77679" y="69.636215" fill="#000000" font-family="'Liberation Sans', Arial, sans-serif" font-size="11.772px" stroke-width="2.9431pt" style="line-height:0%" xml:space="preserve"><tspan x="188.77679" y="69.636215" dx="0 0 0 0 0 0 0 0" dy="0 0 0 0 0 0 0 0" font-size="7.8483px" stroke-width="2.9431pt" style="line-height:1">Enfasi</tspan></text>
 <text x="187.76425" y="88.15963" fill="#000000" font-family="'Liberation Sans', Arial, sans-serif" font-size="11.772px" stroke-width="2.9431pt" style="line-height:0%" xml:space="preserve"><tspan x="187.76425" y="88.15963" dx="0 0 0 0 0 0 0 0 0 0" dy="0 0 0 0 0 0 0 0 0 0" font-size="7.8483px" stroke-width="2.9431pt" style="line-height:1">Proporzione</tspan></text>
 <text x="181.70071" y="106.68304" fill="#000000" font-family="'Liberation Sans', Arial, sans-serif" font-size="11.772px" stroke-width="2.9431pt" style="line-height:0%" xml:space="preserve"><tspan x="181.70071" y="106.68304" dx="0 0 0 0 0 0 0" dy="0 0 0 0 0 0 0" font-size="7.8483px" stroke-width="2.9431pt" style="line-height:1">Motivo</tspan></text>
 <text transform="scale(1 .99997)" x="168.14247" y="125.20968" fill="#000000" font-family="'Liberation Sans', Arial, sans-serif" font-size="11.772px" stroke-width="2.9431pt" style="line-height:0%" xml:space="preserve"><tspan x="168.14247" y="125.20968" dx="0 0 0 0 0 0 0 0 0" dy="0 0 0 0 0 0 0 0 0" font-size="7.8481px" stroke-width="2.9431pt" style="line-height:1">Gradazione</tspan></text>
 <text x="152.31651" y="78.12191" fill="#ffffff" font-family="'Liberation Sans', Arial, sans-serif" font-size="11.772px" font-weight="bold" stroke-width="2.9431pt" text-align="center" text-anchor="middle" style="line-height:0%" xml:space="preserve"><tspan x="152.31651" y="78.12191" dx="0 0 0 0 0 0 0 0 0 0 0" dy="0 0 0 0 0 0 0 0 0 0 0" fill="#ffffff" font-size="7.8483px" stroke-width="2.9431pt" text-align="center" text-anchor="middle" style="line-height:1">Composizione</tspan></text>
 <text x="5.103054" y="12.210741" fill="#000000" fill-opacity=".21476" font-family="'Liberation Sans',Arial,sans-serif" font-size="11.772px" font-weight="bold" stroke-width="2.9431pt" style="line-height:0%" xml:space="preserve"><tspan x="5.103054" y="12.210741" dx="0 0 0 0 0 0 0 0" dy="0 0 0 0 0 0 0 0" fill="#000000" fill-opacity=".21476" font-size="9.8104px" stroke-width="2.9431pt" style="line-height:1">Panoramica</tspan></text>
</svg>
