<?xml version="1.0" encoding="UTF-8" standalone="no"?>
<svg
   xmlns:dc="http://purl.org/dc/elements/1.1/"
   xmlns:cc="http://creativecommons.org/ns#"
   xmlns:rdf="http://www.w3.org/1999/02/22-rdf-syntax-ns#"
   xmlns:svg="http://www.w3.org/2000/svg"
   xmlns="http://www.w3.org/2000/svg"
   xmlns:sodipodi="http://sodipodi.sourceforge.net/DTD/sodipodi-0.dtd"
   xmlns:inkscape="http://www.inkscape.org/namespaces/inkscape"
   sodipodi:docname="tutorial-figure-template.svg"
   inkscape:version="1.0beta1 (08a003b, 2019-11-10)"
   id="svg8"
   version="1.1"
   viewBox="0 0 300 150"
   height="150"
   width="300">
  <sodipodi:namedview
     inkscape:guide-bbox="true"
     showguides="true"
     units="px"
     showgrid="false"
     inkscape:document-rotation="0"
     inkscape:current-layer="layer1"
     inkscape:document-units="px"
     inkscape:zoom="1.4"
     inkscape:pageshadow="2"
     inkscape:pageopacity="0.0"
     borderopacity="1.0"
     bordercolor="#666666"
     pagecolor="#ffffff"
     id="base"
     inkscape:lockguides="true" />
  <metadata
     id="metadata5">
    <rdf:RDF>
      <cc:Work
         rdf:about="">
        <dc:format>image/svg+xml</dc:format>
        <dc:type
           rdf:resource="http://purl.org/dc/dcmitype/StillImage" />
        <dc:title />
      </cc:Work>
    </rdf:RDF>
  </metadata>
  <g
    id="layer1"
    inkscape:groupmode="layer"
    inkscape:label="Layer 1">
    <rect
       x="100"
       y="0.5"
       height="130"
       width="100"
       style="stroke:black; fill:yellow"
       id="rect1" />
    <circle
       cx="110"
       cy="60"
       r="45"
       style="stroke:black; fill:red"
       id="circle2" />
    <path
       sodipodi:type="star"
       style="stroke:black; fill:blue"
       id="path3"
       sodipodi:sides="5"
       sodipodi:cx="172.24576"
       sodipodi:cy="86.440681"
       sodipodi:r1="46.03117"
       sodipodi:r2="23.015585"
       sodipodi:arg1="0.52359878"
       sodipodi:arg2="1.1519173"
       inkscape:flatsided="false"
       inkscape:rounded="0"
       inkscape:randomized="0"
       d="m 212.10992,109.45627 -30.50288,-1.98981 -18.9317,23.9995 -7.53349,-29.62485 -28.6751,-10.588861 25.84693,-16.31936 1.20951,-30.543774 23.50778,19.538927 29.42261,-8.288225 -11.31832,28.395081 z"
       inkscape:transform-center-x="2.9574218"
       inkscape:transform-center-y="1.4868561" />
    <text
       x="150"
       y="148"
       style="font-family:'Liberation Sans',Arial,sans-serif;font-size:6px;text-anchor:middle;text-align:center"
       id="text4">Translatable label (duplicate this text to create new translatable labels)</text>
  </g>
</svg>
