<svg xmlns="http://www.w3.org/2000/svg" xmlns:xlink="http://www.w3.org/1999/xlink" width="100%" height="100%"
    viewBox="0 0 480 360">
    <!-- Derived from painting-stroke-03-t.svg and painting-stroke-06-t.svg
         from the SVG unit test suite under the 3-clause BSD license-->
    <path fill="none" stroke="blue" stroke-width="30" stroke-linecap="round" d="M 30 110 l 200 20 l -200 20 " />
    <path fill="none" stroke="blue" stroke-width="30" stroke-linejoin="miter" stroke-miterlimit="1"
        d="M 30 190 l 200 20 l -200 20" />
    <path stroke="black" stroke-width="10" fill="none" stroke-dasharray="none" d="   M  20 20   L  200 20" />
    
     <path stroke="black" stroke-width="20" fill="none" stroke-dasharray="5,2,5,5,2,5" d="   M  20 60   L  200 60"/>
    <path stroke="blue" stroke-width="10" fill="none" stroke-dasharray="5,2,5" d="   M  20 60   L  200 60" />
      
</svg>