<?xml version="1.0" encoding="UTF-8" standalone="no"?>
<!-- Created with Inkscape (http://www.inkscape.org/) -->

<svg width="25.4mm" height="25.4mm" viewBox="0 0 25.4 25.4" version="1.1" id="svg1" inkscape:version="1.3 (1:1.3+202307231459+0e150ed6c4)" sodipodi:docname="page_position.svg" xmlns:inkscape="http://www.inkscape.org/namespaces/inkscape" xmlns:sodipodi="http://sodipodi.sourceforge.net/DTD/sodipodi-0.dtd" xmlns="http://www.w3.org/2000/svg" xmlns:svg="http://www.w3.org/2000/svg">
  <sodipodi:namedview id="namedview1" pagecolor="#ffffff" bordercolor="#000000" borderopacity="0.25" inkscape:showpageshadow="2" inkscape:pageopacity="0.0" inkscape:pagecheckerboard="0" inkscape:deskcolor="#d1d1d1" inkscape:document-units="mm" inkscape:zoom="0.9639" inkscape:cx="77.808901" inkscape:cy="43.572985" inkscape:window-width="2560" inkscape:window-height="1295" inkscape:window-x="0" inkscape:window-y="32" inkscape:window-maximized="1" inkscape:current-layer="layer1" showguides="true" />
  <defs id="defs1" />
  <g inkscape:label="Layer 1" inkscape:groupmode="layer" id="layer1" transform="translate(24.870833,-134.14375)">
    <path style="fill:#ef2929;fill-rule:evenodd;stroke:#a40000;stroke-width:1.7185" d="m -23.20528,150.45575 11.0143,-14.86849 4.3101314,5.82155 v 3.41135 h 2.529032 l 4.1751381,5.63563 h -7.4234837 l -10e-8,8.21082 h -7.2460957 v -8.21082 z" id="path1" sodipodi:nodetypes="ccccccccccc" />
  </g>
</svg>
