%!PS-Adobe-3.0 
%%Creator: Adobe Illustrator(R) 10.0
%%AI8_CreatorVersion: 27.4.1
%%For: (Jonathan Neuhauser) ()
%%Title: (2x4cm_origin_10.2306_0mm.ai)
%%CreationDate: 5/10/2023 8:50 PM
%%Canvassize: 16383
%%BoundingBox: 0 0 0 0
%%HiResBoundingBox: 0 0 0 0
%%DocumentProcessColors:
%AI5_FileFormat 6.0
%AI3_ColorUsage: Color
%AI7_ImageSettings: 0
%%RGBProcessColor: 0 0 0 ([Registration])
%%AI6_ColorSeparationSet: 1 1 (AI6 Default Color Separation Set) 
%%+ Options: 1 16 0 1 1 1 0 0 0 0 1 1 1 18 0 0 0 0 0 0 0 0 -1 -1 0 0 0 0 1 0 0 0 0 1 0 0 0 0 0 1 2 3 4
%%+ PPD: 1 21 0 0 60 45 2 2 1 0 0 1 0 0 0 0 0 0 0 0 1 0 () 
%AI3_TemplateBox: -0.5 -57.5 -0.5 -57.5
%AI3_TileBox: -288.9313 -468.308 287.6686 354.892
%AI3_DocumentPreview: None
%AI5_ArtSize: 56.6929 113.3858
%AI5_RulerUnits: 1
%AI9_ColorModel: 1
%AI5_ArtFlags: 0 0 0 1 0 0 1 0 0
%AI5_TargetResolution: 800
%AI5_NumLayers: 1
%AI9_OpenToView: -86.4809 4.45191 11.02 2196 1280 18 1 0 -2068 302 0 0 1 1 1 0
%AI5_OpenViewLayers: 7
%%PageOrigin:-401 -357
%AI7_GridSettings: 72 8 72 8 1 0 0.8 0.8 0.8 0.9 0.9 0.9
%AI9_Flatten: 1
%AI12_CMSettings: 00.MS
%%EndComments
%%BeginProlog
%%EndProlog
%%BeginSetup










%AI9_BeginDocumentData
%_/Document :
%_/Dictionary :
%_16383 /Int (AIDocumentCanvasSize) ,
%_([Medium Resolution]) /String (AI11 Document Setup Flattener Preset Name) ,
%_/Dictionary :
%_; (DocumentDict/ExportableAssetsKey) ,
%_580 /Real (PerspectiveGrid_LeftExtent) ,
%_2 /Int (kAIParametersWhichProfileKey) ,
%_580 /Real (PerspectiveGrid_RightExtent) ,
%_1 /Int (kAIParametersEmbedProfileKey) ,
%_1 /Bool (kAIParametersCompression) ,
%_1 /Bool (AI10 flattener clip complex regions) ,
%_0 /Bool (AI10 flattener outline text) ,
%_75 /Int (AI10 flattener raster-vector balance) ,
%_1 /Bool (AI10 flattener outline strokes) ,
%_100 /Real (kAIParametersSubsetFontsRatioKey) ,
%_(14.0.0) /String (kAIFullDocumentVersionStr) ,
%_0 /Bool (AI16 flattener anti alias) ,
%_1 /Bool (AI10 flattener preserve overprints) ,
%_1 /Bool (kAIParametersPDFCompatibility) ,
%_4 /Int (AI9 Flattening Quality Level) ,
%_1 /Bool (AI11 Preserve Text Editability) ,
%_14 /Int (AI11 Document Setup Language Popup) ,
%_0 /Real (BleedTopValue) ,
%_0 /Real (BleedRightValue) ,
%_5 /Real (GlobalRepulsion) ,
%_/Dictionary :
%_/Array :
%_; (SelHatDocLocalNamesArray) ,
%_/Array :
%_; (SelHatDocInterIDsArray) ,
%_; (SelHatDocTableDict) ,
%_1 /Int (AI12_SpotColorMode) ,
%_0 /Real (BleedBottomValue) ,
%_/Dictionary :
%_4 /Int (colr) ,
%_36 /Real (padd) ,
%_0 /Bool (alis) ,
%_72 /Int (dpi.) ,
%_0 /Bool (mask) ,
%_0 /Bool (spot) ,
%_; (AI Auto Rasterize) ,
%_0 /Bool (AI9 paper simulation) ,
%_0 /Real (BleedLeftValue) ,
%_1 /Int (AI9 artboard color) ,
%_65535 /Int (AI9 artboard color 1 red) ,
%_2 /Int (AI9 transparency grid size) ,
%_0 /Bool (AI11 document isolate blending) ,
%_65535 /Int (AI9 artboard color 1 green) ,
%_52428 /Int (AI9 artboard color 2 red) ,
%_65535 /Int (AI9 artboard color 1 blue) ,
%_0 /Bool (AI11 document knockout group) ,
%_300 /Real (AI9 Output Rasterization Resolution) ,
%_150 /Real (AI9 Mesh Rasterization Resolution) ,
%_52428 /Int (AI9 artboard color 2 green) ,
%_52428 /Int (AI9 artboard color 2 blue) ,
%_/XMLNode :
%_/Array :
%_/XMLNode :
%_/Array :
%_/XMLNode :
%_/Array :
%_/XMLNode :
%_/Array :
%_/XMLNode :
%_/Array :
%_; (xmlnode-children) ,
%_/Dictionary :
%_; (xmlnode-attributes) ,
%_1 /Int (xmlnode-nodetype) ,
%_ /String (xmlnode-nodevalue) ,
%_(variables) /String (xmlnode-nodename) ,
%_; ,
%_/XMLNode :
%_/Array :
%_; (xmlnode-children) ,
%_/Dictionary :
%_/XMLNode :
%_/Array :
%_; (xmlnode-children) ,
%_/Dictionary :
%_; (xmlnode-attributes) ,
%_2 /Int (xmlnode-nodetype) ,
%_(&ns_vars;) /String (xmlnode-nodevalue) ,
%_(xmlns:v) /String (xmlnode-nodename) ,
%_; (xmlns:v) ,
%_/XMLNode :
%_/Array :
%_; (xmlnode-children) ,
%_/Dictionary :
%_; (xmlnode-attributes) ,
%_2 /Int (xmlnode-nodetype) ,
%_(&ns_custom;) /String (xmlnode-nodevalue) ,
%_(xmlns) /String (xmlnode-nodename) ,
%_; (xmlns) ,
%_; (xmlnode-attributes) ,
%_1 /Int (xmlnode-nodetype) ,
%_ /String (xmlnode-nodevalue) ,
%_(v:sampleDataSets) /String (xmlnode-nodename) ,
%_; ,
%_; (xmlnode-children) ,
%_/Dictionary :
%_/XMLNode :
%_/Array :
%_; (xmlnode-children) ,
%_/Dictionary :
%_; (xmlnode-attributes) ,
%_2 /Int (xmlnode-nodetype) ,
%_(none) /String (xmlnode-nodevalue) ,
%_(locked) /String (xmlnode-nodename) ,
%_; (locked) ,
%_/XMLNode :
%_/Array :
%_; (xmlnode-children) ,
%_/Dictionary :
%_; (xmlnode-attributes) ,
%_2 /Int (xmlnode-nodetype) ,
%_(binding1) /String (xmlnode-nodevalue) ,
%_(varSetName) /String (xmlnode-nodename) ,
%_; (varSetName) ,
%_; (xmlnode-attributes) ,
%_1 /Int (xmlnode-nodetype) ,
%_ /String (xmlnode-nodevalue) ,
%_(variableSet) /String (xmlnode-nodename) ,
%_; ,
%_; (xmlnode-children) ,
%_/Dictionary :
%_/XMLNode :
%_/Array :
%_; (xmlnode-children) ,
%_/Dictionary :
%_; (xmlnode-attributes) ,
%_2 /Int (xmlnode-nodetype) ,
%_(&ns_vars;) /String (xmlnode-nodevalue) ,
%_(xmlns) /String (xmlnode-nodename) ,
%_; (xmlns) ,
%_; (xmlnode-attributes) ,
%_1 /Int (xmlnode-nodetype) ,
%_ /String (xmlnode-nodevalue) ,
%_(variableSets) /String (xmlnode-nodename) ,
%_; ,
%_/XMLNode :
%_/Array :
%_/XMLNode :
%_/Array :
%_; (xmlnode-children) ,
%_/Dictionary :
%_; (xmlnode-attributes) ,
%_1 /Int (xmlnode-nodetype) ,
%_ /String (xmlnode-nodevalue) ,
%_(slices) /String (xmlnode-nodename) ,
%_; ,
%_/XMLNode :
%_/Array :
%_; (xmlnode-children) ,
%_/Dictionary :
%_/XMLNode :
%_/Array :
%_; (xmlnode-children) ,
%_/Dictionary :
%_; (xmlnode-attributes) ,
%_2 /Int (xmlnode-nodetype) ,
%_8191 /Real (xmlnode-nodevalue) ,
%_(x) /String (xmlnode-nodename) ,
%_; (x) ,
%_/XMLNode :
%_/Array :
%_; (xmlnode-children) ,
%_/Dictionary :
%_; (xmlnode-attributes) ,
%_2 /Int (xmlnode-nodetype) ,
%_-32766 /Real (xmlnode-nodevalue) ,
%_(width) /String (xmlnode-nodename) ,
%_; (width) ,
%_/XMLNode :
%_/Array :
%_; (xmlnode-children) ,
%_/Dictionary :
%_; (xmlnode-attributes) ,
%_2 /Int (xmlnode-nodetype) ,
%_-32766 /Real (xmlnode-nodevalue) ,
%_(height) /String (xmlnode-nodename) ,
%_; (height) ,
%_/XMLNode :
%_/Array :
%_; (xmlnode-children) ,
%_/Dictionary :
%_; (xmlnode-attributes) ,
%_2 /Int (xmlnode-nodetype) ,
%_24517 /Real (xmlnode-nodevalue) ,
%_(y) /String (xmlnode-nodename) ,
%_; (y) ,
%_/XMLNode :
%_/Array :
%_; (xmlnode-children) ,
%_/Dictionary :
%_; (xmlnode-attributes) ,
%_2 /Int (xmlnode-nodetype) ,
%_1 /Bool (xmlnode-nodevalue) ,
%_(bottomLeftOrigin) /String (xmlnode-nodename) ,
%_; (bottomLeftOrigin) ,
%_; (xmlnode-attributes) ,
%_1 /Int (xmlnode-nodetype) ,
%_ /String (xmlnode-nodevalue) ,
%_(sliceSourceBounds) /String (xmlnode-nodename) ,
%_; ,
%_; (xmlnode-children) ,
%_/Dictionary :
%_/XMLNode :
%_/Array :
%_; (xmlnode-children) ,
%_/Dictionary :
%_; (xmlnode-attributes) ,
%_2 /Int (xmlnode-nodetype) ,
%_(&ns_sfw;) /String (xmlnode-nodevalue) ,
%_(xmlns) /String (xmlnode-nodename) ,
%_; (xmlns) ,
%_; (xmlnode-attributes) ,
%_1 /Int (xmlnode-nodetype) ,
%_ /String (xmlnode-nodevalue) ,
%_(sfw) /String (xmlnode-nodename) ,
%_; ,
%_; (xmlnode-children) ,
%_/Dictionary :
%_; (xmlnode-attributes) ,
%_1 /Int (xmlnode-nodetype) ,
%_ /String (xmlnode-nodevalue) ,
%_(metadata) /String (xmlnode-nodename) ,
%_; ,
%_; (xmlnode-children) ,
%_/Dictionary :
%_; (xmlnode-attributes) ,
%_9 /Int (xmlnode-nodetype) ,
%_ /String (xmlnode-nodevalue) ,
%_(#document) /String (xmlnode-nodename) ,
%_; (#document) ,
%_; /Recorded ,
%_/Dictionary : /NotRecorded ,
%_1 /Bool (AI15 Document PixelPerfect) ,
%_1 /Int (AI9 Document Setup panel) ,
%_1 /Bool (AI20 Document PixelPerfect) ,
%_1 /Bool (SnapWhileMoving_segments) ,
%_1 /Bool (SnapWhileMoving_anchorPoints) ,
%_(PDFDocumentVerifier) /String (Document_Validation_Type_Key) ,
%_14 /Int (AI11 Document Setup Language Popup) ,
%_1 /Bool (PerspectiveGrid_Snap) ,
%_1 /Bool (SnapWhileDrawing) ,
%_0 /Bool (AISaveMultipleArtboards) ,
%_1 /Bool (SnapWhileMoving_paths) ,
%_1 /Bool (SnapWhileScaling) ,
%_/Dictionary : /NotRecorded ,
%_0 /Int (/attributes/inklst.count) ,
%_; (AI11 Ink List Dict) ,
%_/Dictionary : /NotRecorded ,
%_1 /Int (/attributes/AI11PDF_ColorDownsampleKind) ,
%_75 /Int (/attributes/AI10 flattener raster-vector balance) ,
%_6 /Real (/attributes/AI11PDF_OffsetFromArtworkTop) ,
%_1 /Int (/attributes/AI12PDF_OutputIntentProfileNamePolicy) ,
%_ /String (/attributes/AI12PDF_OutputIntentProfileName) ,
%_225 /Int (/attributes/AI11PDF_ColorDownsampleImageAbove) ,
%_1 /Int (/attributes/AI11PDF_PreserveAcrobatLayers) ,
%_300 /Int (/attributes/AI11PDF_MonochromeDownsampleResolution) ,
%_1 /Int (/attributes/AI11PDF_ColorCompressionQuality) ,
%_([Medium Resolution]) /String (/attributes/AI11PDF_FlatteningPresetName) ,
%_ /String (/attributes/AI12PDF_OutputConditionIdentifier) ,
%_6 /Real (/attributes/AI11PDF_OffsetFromArtworkRight) ,
%_150 /Int (/attributes/AI11PDF_GrayDownsampleResolution) ,
%_4 /Int (/attributes/AI11PDF_MonochromeCompressionKind) ,
%_1 /Int (/attributes/AI12PDF_ColorConversionPolicy) ,
%_6 /Int (/attributes/AI11PDF_ColorCompressionKind) ,
%_225 /Int (/attributes/AI11PDF_GrayDownsampleImageAbove) ,
%_6 /Real (/attributes/AI11PDF_OffsetFromArtworkLeft) ,
%_1 /Int (/attributes/AI10 flattener clip complex regions) ,
%_150 /Real (/attributes/AI9 Mesh Rasterization Resolution) ,
%_450 /Int (/attributes/AI11PDF_MonoDownsampleImageAbove) ,
%_1 /Int (/attributes/AI10 flattener outline strokes) ,
%_1 /Int (/attributes/AI11PDF_GrayCompressionQuality) ,
%_150 /Int (/attributes/AI11PDF_ColorDownsampleResolution) ,
%_1 /Int (/attributes/AI11PDF_MonochromeDownsampleKind) ,
%_6 /Real (/attributes/AI11PDF_OffsetFromArtworkBottom) ,
%_300 /Real (/attributes/AI9 Output Rasterization Resolution) ,
%_1 /Int (/attributes/AI12PDF_ProfileInclusionPolicy) ,
%_1 /Int (/attributes/AI11PDF_PreserveIllustratorEditingCapabilities) ,
%_0 /Int (/attributes/AI11PDF_PageInfo) ,
%_6 /Int (/attributes/AI11PDF_GrayCompressionKind) ,
%_1 /Int (/attributes/AI11PDF_CompressArt) ,
%_0 /Real (/attributes/AI11PDF_BleedRight) ,
%_4 /Int (/attributes/AI11PDF_Compatibility) ,
%_0 /Real (/attributes/AI11PDF_BleedBottom) ,
%_0 /Int (/attributes/AI12PDF_UsePrintTiling) ,
%_0 /Int (/attributes/AI11PDF_ColorBars) ,
%_1 /Int (/attributes/AI11PDF_Overprint) ,
%_0 /Int (/attributes/AI11PDF_TrimMarks) ,
%_1 /Int (/attributes/AI11PDF_BleedLink) ,
%_0 /Int (/attributes/AI10 flattener outline text) ,
%_0 /Int (/attributes/AI12PDF_Trapped) ,
%_1 /Int (/attributes/AI14PDF_DocBleed) ,
%_ /String (/attributes/AI12PDF_RegistryName) ,
%_0 /Int (/attributes/AI11PDF_FlattenTransparency) ,
%_100 /Int (/attributes/AI11PDF_SubsetFontRatio) ,
%_1 /Int (/attributes/AI11PDF_GenerateThumbnails) ,
%_256 /Int (/attributes/AI11PDF_ColorTileSize) ,
%_0 /Int (/attributes/AI11PDF_PrinterMarkType) ,
%_0 /Int (/attributes/AI11PDF_FastWebView) ,
%_0 /Real (/attributes/AI11PDF_BleedTop) ,
%_(These are the default settings when saving an Illu)
%_(strator file as an Adobe PDF document. Use these s)
%_(ettings when you plan on editing the file again in)
%_( Illustrator, or when you need to place it in a la)
%_(yout application such as InDesign, or when the fin)
%_(al use of the file is unknown.) /String (/attributes/AI12PDF_Description) ,
%_0 /Int (/attributes/AI16 flattener anti alias) ,
%_256 /Int (/attributes/AI11PDF_GrayTileSize) ,
%_1 /Int (/attributes/AI11PDF_GrayDownsampleKind) ,
%_0 /Int (/attributes/AI11PDF_RegMarks) ,
%_1 /Int (/attributes/AI12PDF_Standard) ,
%_0 /Real (/attributes/AI11PDF_BleedLeft) ,
%_([Illustrator Default]) /String (/attributes/collectionName) ,
%_ /String (/attributes/AI12PDF_DestinationName) ,
%_1 /Int (/attributes/AI12PDF_DestinationPolicy) ,
%_0.25 /Real (/attributes/AI11PDF_TrimMarkWeight) ,
%_ /String (/attributes/AI12PDF_OutputCondition) ,
%_; (PDFPresetCollection) ,
%_1 /Int (AI11 EPS Overprints) ,
%_1 /Int (AI12 AI Overprints) ,
%_/Dictionary : /NotRecorded ,
%_0 /Int (/attributes/job.collate) ,
%_1 /Int (/attributes/job.printallartboards) ,
%_0 /Int (/attributes/job.skipblank) ,
%_ /String (/attributes/job.pagerange) ,
%_1 /Int (/attributes/job.printall) ,
%_ /String (/attributes/job.artboardrange) ,
%_0 /Int (/attributes/job.reverseorder) ,
%_; (AI11 Print JobInfo Dict) ,
%_1 /Bool (AI12 AI Outline Strokes) ,
%_0 /Bool (AI11 EPS Outline Text) ,
%_0 /Bool (AI16 AI Anti Aliasing) ,
%_0 /Bool (AI16 EPS Anti Aliasing) ,
%_0 /Bool (AI12 AI Outline Text) ,
%_1 /Bool (AI11 EPS Outline Strokes) ,
%_150 /Real (AI12 AI Gradient and Mesh Resolution) ,
%_150 /Real (AI11 EPS Gradient and Mesh Resolution) ,
%_75 /Int (AI11 EPS Raster/Vector Balance) ,
%_300 /Real (AI11 EPS Line Art and Text Resolution) ,
%_([Medium Resolution]) /String (AI11 EPS Flattener Preset Name) ,
%_300 /Real (AI12 AI Line Art and Text Resolution) ,
%_1 /Bool (AI11 EPS Clip Complex Regions) ,
%_([Medium Resolution]) /String (AI12 AI Flattener Preset Name) ,
%_1 /Bool (AI9 no overprint in composite) ,
%_75 /Int (AI12 AI Raster/Vector Balance) ,
%_1 /Bool (AI12 AI Clip Complex Regions) ,
%_/Dictionary : /NotRecorded ,
%_150 /Int (/attributes/xp.gresolution) ,
%_0 /Int (/attributes/xp.antialiasing) ,
%_1 /Int (/attributes/xp.convertstroke) ,
%_0 /Int (/attributes/xp.converttext) ,
%_2 /Int (/attributes/cm.inteint) ,
%_(sRGB IEC61966-2.1) /String (/attributes/cm.profile) ,
%_1 /Int (/attributes/cm.mode) ,
%_ /String (/attributes/rdrs.annot) ,
%_ /String (/attributes/rdrs.custom) ,
%_0 /Int (/attributes/rdrs.func) ,
%_1 /Int (/attributes/ps.binary) ,
%_841.8898 /Real (/attributes/ppr.height) ,
%_0 /Int (/attributes/ps.contone) ,
%_0 /Int (/attributes/clr.mode) ,
%_ /String (/attributes/job.name) ,
%_0 /Int (/attributes/xp.opco) ,
%_75 /Int (/attributes/xp.balance) ,
%_0 /Int (/attributes/crd.scplcy) ,
%_0 /Int (/attributes/pgmk.style) ,
%_0 /Real (/attributes/crd.org.h) ,
%_0 /Int (/attributes/xp.opse) ,
%_([Medium Resolution]) /String (/attributes/xp.name) ,
%_(Defined by Driver) /String (/attributes/ppr.name) ,
%_0 /Int (/attributes/ppr.custom) ,
%_1 /Real (/attributes/ps.flatness) ,
%_0 /Int (/attributes/cppr.trans) ,
%_1 /Int (/attributes/crd.sccnst) ,
%_0 /Int (/attributes/pgmk.bleed) ,
%_100 /Real (/attributes/crd.scale.v) ,
%_0 /Int (/attributes/ps.l1compat) ,
%_0 /Real (/attributes/cppr.height) ,
%_0 /Real (/attributes/cppr.width) ,
%_3 /Int (/attributes/ps.level) ,
%_1 /Int (/attributes/xp.clip) ,
%_100 /Real (/attributes/crd.scale.h) ,
%_1 /Int (/attributes/fnt.dlmode) ,
%_0 /Real (/attributes/crd.org.v) ,
%_595.2756 /Real (/attributes/ppr.width) ,
%_300 /Real (/attributes/ps.shaderes) ,
%_0 /Int (/attributes/pgmk.crop) ,
%_0 /Int (/attributes/ps.negative) ,
%_0 /Int (/attributes/fnt.subst) ,
%_0 /Int (/attributes/xp.opdu) ,
%_1 /Int (/attributes/ppr.default) ,
%_0 /Int (/attributes/crd.tiling) ,
%_0 /Int (/attributes/fnt.dlprfonts) ,
%_6 /Real (/attributes/pgmk.marksoff.top) ,
%_0 /Int (/attributes/pgmk.registration) ,
%_0 /Int (/attributes/pgmk.pageinfo) ,
%_0 /Int (/attributes/ps.compression) ,
%_0.25 /Real (/attributes/pgmk.deflinewidth) ,
%_0 /Real (/attributes/pgmk.bleedoff.bottom) ,
%_0 /Real (/attributes/pgmk.bleedoff.right) ,
%_6 /Real (/attributes/pgmk.marksoff.left) ,
%_ /String (/attributes/pgmk.jobtitle) ,
%_ /String (/attributes/pgmk.customfile) ,
%_1 /Int (/attributes/pgmk.bleedoff.useDocBleeds) ,
%_0 /Int (/attributes/pgmk.enabled) ,
%_6 /Real (/attributes/pgmk.marksoff.bottom) ,
%_6 /Real (/attributes/pgmk.marksoff.right) ,
%_0 /Real (/attributes/pgmk.bleedoff.top) ,
%_0 /Real (/attributes/crd.overlap.v) ,
%_0 /Real (/attributes/pgmk.bleedoff.left) ,
%_300 /Int (/attributes/xp.rresolution) ,
%_0 /Int (/attributes/ps.setflatness) ,
%_0 /Int (/attributes/pgmk.colorbars) ,
%_0 /Real (/attributes/crd.overlap.h) ,
%_832.56 /Real (/attributes/ppr.image.bottom) ,
%_0 /Int (/attributes/crd.fliphorz) ,
%_9.36 /Real (/attributes/ppr.image.left) ,
%_ /String (/attributes/stl.ppdmodelname) ,
%_0 /Real (/attributes/cppr.woffset) ,
%_ /String (/attributes/stl.printername) ,
%_9.36 /Real (/attributes/ppr.image.top) ,
%_0 /Int (/attributes/job.designation) ,
%_ /String (/attributes/stl.customppd) ,
%_2 /Int (/attributes/job.printbounds) ,
%_1 /Int (/attributes/stl.defaultppd) ,
%_5 /Int (/attributes/crd.position) ,
%_0 /Real (/attributes/cppr.hoffset) ,
%_0 /Int (/attributes/job.printasbitmap) ,
%_([Default Web/Video/Mobile]) /String (/attributes/collectionName) ,
%_1 /Int (/attributes/stl.defaultprinter) ,
%_0 /Int (/attributes/clr.overprintblack) ,
%_0 /Int (/attributes/crd.orientation) ,
%_0 /Int (/attributes/clr.convertspots) ,
%_0 /Int (/attributes/job.bitmapresolution) ,
%_0 /Int (/attributes/job.printofile) ,
%_585.96 /Real (/attributes/ppr.image.right) ,
%_0 /Int (/attributes/cm.preserveother) ,
%_1 /Real (/attributes/rdrs.flatteness) ,
%_0 /Int (/attributes/rdrs.enabled) ,
%_2 /Int (/attributes/xp.suppresswhiteop) ,
%_1 /Int (/attributes/cm.preservecmyk) ,
%_; (AI11 Print Attribute Dict) ,
%_20 /Real (AIDocumentArtboardsSpacingDictKey) ,
%_; /NotRecorded ,
%_;
%AI9_EndDocumentData
%%EndSetup
%AI5_BeginLayer
1 1 1 1 0 0 1 0 79 128 255 0 50 0 Lb
(Layer 1) Ln
%_/ArtDictionary :
%_/XMLUID : (Layer_1) ; (AI10_ArtUID) ,
%_;
%_
0 A
0 Xw
LB
%AI5_EndLayer--
%%PageTrailer
gsave annotatepage grestore showpage
%%Trailer
%%EOF
