%!PS-Adobe-3.0 
%%Creator: Adobe Illustrator(R) 24.0
%%AI8_CreatorVersion: 28.7.1
%%For: (MANPREET) ()
%%Title: (style_state.ai)
%%CreationDate: 8/1/2025 9:38 AM
%%Canvassize: 16383
%%BoundingBox: 599 -598 1086 -314
%%HiResBoundingBox: 599 -598 1086 -314
%%DocumentProcessColors: Cyan Magenta Yellow Black
%AI5_FileFormat 14.0
%AI12_BuildNumber: 142
%AI3_ColorUsage: Color
%AI7_ImageSettings: 0
%%RGBProcessColor: 0 0 0 ([Registration])
%AI3_Cropmarks: 0 -1080 1920 0
%AI3_TemplateBox: 960.5 -540.5 960.5 -540.5
%AI3_TileBox: 564 -846 1356 -234
%AI3_DocumentPreview: None
%AI5_ArtSize: 14400 14400
%AI5_RulerUnits: 6
%AI24_LargeCanvasScale: 1
%AI9_ColorModel: 1
%AI5_ArtFlags: 0 0 0 1 0 0 1 0 0
%AI5_TargetResolution: 800
%AI5_NumLayers: 1
%AI17_Begin_Content_if_version_gt:24 4
%AI10_OpenToVie: -58 80 0.77 0 0 0 1576 940 18 0 0 46 87 0 0 0 1 1 0 1 1 0 1
%AI17_Alternate_Content
%AI9_OpenToView: -58 80 0.77 1576 940 18 0 0 46 87 0 0 0 1 1 0 1 1 0 1
%AI17_End_Versioned_Content
%AI5_OpenViewLayers: 7
%AI17_Begin_Content_if_version_gt:24 4
%AI17_Alternate_Content
%AI17_End_Versioned_Content
%%PageOrigin:560 -840
%AI7_GridSettings: 72 8 72 8 1 0 0.800000011920929 0.800000011920929 0.800000011920929 0.899999976158142 0.899999976158142 0.899999976158142
%AI9_Flatten: 1
%AI12_CMSettings: 00.MS
%%EndComments
%%BeginProlog
%%EndProlog
%%BeginSetup
%%EndSetup
%AI5_BeginLayer
1 1 1 1 0 0 1 0 79 128 255 0 50 0 Lb
(Layer 1) Ln
0 AE
%_/ArtDictionary :
%_/XMLUID : (Layer_1) ; (AI10_ArtUID) ,
%_;
%_
0 0 0 0 1 0 0 Xa
100 -100 m
100 -300 L
500 -300 L
f
100 -300 m
100 -500 L
500 -500 L
f
%AI5_EndLayer--
%%PageTrailer
gsave annotatepage grestore showpage
%%Trailer
%%EOF
