%%Creator: Adobe Illustrator(R) 11.0
%%AI8_CreatorVersion: 26.1.0
%%For: (Adam Belis) ()
%%Title: (ill export10 .ai)
%%CreationDate: 10/26/2022 1:47 PM
%%Canvassize: 16383
%%BoundingBox: 595 -789 1444 -219
%%HiResBoundingBox: 595.375 -789 1443.8516 -219.4556
%%DocumentProcessColors: Cyan Magenta Yellow Black
%AI5_FileFormat 7.0
%AI3_ColorUsage: Color
%AI7_ImageSettings: 0
%%RGBProcessColor: 0 0 0 ([Registration])
%AI3_TemplateBox: 960.5 -540.5 960.5 -540.5
%AI3_TileBox: 539.13 -837.6 1380.99 -242.58
%AI3_DocumentPreview: None
%AI5_ArtSize: 14400 14400
%AI5_RulerUnits: 6
%AI9_ColorModel: 1
%AI5_ArtFlags: 0 0 0 1 0 0 1 0 0
%AI5_TargetResolution: 800
%AI5_NumLayers: 1
%AI9_OpenToView: -186.0811 181.1351 0.74 1510 1074 18 0 0 46 121 0 0 1 1 1 0 1
%AI5_OpenViewLayers: 7
%%PageOrigin:560 -840
%AI7_GridSettings: 72 8 72 8 1 0 0.8 0.8 0.8 0.9 0.9 0.9
%AI9_Flatten: 1
%AI12_CMSettings: 00.MS
%%EndComments
