%AI5_BeginLayer
1 1 1 1 0 0 1 0 79 128 255 0 50 0 Lb
(Layer 1) Ln
0 AE
%_/ArtDictionary :
%_/XMLUID : (Layer_1) ; (AI10_ArtUID) ,
%_;
%_
0 A
0 Xw
1 Ap
4 As
0 D
0 O
0 0.993347048759461 1 0 k
0 R
0 0 0 1 K
0 1 0 0 0 Xy
0 J 0 j 1 w 10 M []0 d
0 XR
418 -308 m
174 -308 L
174 -128 L
418 -128 L
418 -308 L
b
%_/ArtDictionary :
%_1 /Bool (PATH_IS_KAPPA_CURVE) ,
%_/Dictionary :
%_(ai::Rectangle) /UnicodeString (ai::LiveShape::HandlerName) ,
%_/Dictionary :
%_3 /Int (ai::Rectangle::InitialQuadrant) ,
%_1 /Bool (ai::Rectangle::Clockwise) ,
%_(Invalid) /UnicodeString (ai::Rectangle::RoundingType::3) ,
%_(Invalid) /UnicodeString (ai::Rectangle::CornerType::1) ,
%_(Invalid) /UnicodeString (ai::Rectangle::RoundingType::2) ,
%_0 /Real (ai::Rectangle::CornerRadius::2) ,
%_(Invalid) /UnicodeString (ai::Rectangle::RoundingType::0) ,
%_(Invalid) /UnicodeString (ai::Rectangle::CornerType::2) ,
%_0 /Real (ai::Rectangle::CornerRadius::0) ,
%_0 /Real (ai::Rectangle::CornerRadius::1) ,
%_(Invalid) /UnicodeString (ai::Rectangle::CornerType::0) ,
%_(Invalid) /UnicodeString (ai::Rectangle::CornerType::3) ,
%_0 /Real (ai::Rectangle::CornerRadius::3) ,
%_(Invalid) /UnicodeString (ai::Rectangle::RoundingType::1) ,
%_8189 /Real (ai::Rectangle::CenterX) ,
%_7988 /Real (ai::Rectangle::CenterY) ,
%_180 /Real (ai::Rectangle::Height) ,
%_0 /Real (ai::Rectangle::Angle) ,
%_244 /Real (ai::Rectangle::Width) ,
%_; (ai::LiveShape::Params) ,
%_; (ai::LiveShape) ,
%_;
%_
LB
%AI5_EndLayer--
