<svg xmlns="http://www.w3.org/2000/svg" xmlns:svg="http://www.w3.org/2000/svg"
    xmlns:xlink="http://www.w3.org/1999/xlink"
    xmlns:sodipodi="http://sodipodi.sourceforge.net/DTD/sodipodi-0.dtd"
    xmlns:inkscape="http://www.inkscape.org/namespaces/inkscape" viewBox="284.0 0.0 310.0 310.0"
    width="310.0" height="310.0">
    <defs>
        <clipPath id="clip-path0-g8555">
            <use xlink:href="#path5815"
                transform="matrix(-1 -1.22465e-16 1.22465e-16 -1 508 607.722)" />
        </clipPath>
        <clipPath id="clip-path0-g9603">
            <use xlink:href="#rect5392" transform="translate(1069.01, 878.17)" />
        </clipPath>
        <linearGradient x1="0" y1="0" x2="1" y2="0"
            gradientTransform="matrix(316 0 0 110 3039.42 240.122)" gradientUnits="userSpaceOnUse"
            id="linearGradient4306">
            <stop offset="0.0" style="stop-color:#f0c2ff;stop-opacity:1.0" />
            <stop offset="0.5" style="stop-color:#ce72ed;stop-opacity:1.0" />
            <stop offset="1.0" style="stop-color:#ad23dc;stop-opacity:1.0" />
        </linearGradient>
    </defs>
    <sodipodi:namedview guidecolor="#0080dc" guideopacity="0.8000000715255737">
        <inkscape:page x="0" y="0" width="310.0" height="310.0" inkscape:label="Artboard1" />
        <inkscape:page width="316.0" height="316.0" x="395.0" y="175.0" inkscape:label="Artboard2" />
        <inkscape:page width="190.91883092036784" height="190.91883092036784"
            x="-249.45941546018392" y="59.54058453981608" inkscape:label="Curve Artboard" />
        <inkscape:page width="316.00000000000006" height="316.0" x="116.99999999999994" y="576.0"
            inkscape:label="Artboard3" />
        <inkscape:page width="316.0" height="316.0" x="-284.0" y="395.0" inkscape:label="Artboard3" />
        <sodipodi:guide position="178.25,0" orientation="1,0" />
        <sodipodi:guide position="248.75,0" orientation="1,0" />
        <sodipodi:guide position="0,-97.75" orientation="0,1" />
        <sodipodi:guide position="0,-168.25" orientation="0,1" />
        <inkscape:page width="193.00000000000006" height="96.0" x="116.99999999999994" y="395.0"
            inkscape:label="Guides" />
        <inkscape:page width="315.99999999999955" height="110.0" x="395.00000000000045" y="0.0"
            inkscape:label="Gradient Artboard" />
    </sodipodi:namedview>
    <rect x="54.0" y="176.0" width="310.0" height="310.0" rx="0.0" inkscape:label="Artboard1"
        style="fill:none;fill-opacity:1.0;stroke:none;stroke-opacity:1.0;opacity:1.0"
        transform="translate(230, -176)" />
    <rect x="444.0" y="-85.0" width="316.0" height="316.0" rx="0.0" inkscape:label="Artboard2"
        style="fill:none;fill-opacity:1.0;stroke:none;stroke-opacity:1.0;opacity:1.0"
        transform="translate(235, 260)" />
    <path
        d="M 225.459 155 C 225.459 186.82 161.82 250.459 130 250.459 C 98.1802 250.459 34.5406 186.82 34.5406 155 C 34.5406 123.18 98.1802 59.5406 130 59.5406 C 161.82 59.5406 225.459 123.18 225.459 155 Z"
        inkscape:label="Curve Artboard"
        style="fill:#9587cf;fill-opacity:1.0;stroke:none;stroke-opacity:1.0;opacity:1.0"
        id="path5815" />
    <rect x="348.0" y="438.2222222222223" width="60.0" height="28.999999999999943"
        rx="14.499999999999972"
        style="fill:#ffffff;fill-opacity:1.0;stroke:none;stroke-opacity:1.0;opacity:1.0"
        clip-path="url(#clip-path0-g8555)"
        transform="matrix(-1 1.22465e-16 -1.22465e-16 -1 508 607.722)" />
    <rect x="392.0" y="510.0" width="316.0" height="316.0" rx="0.0" inkscape:label="Artboard3"
        style="fill:none;fill-opacity:1.0;stroke:none;stroke-opacity:1.0;opacity:1.0"
        transform="translate(9, 66)" />
    <rect x="392.0" y="510.0" width="316.0" height="316.0" rx="0.0" inkscape:label="Artboard3"
        style="fill:none;fill-opacity:1.0;stroke:none;stroke-opacity:1.0;opacity:1.0"
        transform="translate(-392, -115)" />
    <rect x="766.0" y="601.0" width="193.0" height="96.0" rx="0.0" inkscape:label="Guides"
        style="fill:#ffffff;fill-opacity:1.0;stroke:none;stroke-opacity:1.0;opacity:1.0"
        id="rect5392" transform="translate(-365, -206)" />
    <ellipse cx="1566.51" cy="1321.1699999999998" rx="35.25" ry="35.25"
        style="fill:#904cff;fill-opacity:0.7517730593681335;stroke:none;stroke-opacity:1.0;opacity:1.0"
        clip-path="url(#clip-path0-g9603)" transform="translate(-1069.01, -878.17)" />
    <rect x="3039.421052631573" y="185.12195121951217" width="315.9999999999991"
        height="109.99999999999997" rx="0.0" inkscape:label="Gradient Artboard"
        style="fill:url(#linearGradient4306);fill-opacity:1.0;stroke:none;stroke-opacity:1.0;opacity:1.0"
        transform="translate(-2360.42, -185.122)" />
    <title>artboards_and_guides.svg</title>
</svg>