<svg xmlns="http://www.w3.org/2000/svg" xmlns:svg="http://www.w3.org/2000/svg"
    xmlns:xlink="http://www.w3.org/1999/xlink"
    xmlns:sodipodi="http://sodipodi.sourceforge.net/DTD/sodipodi-0.dtd"
    xmlns:inkscape="http://www.inkscape.org/namespaces/inkscape" viewBox="0.0 0.0 1280.0 800.0"
    width="1280.0" height="800.0">
    <sodipodi:namedview guidecolor="#0080dc" guideopacity="0.8000000715255737" />
    <defs>
        <clipPath id="clip-path0-g8555">
            <use xlink:href="#rect5815" />
        </clipPath>
        <mask id="mask-g8555">
            <g style="opacity:1.0;fill:#ffffff;stroke:#ffffff" transform="translate(-39, -3.5)">
                <rect x="348.7370689655172" y="216.0" width="362.0" height="375.0" rx="0.0"
                    style="fill-opacity:1.0;stroke-opacity:1.0" transform="translate(86.2629, 0)" />
            </g>
        </mask>
        <clipPath id="clip-path0-g9603">
            <use xlink:href="#polygon5392" transform="translate(-15.5, 71.5)" />
        </clipPath>
    </defs>
    <rect x="84.46788990825686" y="195.0498687664042" width="593.9999999999999" height="509.0"
        rx="0.0" style="fill:#eb3747;fill-opacity:1.0;stroke:none;stroke-opacity:1.0;opacity:1.0"
        id="rect5815" transform="translate(258.532, -49.5499)" />
    <g style="opacity:1.0" id="g8555" clip-path="url(#clip-path0-g8555)" mask="url(#mask-g8555)">
        <polygon points="640,212.5 872,587.5 408,587.5 640,212.5"
            style="fill:#00ffaa;fill-opacity:1.0;stroke:none;stroke-opacity:1.0" id="polygon5392" />
        <ellipse cx="624.5" cy="479.5" rx="145.5" ry="145.5"
            style="fill:#1c9efc;fill-opacity:1.0;stroke:none;stroke-opacity:1.0;opacity:1.0"
            clip-path="url(#clip-path0-g9603)" transform="translate(15.5, -71.5)" />
    </g>
    <title>vector_crop.svg</title>
</svg>