{
  "Actor": {
    "types": ["character", "npc", "zeppelin"],
    "templates": {
      "base": {
        "health": {
          "value": 9,
          "min": 0,
          "max": 9
        },
        "power": {
          "value": 9,
          "min": 0,
          "max": 9
        },
        "mind": {
          "value": 9,
          "min": 0,
          "max": 9
        },
        "psyche": {
          "value": 9,
          "min": 0,
          "max": 9
        },        
        "biography": "",
        "origin":"",
        "job":"",
        "sexe":"homme",
        "reroll": {
          "achievement": {
            "label": "COGS.Achievement",
            "value": 7,
            "min": 1,
            "max": 16
          },
          "conservation": {
            "label": "COGS.Conservation",
            "value": 7,
            "min": 1,
            "max": 16
          }
       }
      }
    },  
    "character": {
      "templates": ["base"],
      "attributes": {
        "experience": {
          "value": 0
        }
      },
      "skills": {
        "physical": {
          "label": "COGS.SkillType.Physical",
          "data": {
            "AtleticsSkill": {
                "label":"COGS.AtleticsSkill",
                "value": 0,
                "min": 0,
                "max": 10,
                "spent":0
              },
            "DrivingSkill": {
                "label":"COGS.DrivingSkill",
                "value": 0,
                "min": 0,
                "max": 10,
                "spent":0
              },
            "FencingSkill": {
                "label":"COGS.FencingSkill",
                "value": 0,
                "min": 0,
                "max": 10,
                "spent":0
              },
            "BrawlSkill": {
                "label":"COGS.BrawlSkill",
                "value": 0,
                "min": 0,
                "max": 10,
                "spent":0
              },
            "ShootSkill": {
                "label":"COGS.ShootSkill",
                "value": 0,
                "min": 0,
                "max": 10,
                "spent":0
              }
          }
        },
        "mental": {
          "label": "COGS.SkillType.Mental",
          "data": {
            "AnthropoMechanicologySkill": {
              "label":"COGS.AnthropoMechanicologySkill",
              "value": 0,
              "min": 0,
              "max": 10,
              "spent":0
            },
            "EcrymologySkill":{
              "label":"COGS.EcrymologySkill",
              "value": 0,
              "min": 0,
                "max": 10,
                "spent":0
            },
            "TraumatologySkill": {
              "label":"COGS.TraumatologySkill",
              "value": 0,
              "min": 0,
                "max": 10,
                "spent":0
            },
            "TraversologySkill":{
              "label":"COGS.TraversologySkill",
              "value": 0,
              "min": 0,
                "max": 10,
                "spent":0
            },
            "UrbatechnologySkill":{
              "label":"COGS.UrbatechnologySkill",
              "value": 0,
              "min": 0,
                "max": 10,
                "spent":0
            }
          }
        },
        "social": {
          "label": "COGS.SkillType.Social",
          "data": {  
            "QuibbleSkill":{
              "label":"COGS.QuibbleSkill",
              "value": 0,
              "min": 0,
                "max": 10,
                "spent":0
            },
            "CreativitySkill":{
              "label":"COGS.CreativitySkill",
              "value": 0,
              "min": 0,
                "max": 10,
                "spent":0
            },
            "LoquacitySkill":{
              "label":"COGS.LoquacitySkill",
              "value": 0,
              "min": 0,
                "max": 10,
                "spent":0
            },
            "SkulduggerySkill":{
              "label":"COGS.SkulduggerySkill",
              "value": 0,
              "min": 0,
                "max": 10,
                "spent":0
            },
            "PerformanceSkill":{
              "label":"COGS.PerformanceSkill",
              "value": 0,
              "min": 0,
                "max": 10,
                "spent":0
            }
          }
        }
      },
      "cskills": {
        "label": "COGS.Cephalie",
        "notes": "",
        "data": {  
          "ElegieSkill":{
            "label":"COGS.ElegieSkill",
            "value": 0,
            "min": 0,
            "max": 10,
            "spent":0
          },
          "MekaneSkill":{
            "label":"COGS.MekaneSkill",
            "value": 0,
            "min": 0,
            "max": 10,
            "spent":0
          },
          "EntelechieSkill":{
            "label":"COGS.EntelechieSkill",
            "value": 0,
            "min": 0,
            "max": 10,
            "spent":0
          },
          "PsycheSkill":{
            "label":"COGS.PsycheSkill",
            "value": 0,
            "min": 0,
            "max": 10,
            "spent":0
          },
          "ScorieSkill":{
            "label":"COGS.ScorieSkill",
            "value": 0,
            "min": 0,
            "max": 10,
            "spent":0
          }
        }
      }
    },
    "npc": {
      "templates": ["base"],
      "cr": 0,
      "skillTypes": {
        "physical": {
          "label": "COGS.SkillType.Physical",
          "value": 0,
          "min": 0,
          "max": 10
        },
        "mental": {
          "label": "COGS.SkillType.Mental",
          "value": 0,
          "min": 0,
          "max": 10
        },
        "social": {
          "label": "COGS.SkillType.Social",
          "value": 0,
          "min": 0,
          "max": 10
        }
      },
      "reroll": {
        "achievement": {
          "label": "COGS.Achievement",
          "value": 7,
          "min": 1,
          "max": 16
        },
        "conservation": {
          "label": "COGS.Conservation",
          "value": 7,
          "min": 1,
          "max": 16
        }
      },
      "skills": {
        "physical": {
          "label": "COGS.SkillType.Physical",
          "value": 0,
          "min": 0,
          "max": 10,
          "data": {
            "AtleticsSkill": {
                "label":"COGS.AtleticsSkill",
                "value": 0
              },
            "DrivingSkill": {
                "label":"COGS.DrivingSkill",
                "value": 0
              },
            "FencingSkill": {
                "label":"COGS.FencingSkill",
                "value": 0
              },
            "BrawlSkill": {
                "label":"COGS.BrawlSkill",
                "value": 0
              },
            "ShootSkill": {
                "label":"COGS.ShootSkill",
                "value": 0
              }
          }
        },
        "mental": {
          "label": "COGS.SkillType.Mental",
          "value": 0,
          "min": 0,
          "max": 10,
          "data": {
            "AnthropoMechanicologySkill": {
              "label":"COGS.AnthropoMechanicologySkill",
              "value": 0
            },
            "EcrymologySkill":{
              "label":"COGS.EcrymologySkill",
              "value": 0
            },
            "TraumatologySkill": {
              "label":"COGS.TraumatologySkill",
              "value": 0
            },
            "TraversologySkill":{
              "label":"COGS.TraversologySkill",
              "value": 0
            },
            "UrbatechnologySkill":{
              "label":"COGS.UrbatechnologySkill",
              "value": 0
            }
          }
        },
        "social": {
          "label": "COGS.SkillType.Social",
          "value": 0,
          "min": 0,
          "max": 10,
          "data": {  
            "QuibbleSkill":{
              "label":"COGS.QuibbleSkill",
              "value": 0
            },
            "CreativitySkill":{
              "label":"COGS.CreativitySkill",
              "value": 0
            },
            "LoquacitySkill":{
              "label":"COGS.LoquacitySkill",
              "value": 0
            },
            "SkulduggerySkill":{
              "label":"COGS.SkulduggerySkill",
              "value": 0
            },
            "PerformanceSkill":{
              "label":"COGS.PerformanceSkill",
              "value": 0
            }
          }
        }
      },
      "cskills": {
        "label": "COGS.Cephalie",
        "notes": "",
        "data": {  
          "ElegieSkill":{
            "label":"COGS.ElegieSkill",
            "value": 0
          },
          "MekaneSkill":{
            "label":"COGS.MekaneSkill",
            "value": 0
          },
          "EntelechieSkill":{
            "label":"COGS.EntelechieSkill",
            "value": 0
          },
          "PsycheSkill":{
            "label":"COGS.PsycheSkill",
            "value": 0
          },
          "ScorieSkill":{
            "label":"COGS.ScorieSkill",
            "value": 0
          }
        }
      }
    },
    "reroll": {
      "achievement": {
        "label": "COGS.Achievement",
        "value": 7,
        "min": 1,
        "max": 16
      },
      "conservation": {
        "label": "COGS.Conservation",
        "value": 7,
        "min": 1,
        "max": 16
      }
    }
  },
  "Item": {
    "types": ["item", "trait", "weapon", "impact", "scar", "specialization","anence", "boheme","contact"],
    "templates": {
      "base": {
        "description": ""
      }
    },
    "item": {
      "templates": ["base"],
      "quantity": 1,
      "weight": 0
    },
    "trait": {
      "templates": ["base"],
      "category": "custom",
      "value": 1,
      "min": -2,
      "max": 2
    },
    "weapon": {
      "templates": ["base"],
      "effectLevel": 1
    },
    "specialization": {
      "templates": ["base"],
      "skill": ""
    },
    "impact": {
      "templates": ["base"],
      "skillType": "physical",
      "impactType": "mild",
      "value": 0
    },
    "scar": {
      "templates": ["base"],
      "skillType": "physical",
      "scarLevel": 1
    },
    "anence": {
      "templates": ["base"],
      "collective": false,
      "multiple": false,
      "improvements": ""
    },
    "boheme": {
      "templates": ["base"],
      "ideals": "",
      "political": ""
    },
    "contact": {
      "templates": ["base"],
      "attitude": "neutral",
      "organization": "",
      "location":""
    }
  }
}
