{
  "name": "Frontend",
  "description": "Client side for Platform-Name.",
  "full-description": "Client side of Platform-Name contains all the views e.g. admin, user and not authorized views.",
  "purpose": "Provide GUI enables access to the Platform-Name platform",
  "initial-release": "XX-XX-2020"
}
