{
  "name": "Platform-Name",
  "full-name": "Platform-Name - something something",
  "description": "Description ...Lorem ipsum dolor sit amet, consectetur adipiscing elit. Duis id viverra justo. Curabitur nulla libero, consequat non vestibulum eget, pulvinar sed turpis. Etiam et pharetra metus, ac convallis justo. Nunc ultricies porta orci. Praesent aliquam massa lectus, eget porttitor lectus ultricies sit amet. Etiam quis risus et nisl sodales vestibulum. In et luctus mi. Curabitur pretium consequat enim at rhoncus.",
  "current-version": "X.X.X",
  "components": [
    {
      "name": "XXXXX",
      "short-description": "Etiam et pharetra metus, ac convallis justo.",
      "link": "https://example.example.com"
    },
    {
      "name": "XXXXX",
      "short-description": "Etiam et pharetra metus, ac convallis justo.",
      "link": "https://example.example.com"
    },
    {
      "name": "XXXXX",
      "short-description": "Etiam et pharetra metus, ac convallis justo.",
      "link": "https://example.example.com"
    }
  ]
}
