('H:\\Documentos\\pasantia_renato\\GUI_biomec\\build\\GUI_biomec\\PKG-00.pkg',
 {'BINARY': 1,
  'DATA': 1,
  'EXECUTABLE': 1,
  'EXTENSION': 1,
  'PYMODULE': 1,
  'PYSOURCE': 1,
  'PYZ': 0,
  'SPLASH': 1},
 [('PYZ-00.pyz',
   'H:\\Documentos\\pasantia_renato\\GUI_biomec\\build\\GUI_biomec\\PYZ-00.pyz',
   'PYZ'),
  ('struct',
   'C:\\Users\\Taller\\AppData\\Local\\Programs\\Python\\Python38-32\\lib\\struct.pyo',
   'PYMODULE'),
  ('pyimod01_os_path',
   'h:\\documentos\\pasantia_renato\\gui_biomec\\gu\\lib\\site-packages\\PyInstaller\\loader\\pyimod01_os_path.pyc',
   'PYMODULE'),
  ('pyimod02_archive',
   'h:\\documentos\\pasantia_renato\\gui_biomec\\gu\\lib\\site-packages\\PyInstaller\\loader\\pyimod02_archive.pyc',
   'PYMODULE'),
  ('pyimod03_importers',
   'h:\\documentos\\pasantia_renato\\gui_biomec\\gu\\lib\\site-packages\\PyInstaller\\loader\\pyimod03_importers.pyc',
   'PYMODULE'),
  ('pyimod04_ctypes',
   'h:\\documentos\\pasantia_renato\\gui_biomec\\gu\\lib\\site-packages\\PyInstaller\\loader\\pyimod04_ctypes.pyc',
   'PYMODULE'),
  ('pyiboot01_bootstrap',
   'h:\\documentos\\pasantia_renato\\gui_biomec\\gu\\lib\\site-packages\\PyInstaller\\loader\\pyiboot01_bootstrap.py',
   'PYSOURCE'),
  ('pyi_rth_pkgutil',
   'H:\\Documentos\\pasantia_renato\\GUI_biomec\\GU\\Lib\\site-packages\\PyInstaller\\hooks\\rthooks\\pyi_rth_pkgutil.py',
   'PYSOURCE'),
  ('pyi_rth_multiprocessing',
   'H:\\Documentos\\pasantia_renato\\GUI_biomec\\GU\\Lib\\site-packages\\PyInstaller\\hooks\\rthooks\\pyi_rth_multiprocessing.py',
   'PYSOURCE'),
  ('pyi_rth_inspect',
   'H:\\Documentos\\pasantia_renato\\GUI_biomec\\GU\\Lib\\site-packages\\PyInstaller\\hooks\\rthooks\\pyi_rth_inspect.py',
   'PYSOURCE'),
  ('pyi_rth__tkinter',
   'H:\\Documentos\\pasantia_renato\\GUI_biomec\\GU\\Lib\\site-packages\\PyInstaller\\hooks\\rthooks\\pyi_rth__tkinter.py',
   'PYSOURCE'),
  ('pyi_rth_mplconfig',
   'H:\\Documentos\\pasantia_renato\\GUI_biomec\\GU\\Lib\\site-packages\\PyInstaller\\hooks\\rthooks\\pyi_rth_mplconfig.py',
   'PYSOURCE'),
  ('pyi_rth_pkgres',
   'H:\\Documentos\\pasantia_renato\\GUI_biomec\\GU\\Lib\\site-packages\\PyInstaller\\hooks\\rthooks\\pyi_rth_pkgres.py',
   'PYSOURCE'),
  ('pyi_rth_pyqt5',
   'H:\\Documentos\\pasantia_renato\\GUI_biomec\\GU\\Lib\\site-packages\\PyInstaller\\hooks\\rthooks\\pyi_rth_pyqt5.py',
   'PYSOURCE'),
  ('GUI_biomec',
   'H:\\Documentos\\pasantia_renato\\GUI_biomec\\GUI_biomec.py',
   'PYSOURCE'),
  ('GUI_biomec.exe.manifest',
   'H:\\Documentos\\pasantia_renato\\GUI_biomec\\build\\GUI_biomec\\GUI_biomec.exe.manifest',
   'BINARY')],
 True,
 False,
 False,
 [],
 None,
 None,
 None)
