<mxfile host="app.diagrams.net" modified="2022-03-07T18:41:33.036Z" agent="5.0 (X11; Linux x86_64) AppleWebKit/537.36 (KHTML, like Gecko) Chrome/98.0.4758.102 Safari/537.36" etag="momaGeLmdhaubp2riiHE" version="16.6.7" type="gitlab">
  <diagram id="EdwoHBalo2l-gQU6ZgVr" name="Page-1">
    <mxGraphModel dx="1422" dy="711" grid="1" gridSize="10" guides="1" tooltips="1" connect="1" arrows="1" fold="1" page="1" pageScale="1" pageWidth="850" pageHeight="1100" math="0" shadow="0">
      <root>
        <mxCell id="0" />
        <mxCell id="1" parent="0" />
        <mxCell id="hGWDthcUpm_Xo3dSXPEr-46" value="" style="fontColor=#0066CC;verticalAlign=top;verticalLabelPosition=bottom;labelPosition=center;align=center;html=1;outlineConnect=0;fillColor=#CCCCCC;strokeColor=#6881B3;gradientColor=none;gradientDirection=north;strokeWidth=2;shape=mxgraph.networks.pc;fontFamily=Ubuntu;fontSource=https%3A%2F%2Ffonts.googleapis.com%2Fcss%3Ffamily%3DUbuntu;fontSize=12;" vertex="1" parent="1">
          <mxGeometry x="137" y="189" width="168" height="110" as="geometry" />
        </mxCell>
        <mxCell id="hGWDthcUpm_Xo3dSXPEr-6" style="edgeStyle=orthogonalEdgeStyle;rounded=0;orthogonalLoop=1;jettySize=auto;html=1;exitX=1;exitY=0.5;exitDx=0;exitDy=0;exitPerimeter=0;fontFamily=Courier New;fontSize=23;endArrow=none;endFill=0;startArrow=none;" edge="1" parent="1" source="hGWDthcUpm_Xo3dSXPEr-5" target="hGWDthcUpm_Xo3dSXPEr-2">
          <mxGeometry relative="1" as="geometry" />
        </mxCell>
        <mxCell id="hGWDthcUpm_Xo3dSXPEr-7" value="" style="group" vertex="1" connectable="0" parent="1">
          <mxGeometry x="330" y="40" width="100" height="70" as="geometry" />
        </mxCell>
        <mxCell id="hGWDthcUpm_Xo3dSXPEr-2" value="" style="fontColor=#0066CC;verticalAlign=top;verticalLabelPosition=bottom;labelPosition=center;align=center;html=1;outlineConnect=0;fillColor=#CCCCCC;strokeColor=#6881B3;gradientColor=none;gradientDirection=north;strokeWidth=2;shape=mxgraph.networks.pc;" vertex="1" parent="hGWDthcUpm_Xo3dSXPEr-7">
          <mxGeometry x="32" width="100" height="70" as="geometry" />
        </mxCell>
        <mxCell id="hGWDthcUpm_Xo3dSXPEr-4" value="PC&lt;sub style=&quot;font-size: 23px&quot;&gt;B&lt;/sub&gt;" style="text;html=1;align=center;verticalAlign=middle;resizable=0;points=[];autosize=1;strokeColor=none;fillColor=none;fontSize=23;fontStyle=1;fontFamily=Ubuntu;fontSource=https%3A%2F%2Ffonts.googleapis.com%2Fcss%3Ffamily%3DUbuntu;" vertex="1" parent="hGWDthcUpm_Xo3dSXPEr-7">
          <mxGeometry x="62" y="10" width="60" height="40" as="geometry" />
        </mxCell>
        <mxCell id="hGWDthcUpm_Xo3dSXPEr-8" value="" style="group" vertex="1" connectable="0" parent="1">
          <mxGeometry x="80" y="40" width="100" height="70" as="geometry" />
        </mxCell>
        <mxCell id="hGWDthcUpm_Xo3dSXPEr-1" value="" style="fontColor=#0066CC;verticalAlign=top;verticalLabelPosition=bottom;labelPosition=center;align=center;html=1;outlineConnect=0;fillColor=#CCCCCC;strokeColor=#6881B3;gradientColor=none;gradientDirection=north;strokeWidth=2;shape=mxgraph.networks.pc;" vertex="1" parent="hGWDthcUpm_Xo3dSXPEr-8">
          <mxGeometry width="100" height="70" as="geometry" />
        </mxCell>
        <mxCell id="hGWDthcUpm_Xo3dSXPEr-3" value="PC&lt;sub style=&quot;font-size: 23px;&quot;&gt;A&lt;/sub&gt;" style="text;html=1;align=center;verticalAlign=middle;resizable=0;points=[];autosize=1;strokeColor=none;fillColor=none;fontSize=23;fontStyle=1;fontFamily=Ubuntu;fontSource=https%3A%2F%2Ffonts.googleapis.com%2Fcss%3Ffamily%3DUbuntu;" vertex="1" parent="hGWDthcUpm_Xo3dSXPEr-8">
          <mxGeometry x="30" y="10" width="60" height="40" as="geometry" />
        </mxCell>
        <mxCell id="hGWDthcUpm_Xo3dSXPEr-5" value="" style="sketch=0;points=[[0.015,0.015,0],[0.985,0.015,0],[0.985,0.985,0],[0.015,0.985,0],[0.25,0,0],[0.5,0,0],[0.75,0,0],[1,0.25,0],[1,0.5,0],[1,0.75,0],[0.75,1,0],[0.5,1,0],[0.25,1,0],[0,0.75,0],[0,0.5,0],[0,0.25,0]];verticalLabelPosition=bottom;html=1;verticalAlign=top;aspect=fixed;align=center;pointerEvents=1;shape=mxgraph.cisco19.rect;prIcon=l2_switch;fillColor=#FAFAFA;strokeColor=#005073;fontFamily=Courier New;fontSize=23;" vertex="1" parent="1">
          <mxGeometry x="240" y="45" width="60" height="60" as="geometry" />
        </mxCell>
        <mxCell id="hGWDthcUpm_Xo3dSXPEr-9" value="" style="edgeStyle=orthogonalEdgeStyle;rounded=0;orthogonalLoop=1;jettySize=auto;html=1;exitX=1;exitY=0.5;exitDx=0;exitDy=0;exitPerimeter=0;fontFamily=Courier New;fontSize=23;endArrow=none;endFill=0;" edge="1" parent="1" source="hGWDthcUpm_Xo3dSXPEr-1" target="hGWDthcUpm_Xo3dSXPEr-5">
          <mxGeometry relative="1" as="geometry">
            <mxPoint x="180" y="75" as="sourcePoint" />
            <mxPoint x="420" y="75" as="targetPoint" />
          </mxGeometry>
        </mxCell>
        <mxCell id="hGWDthcUpm_Xo3dSXPEr-10" value="IP&lt;sub&gt;A&lt;/sub&gt; = 192.168.1.100/24" style="text;html=1;align=center;verticalAlign=middle;resizable=0;points=[];autosize=1;strokeColor=none;fillColor=none;fontSize=14;fontFamily=Ubuntu;fontSource=https%3A%2F%2Ffonts.googleapis.com%2Fcss%3Ffamily%3DUbuntu;" vertex="1" parent="1">
          <mxGeometry x="50" y="120" width="160" height="30" as="geometry" />
        </mxCell>
        <mxCell id="hGWDthcUpm_Xo3dSXPEr-11" value="IP&lt;span style=&quot;font-size: 11.6667px&quot;&gt;B&lt;/span&gt;&amp;nbsp;= 192.168.1.101/24" style="text;html=1;align=center;verticalAlign=middle;resizable=0;points=[];autosize=1;strokeColor=none;fillColor=none;fontSize=14;fontFamily=Ubuntu;fontSource=https%3A%2F%2Ffonts.googleapis.com%2Fcss%3Ffamily%3DUbuntu;" vertex="1" parent="1">
          <mxGeometry x="334" y="125" width="160" height="20" as="geometry" />
        </mxCell>
        <mxCell id="hGWDthcUpm_Xo3dSXPEr-40" value="" style="shape=image;html=1;verticalAlign=top;verticalLabelPosition=bottom;labelBackgroundColor=#ffffff;imageAspect=0;aspect=fixed;image=https://cdn1.iconfinder.com/data/icons/bootstrap-vol-2/16/ethernet-128.png;fontFamily=Ubuntu;fontSource=https%3A%2F%2Ffonts.googleapis.com%2Fcss%3Ffamily%3DUbuntu;fontSize=12;imageBackground=none;" vertex="1" parent="1">
          <mxGeometry x="143" y="252" width="24" height="24" as="geometry" />
        </mxCell>
        <mxCell id="hGWDthcUpm_Xo3dSXPEr-44" value="enp2s0" style="text;html=1;align=center;verticalAlign=middle;resizable=0;points=[];autosize=1;fontSize=12;fontFamily=Ubuntu;fillColor=default;" vertex="1" parent="1">
          <mxGeometry x="80" y="253" width="60" height="20" as="geometry" />
        </mxCell>
        <mxCell id="hGWDthcUpm_Xo3dSXPEr-45" value="enp4s0" style="text;html=1;align=center;verticalAlign=middle;resizable=0;points=[];autosize=1;strokeColor=none;fillColor=default;fontSize=12;fontFamily=Ubuntu;" vertex="1" parent="1">
          <mxGeometry x="80" y="209" width="60" height="20" as="geometry" />
        </mxCell>
        <mxCell id="hGWDthcUpm_Xo3dSXPEr-41" value="" style="shape=image;html=1;verticalAlign=top;verticalLabelPosition=bottom;labelBackgroundColor=#ffffff;imageAspect=0;aspect=fixed;image=https://cdn1.iconfinder.com/data/icons/bootstrap-vol-2/16/ethernet-128.png;fontFamily=Ubuntu;fontSource=https%3A%2F%2Ffonts.googleapis.com%2Fcss%3Ffamily%3DUbuntu;fontSize=12;imageBackground=none;" vertex="1" parent="1">
          <mxGeometry x="142" y="208" width="24" height="24" as="geometry" />
        </mxCell>
        <mxCell id="hGWDthcUpm_Xo3dSXPEr-50" value="" style="fontColor=#0066CC;verticalAlign=top;verticalLabelPosition=bottom;labelPosition=center;align=center;html=1;outlineConnect=0;fillColor=#CCCCCC;strokeColor=#6881B3;gradientColor=none;gradientDirection=north;strokeWidth=2;shape=mxgraph.networks.pc;fontFamily=Ubuntu;fontSource=https%3A%2F%2Ffonts.googleapis.com%2Fcss%3Ffamily%3DUbuntu;fontSize=12;" vertex="1" parent="1">
          <mxGeometry x="208" y="370" width="168" height="110" as="geometry" />
        </mxCell>
        <mxCell id="hGWDthcUpm_Xo3dSXPEr-59" style="edgeStyle=orthogonalEdgeStyle;rounded=0;orthogonalLoop=1;jettySize=auto;html=1;exitX=0;exitY=0.5;exitDx=0;exitDy=0;entryX=1;entryY=0.75;entryDx=0;entryDy=0;entryPerimeter=0;fontFamily=Ubuntu;fontSource=https%3A%2F%2Ffonts.googleapis.com%2Fcss%3Ffamily%3DUbuntu;fontSize=12;endArrow=none;endFill=0;" edge="1" parent="1" source="hGWDthcUpm_Xo3dSXPEr-51" target="hGWDthcUpm_Xo3dSXPEr-57">
          <mxGeometry relative="1" as="geometry">
            <Array as="points">
              <mxPoint x="96" y="445" />
            </Array>
          </mxGeometry>
        </mxCell>
        <mxCell id="hGWDthcUpm_Xo3dSXPEr-51" value="" style="shape=image;html=1;verticalAlign=top;verticalLabelPosition=bottom;labelBackgroundColor=#ffffff;imageAspect=0;aspect=fixed;image=https://cdn1.iconfinder.com/data/icons/bootstrap-vol-2/16/ethernet-128.png;fontFamily=Ubuntu;fontSource=https%3A%2F%2Ffonts.googleapis.com%2Fcss%3Ffamily%3DUbuntu;fontSize=12;imageBackground=#009900;" vertex="1" parent="1">
          <mxGeometry x="214" y="433" width="24" height="24" as="geometry" />
        </mxCell>
        <mxCell id="hGWDthcUpm_Xo3dSXPEr-52" value="enp4s0" style="text;html=1;align=center;verticalAlign=middle;resizable=0;points=[];autosize=1;fontSize=12;fontFamily=Ubuntu;fillColor=none;" vertex="1" parent="1">
          <mxGeometry x="146" y="445" width="60" height="20" as="geometry" />
        </mxCell>
        <mxCell id="hGWDthcUpm_Xo3dSXPEr-53" value="enp2s0" style="text;html=1;align=center;verticalAlign=middle;resizable=0;points=[];autosize=1;strokeColor=none;fillColor=none;fontSize=12;fontFamily=Ubuntu;" vertex="1" parent="1">
          <mxGeometry x="146" y="381" width="60" height="20" as="geometry" />
        </mxCell>
        <mxCell id="hGWDthcUpm_Xo3dSXPEr-58" style="edgeStyle=orthogonalEdgeStyle;rounded=0;orthogonalLoop=1;jettySize=auto;html=1;exitX=0;exitY=0.5;exitDx=0;exitDy=0;entryX=1;entryY=0.25;entryDx=0;entryDy=0;entryPerimeter=0;fontFamily=Ubuntu;fontSource=https%3A%2F%2Ffonts.googleapis.com%2Fcss%3Ffamily%3DUbuntu;fontSize=12;endArrow=none;endFill=0;" edge="1" parent="1" source="hGWDthcUpm_Xo3dSXPEr-54" target="hGWDthcUpm_Xo3dSXPEr-57">
          <mxGeometry relative="1" as="geometry">
            <Array as="points">
              <mxPoint x="96" y="401" />
            </Array>
          </mxGeometry>
        </mxCell>
        <mxCell id="hGWDthcUpm_Xo3dSXPEr-54" value="" style="shape=image;html=1;verticalAlign=top;verticalLabelPosition=bottom;labelBackgroundColor=#ffffff;imageAspect=0;aspect=fixed;image=https://cdn1.iconfinder.com/data/icons/bootstrap-vol-2/16/ethernet-128.png;fontFamily=Ubuntu;fontSource=https%3A%2F%2Ffonts.googleapis.com%2Fcss%3Ffamily%3DUbuntu;fontSize=12;imageBackground=#FF8000;" vertex="1" parent="1">
          <mxGeometry x="213" y="389" width="24" height="24" as="geometry" />
        </mxCell>
        <mxCell id="hGWDthcUpm_Xo3dSXPEr-55" value="Diagrama equivalente:" style="text;html=1;align=left;verticalAlign=middle;resizable=0;points=[];autosize=1;strokeColor=none;fillColor=none;fontSize=12;fontFamily=Ubuntu;fontStyle=1" vertex="1" parent="1">
          <mxGeometry x="80" y="570" width="140" height="20" as="geometry" />
        </mxCell>
        <mxCell id="hGWDthcUpm_Xo3dSXPEr-56" value="Implementación Física:" style="text;html=1;align=left;verticalAlign=middle;resizable=0;points=[];autosize=1;strokeColor=none;fillColor=none;fontSize=12;fontFamily=Ubuntu;fontStyle=1" vertex="1" parent="1">
          <mxGeometry x="80" y="330" width="140" height="20" as="geometry" />
        </mxCell>
        <mxCell id="hGWDthcUpm_Xo3dSXPEr-57" value="" style="sketch=0;points=[[0.015,0.015,0],[0.985,0.015,0],[0.985,0.985,0],[0.015,0.985,0],[0.25,0,0],[0.5,0,0],[0.75,0,0],[1,0.25,0],[1,0.5,0],[1,0.75,0],[0.75,1,0],[0.5,1,0],[0.25,1,0],[0,0.75,0],[0,0.5,0],[0,0.25,0]];verticalLabelPosition=bottom;html=1;verticalAlign=top;aspect=fixed;align=center;pointerEvents=1;shape=mxgraph.cisco19.rect;prIcon=l2_switch;fillColor=#FAFAFA;strokeColor=#005073;fontFamily=Courier New;fontSize=23;" vertex="1" parent="1">
          <mxGeometry x="80" y="393" width="60" height="60" as="geometry" />
        </mxCell>
        <mxCell id="hGWDthcUpm_Xo3dSXPEr-60" value="&lt;font style=&quot;font-size: 10px;&quot;&gt;PC_A# ping 192.168.1.101&lt;br style=&quot;font-size: 10px;&quot;&gt;&lt;br style=&quot;font-size: 10px;&quot;&gt;&lt;/font&gt;&lt;div style=&quot;font-size: 10px;&quot;&gt;&lt;font style=&quot;font-size: 10px;&quot;&gt;PING 192.168.1.101 (192.168.1.101) 56(84) bytes of data.&lt;/font&gt;&lt;/div&gt;&lt;div style=&quot;font-size: 10px;&quot;&gt;&lt;font style=&quot;font-size: 10px;&quot;&gt;64 bytes from 192.168.1.101 icmp_seq=1 ttl=64 time=0.01 ms&lt;/font&gt;&lt;/div&gt;" style="rounded=1;whiteSpace=wrap;html=1;fontFamily=console;fontSize=10;fillColor=#FF8000;align=left;fontSource=https%3A%2F%2Ffonts.googleapis.com%2Fcss%3Ffamily%3Dconsole;fontColor=#FFFFFF;verticalAlign=top;arcSize=5;" vertex="1" parent="1">
          <mxGeometry x="421" y="342" width="270" height="79" as="geometry" />
        </mxCell>
        <mxCell id="hGWDthcUpm_Xo3dSXPEr-61" value="&lt;span style=&quot;font-family: &amp;#34;console&amp;#34; ; font-size: 10px&quot;&gt;PC_A# ip netns exec huesped ping 192.168.1.100&lt;br style=&quot;font-size: 10px&quot;&gt;&lt;br style=&quot;font-size: 10px&quot;&gt;&lt;/span&gt;&lt;div style=&quot;font-family: &amp;#34;console&amp;#34; ; font-size: 10px&quot;&gt;PING 192.168.1.100 (192.168.1.100) 56(84) bytes of data.&lt;/div&gt;&lt;div style=&quot;font-family: &amp;#34;console&amp;#34; ; font-size: 10px&quot;&gt;64 bytes from 192.168.1.100 icmp_seq=1 ttl=64 time=0.01 ms&lt;/div&gt;" style="rounded=1;whiteSpace=wrap;html=1;fontFamily=Ubuntu;fontSource=https%3A%2F%2Ffonts.googleapis.com%2Fcss%3Ffamily%3DUbuntu;fontSize=10;fillColor=#009900;align=left;fontColor=#FFFFFF;verticalAlign=top;arcSize=8;" vertex="1" parent="1">
          <mxGeometry x="421" y="457" width="270" height="79" as="geometry" />
        </mxCell>
        <mxCell id="hGWDthcUpm_Xo3dSXPEr-62" value="&lt;span style=&quot;color: rgb(0 , 0 , 0) ; font-family: &amp;#34;ubuntu&amp;#34; ; font-size: 10px ; font-style: normal ; font-weight: 400 ; letter-spacing: normal ; text-align: center ; text-indent: 0px ; text-transform: none ; word-spacing: 0px ; background-color: rgb(248 , 249 , 250) ; display: inline ; float: none&quot;&gt;Consola Namespace&amp;nbsp; Huesped:&lt;/span&gt;" style="text;whiteSpace=wrap;html=1;fontSize=10;fontFamily=Ubuntu;" vertex="1" parent="1">
          <mxGeometry x="421" y="436" width="190" height="30" as="geometry" />
        </mxCell>
        <mxCell id="hGWDthcUpm_Xo3dSXPEr-63" value="&lt;span style=&quot;color: rgb(0, 0, 0); font-family: ubuntu; font-size: 10px; font-style: normal; font-weight: 400; letter-spacing: normal; text-align: center; text-indent: 0px; text-transform: none; word-spacing: 0px; background-color: rgb(248, 249, 250); display: inline; float: none;&quot;&gt;Consola Namespace por defecto&lt;/span&gt;" style="text;whiteSpace=wrap;html=1;fontSize=10;fontFamily=Ubuntu;" vertex="1" parent="1">
          <mxGeometry x="421" y="320" width="200" height="30" as="geometry" />
        </mxCell>
        <mxCell id="hGWDthcUpm_Xo3dSXPEr-64" value="" style="group" vertex="1" connectable="0" parent="1">
          <mxGeometry x="80" y="590" width="447" height="160" as="geometry" />
        </mxCell>
        <mxCell id="hGWDthcUpm_Xo3dSXPEr-16" value="" style="group" vertex="1" connectable="0" parent="hGWDthcUpm_Xo3dSXPEr-64">
          <mxGeometry x="28" y="30" width="114" height="70" as="geometry" />
        </mxCell>
        <mxCell id="hGWDthcUpm_Xo3dSXPEr-17" value="" style="fontColor=#0066CC;verticalAlign=top;verticalLabelPosition=bottom;labelPosition=center;align=center;html=1;outlineConnect=0;fillColor=#CCCCCC;strokeColor=#6881B3;gradientColor=none;gradientDirection=north;strokeWidth=2;shape=mxgraph.networks.pc;" vertex="1" parent="hGWDthcUpm_Xo3dSXPEr-16">
          <mxGeometry width="100" height="70" as="geometry" />
        </mxCell>
        <mxCell id="hGWDthcUpm_Xo3dSXPEr-18" value="PC&lt;sub style=&quot;font-size: 23px;&quot;&gt;A&lt;/sub&gt;" style="text;html=1;align=center;verticalAlign=middle;resizable=0;points=[];autosize=1;strokeColor=none;fillColor=none;fontSize=23;fontStyle=1;fontFamily=Ubuntu;fontSource=https%3A%2F%2Ffonts.googleapis.com%2Fcss%3Ffamily%3DUbuntu;" vertex="1" parent="hGWDthcUpm_Xo3dSXPEr-16">
          <mxGeometry x="30" y="10" width="60" height="40" as="geometry" />
        </mxCell>
        <mxCell id="hGWDthcUpm_Xo3dSXPEr-37" value="" style="shape=image;html=1;verticalAlign=top;verticalLabelPosition=bottom;labelBackgroundColor=#ffffff;imageAspect=0;aspect=fixed;image=https://cdn1.iconfinder.com/data/icons/bootstrap-vol-2/16/ethernet-128.png;fontFamily=Ubuntu;fontSource=https%3A%2F%2Ffonts.googleapis.com%2Fcss%3Ffamily%3DUbuntu;fontSize=12;imageBackground=#FF9933;" vertex="1" parent="hGWDthcUpm_Xo3dSXPEr-16">
          <mxGeometry x="90" y="10" width="24" height="24" as="geometry" />
        </mxCell>
        <mxCell id="hGWDthcUpm_Xo3dSXPEr-19" value="" style="sketch=0;points=[[0.015,0.015,0],[0.985,0.015,0],[0.985,0.985,0],[0.015,0.985,0],[0.25,0,0],[0.5,0,0],[0.75,0,0],[1,0.25,0],[1,0.5,0],[1,0.75,0],[0.75,1,0],[0.5,1,0],[0.25,1,0],[0,0.75,0],[0,0.5,0],[0,0.25,0]];verticalLabelPosition=bottom;html=1;verticalAlign=top;aspect=fixed;align=center;pointerEvents=1;shape=mxgraph.cisco19.rect;prIcon=l2_switch;fillColor=#FAFAFA;strokeColor=#005073;fontFamily=Courier New;fontSize=23;" vertex="1" parent="hGWDthcUpm_Xo3dSXPEr-64">
          <mxGeometry x="189" y="35" width="60" height="60" as="geometry" />
        </mxCell>
        <mxCell id="hGWDthcUpm_Xo3dSXPEr-20" value="" style="edgeStyle=orthogonalEdgeStyle;rounded=0;orthogonalLoop=1;jettySize=auto;html=1;exitX=1;exitY=0.5;exitDx=0;exitDy=0;exitPerimeter=0;fontFamily=Courier New;fontSize=23;endArrow=none;endFill=0;" edge="1" parent="hGWDthcUpm_Xo3dSXPEr-64" source="hGWDthcUpm_Xo3dSXPEr-17" target="hGWDthcUpm_Xo3dSXPEr-19">
          <mxGeometry relative="1" as="geometry">
            <mxPoint x="128" y="65" as="sourcePoint" />
            <mxPoint x="368" y="65" as="targetPoint" />
          </mxGeometry>
        </mxCell>
        <mxCell id="hGWDthcUpm_Xo3dSXPEr-21" value="IP&lt;sub&gt;A&lt;/sub&gt; = 192.168.1.100/24&lt;br&gt;Namespace por defecto" style="text;html=1;align=center;verticalAlign=middle;resizable=0;points=[];autosize=1;strokeColor=none;fillColor=none;fontSize=14;fontFamily=Ubuntu;fontSource=https%3A%2F%2Ffonts.googleapis.com%2Fcss%3Ffamily%3DUbuntu;" vertex="1" parent="hGWDthcUpm_Xo3dSXPEr-64">
          <mxGeometry y="120" width="170" height="40" as="geometry" />
        </mxCell>
        <mxCell id="hGWDthcUpm_Xo3dSXPEr-22" value="IP&lt;span style=&quot;font-size: 11.6667px&quot;&gt;B&lt;/span&gt;&amp;nbsp;= 192.168.1.101/24&lt;br&gt;Namespace Huesped" style="text;html=1;align=center;verticalAlign=middle;resizable=0;points=[];autosize=1;strokeColor=none;fillColor=none;fontSize=14;fontFamily=Ubuntu;fontSource=https%3A%2F%2Ffonts.googleapis.com%2Fcss%3Ffamily%3DUbuntu;" vertex="1" parent="hGWDthcUpm_Xo3dSXPEr-64">
          <mxGeometry x="287" y="120" width="160" height="40" as="geometry" />
        </mxCell>
        <mxCell id="hGWDthcUpm_Xo3dSXPEr-25" value="" style="group" vertex="1" connectable="0" parent="hGWDthcUpm_Xo3dSXPEr-64">
          <mxGeometry x="310.5" y="22" width="115" height="85" as="geometry" />
        </mxCell>
        <mxCell id="hGWDthcUpm_Xo3dSXPEr-23" value="" style="fontColor=#0066CC;verticalAlign=top;verticalLabelPosition=bottom;labelPosition=center;align=center;html=1;outlineConnect=0;fillColor=#CCCCCC;strokeColor=#6881B3;gradientColor=none;gradientDirection=north;strokeWidth=2;shape=mxgraph.networks.virtual_pc;fontFamily=Ubuntu;fontSource=https%3A%2F%2Ffonts.googleapis.com%2Fcss%3Ffamily%3DUbuntu;fontSize=14;" vertex="1" parent="hGWDthcUpm_Xo3dSXPEr-25">
          <mxGeometry width="115" height="85" as="geometry" />
        </mxCell>
        <mxCell id="hGWDthcUpm_Xo3dSXPEr-15" value="PC&lt;sub style=&quot;font-size: 23px&quot;&gt;B&lt;/sub&gt;" style="text;html=1;align=center;verticalAlign=middle;resizable=0;points=[];autosize=1;strokeColor=none;fillColor=none;fontSize=23;fontStyle=1;fontFamily=Ubuntu;fontSource=https%3A%2F%2Ffonts.googleapis.com%2Fcss%3Ffamily%3DUbuntu;" vertex="1" parent="hGWDthcUpm_Xo3dSXPEr-25">
          <mxGeometry x="37.5" y="20" width="60" height="40" as="geometry" />
        </mxCell>
        <mxCell id="hGWDthcUpm_Xo3dSXPEr-12" style="edgeStyle=orthogonalEdgeStyle;rounded=0;orthogonalLoop=1;jettySize=auto;html=1;exitX=1;exitY=0.5;exitDx=0;exitDy=0;exitPerimeter=0;fontFamily=Courier New;fontSize=23;endArrow=none;endFill=0;startArrow=none;entryX=0;entryY=0.5;entryDx=0;entryDy=0;entryPerimeter=0;" edge="1" parent="hGWDthcUpm_Xo3dSXPEr-64" source="hGWDthcUpm_Xo3dSXPEr-19" target="hGWDthcUpm_Xo3dSXPEr-23">
          <mxGeometry relative="1" as="geometry">
            <mxPoint x="279" y="65" as="targetPoint" />
          </mxGeometry>
        </mxCell>
        <mxCell id="hGWDthcUpm_Xo3dSXPEr-26" value="enp2s0" style="text;html=1;align=center;verticalAlign=middle;resizable=0;points=[];autosize=1;strokeColor=none;fillColor=none;fontSize=12;fontFamily=Ubuntu;" vertex="1" parent="hGWDthcUpm_Xo3dSXPEr-64">
          <mxGeometry x="120" y="63" width="60" height="20" as="geometry" />
        </mxCell>
        <mxCell id="hGWDthcUpm_Xo3dSXPEr-28" value="enp4s0" style="text;html=1;align=center;verticalAlign=middle;resizable=0;points=[];autosize=1;strokeColor=none;fillColor=none;fontSize=12;fontFamily=Ubuntu;" vertex="1" parent="hGWDthcUpm_Xo3dSXPEr-64">
          <mxGeometry x="256" y="63" width="60" height="20" as="geometry" />
        </mxCell>
        <mxCell id="hGWDthcUpm_Xo3dSXPEr-29" value="PC Anfitrión" style="text;html=1;align=center;verticalAlign=middle;resizable=0;points=[];autosize=1;strokeColor=none;fillColor=none;fontSize=12;fontFamily=Ubuntu;" vertex="1" parent="hGWDthcUpm_Xo3dSXPEr-64">
          <mxGeometry x="38" y="2" width="80" height="20" as="geometry" />
        </mxCell>
        <mxCell id="hGWDthcUpm_Xo3dSXPEr-30" value="PC Huésped" style="text;html=1;align=center;verticalAlign=middle;resizable=0;points=[];autosize=1;strokeColor=none;fillColor=none;fontSize=12;fontFamily=Ubuntu;" vertex="1" parent="hGWDthcUpm_Xo3dSXPEr-64">
          <mxGeometry x="333" width="80" height="20" as="geometry" />
        </mxCell>
        <mxCell id="hGWDthcUpm_Xo3dSXPEr-39" value="" style="shape=image;html=1;verticalAlign=top;verticalLabelPosition=bottom;labelBackgroundColor=#ffffff;imageAspect=0;aspect=fixed;image=https://cdn1.iconfinder.com/data/icons/bootstrap-vol-2/16/ethernet-128.png;fontFamily=Ubuntu;fontSource=https%3A%2F%2Ffonts.googleapis.com%2Fcss%3Ffamily%3DUbuntu;fontSize=12;imageBackground=#009900;" vertex="1" parent="hGWDthcUpm_Xo3dSXPEr-64">
          <mxGeometry x="297" y="39" width="24" height="24" as="geometry" />
        </mxCell>
      </root>
    </mxGraphModel>
  </diagram>
</mxfile>
