{
    "mainCard": {
        "date": "2019-02-28 14:23:45",        
        "message": "Jovenes colombianos rompen record en participacion para la construccion de una politica publica de genero incluyente"
    },
    "cards": [
        {
            "date": "2019-02-28 14:23:45",
            "background" : "url('../../../assets/images/information/2.png')",
            "message": "Protegete de El Niño"
        },
        {
            "date": "2019-02-28 14:23:45",
            "background" : "url('../../../assets/images/information/3.png')",
            "message": "Colombia, ganador de premio internacional de inovacion"
        },
        {
            "date": "2019-02-28 14:23:45",
            "background" : "url('../../../assets/images/information/4.png')",
            "message": "El nuevo sistema carcelario"
        },
        {
            "date": "2019-02-28 14:23:45",
            "background" : "url('../../../assets/images/information/5.png')",
            "message": "Esta convocatoria no te la puedes perder por nada"
        }
    ]
}