<?xml version="1.0" encoding="utf-8"?>
<!-- Generator: Adobe Illustrator 16.0.0, SVG Export Plug-In . SVG Version: 6.00 Build 0)  -->
<!DOCTYPE svg PUBLIC "-//W3C//DTD SVG 1.1//EN" "http://www.w3.org/Graphics/SVG/1.1/DTD/svg11.dtd">
<svg version="1.1" id="Layer_3" xmlns="http://www.w3.org/2000/svg" xmlns:xlink="http://www.w3.org/1999/xlink" x="0px" y="0px"
	 width="234px" height="308.109px" viewBox="0 0 234 308.109" enable-background="new 0 0 234 308.109" xml:space="preserve">
<g>
	<rect fill="#3F2D4C" width="234" height="308.109"/>
	<rect opacity="0.2" fill="#FFFFFF" width="234" height="71.691"/>
	<rect y="111.85" opacity="0.2" fill="#FFFFFF" width="234" height="36.116"/>
	<rect y="182.545" opacity="0.2" fill="#FFFFFF" width="234" height="36.116"/>
	<rect y="242.994" opacity="0.2" fill="#FFFFFF" width="234" height="36.115"/>
	<g>
		<path fill="#FFFFFF" d="M45.891,27.619v7.171c0,2.689,1.201,3.837,2.815,3.837c1.775,0,2.94-1.184,2.94-3.837v-7.171h1.578v7.064
			c0,3.711-1.954,5.217-4.572,5.217c-2.474,0-4.339-1.398-4.339-5.164v-7.118H45.891z"/>
		<path fill="#FFFFFF" d="M55.877,33.374c0-0.914-0.018-1.631-0.071-2.349h1.398l0.089,1.435h0.036
			c0.43-0.807,1.434-1.614,2.869-1.614c1.201,0,3.066,0.717,3.066,3.693v5.164h-1.578v-5.002c0-1.398-0.52-2.563-2.008-2.563
			c-1.022,0-1.829,0.735-2.116,1.613c-0.072,0.197-0.107,0.466-0.107,0.735v5.217h-1.578V33.374z"/>
		<path fill="#FFFFFF" d="M67.585,28.587c0,0.538-0.376,0.968-1.004,0.968c-0.574,0-0.95-0.43-0.95-0.968
			c0-0.538,0.394-0.986,0.986-0.986C67.191,27.601,67.585,28.031,67.585,28.587z M65.828,39.703v-8.678h1.578v8.678H65.828z"/>
		<path fill="#FFFFFF" d="M77.5,26.974v10.488c0,0.771,0.036,1.649,0.072,2.241h-1.398l-0.072-1.506h-0.054
			c-0.466,0.968-1.506,1.703-2.922,1.703c-2.098,0-3.729-1.775-3.729-4.411c-0.018-2.887,1.793-4.644,3.891-4.644
			c1.345,0,2.223,0.627,2.618,1.309h0.036v-5.181H77.5z M75.941,34.558c0-0.197-0.018-0.466-0.072-0.664
			c-0.233-0.986-1.094-1.811-2.277-1.811c-1.631,0-2.6,1.434-2.6,3.334c0,1.757,0.879,3.209,2.564,3.209
			c1.058,0,2.026-0.717,2.313-1.883c0.054-0.215,0.072-0.43,0.072-0.681V34.558z"/>
		<path fill="#FFFFFF" d="M86.232,37.624c0,0.753,0.036,1.488,0.125,2.08h-1.416l-0.125-1.094h-0.055
			c-0.483,0.681-1.416,1.291-2.653,1.291c-1.757,0-2.653-1.237-2.653-2.492c0-2.098,1.864-3.245,5.218-3.227v-0.18
			c0-0.699-0.197-2.008-1.973-1.99c-0.824,0-1.667,0.233-2.277,0.646l-0.358-1.058c0.717-0.448,1.775-0.753,2.869-0.753
			c2.653,0,3.299,1.811,3.299,3.532V37.624z M84.708,35.274c-1.721-0.036-3.675,0.269-3.675,1.955c0,1.04,0.681,1.506,1.47,1.506
			c1.147,0,1.883-0.717,2.134-1.452c0.054-0.179,0.071-0.358,0.071-0.502V35.274z"/>
		<path fill="#FFFFFF" d="M96.255,26.974v10.488c0,0.771,0.036,1.649,0.072,2.241h-1.399l-0.071-1.506h-0.054
			c-0.466,0.968-1.506,1.703-2.923,1.703c-2.098,0-3.729-1.775-3.729-4.411c-0.019-2.887,1.793-4.644,3.891-4.644
			c1.345,0,2.223,0.627,2.617,1.309h0.036v-5.181H96.255z M94.695,34.558c0-0.197-0.019-0.466-0.072-0.664
			c-0.232-0.986-1.094-1.811-2.276-1.811c-1.632,0-2.6,1.434-2.6,3.334c0,1.757,0.878,3.209,2.563,3.209
			c1.058,0,2.026-0.717,2.313-1.883c0.054-0.215,0.072-0.43,0.072-0.681V34.558z"/>
		<path fill="#FFFFFF" d="M99.77,35.651c0.036,2.133,1.381,3.012,2.977,3.012c1.129,0,1.828-0.197,2.402-0.448l0.286,1.13
			c-0.556,0.251-1.523,0.556-2.904,0.556c-2.671,0-4.267-1.775-4.267-4.393s1.542-4.662,4.069-4.662c2.851,0,3.586,2.474,3.586,4.07
			c0,0.323-0.018,0.556-0.054,0.735H99.77z M104.396,34.521c0.018-0.986-0.413-2.546-2.188-2.546c-1.614,0-2.295,1.452-2.421,2.546
			H104.396z"/>
		<path fill="#FFFFFF" d="M111.675,33.374c0-0.914-0.018-1.631-0.071-2.349h1.398l0.09,1.435h0.035
			c0.431-0.807,1.435-1.614,2.869-1.614c1.201,0,3.065,0.717,3.065,3.693v5.164h-1.577v-5.002c0-1.398-0.521-2.563-2.009-2.563
			c-1.021,0-1.828,0.735-2.115,1.613c-0.071,0.197-0.107,0.466-0.107,0.735v5.217h-1.578V33.374z"/>
		<path fill="#FFFFFF" d="M129.479,35.292c0,3.209-2.241,4.608-4.321,4.608c-2.331,0-4.159-1.721-4.159-4.464
			c0-2.887,1.918-4.59,4.303-4.59C127.793,30.846,129.479,32.657,129.479,35.292z M122.611,35.382c0,1.9,1.076,3.334,2.617,3.334
			c1.507,0,2.636-1.416,2.636-3.371c0-1.47-0.734-3.317-2.6-3.317C123.418,32.029,122.611,33.75,122.611,35.382z"/>
		<path fill="#FFFFFF" d="M133.369,28.946v2.08h2.26v1.201h-2.26v4.68c0,1.076,0.305,1.685,1.184,1.685
			c0.431,0,0.682-0.036,0.914-0.107l0.072,1.201c-0.305,0.108-0.789,0.215-1.398,0.215c-0.735,0-1.327-0.251-1.703-0.664
			c-0.431-0.484-0.61-1.255-0.61-2.277v-4.733h-1.345v-1.201h1.345v-1.614L133.369,28.946z"/>
		<path fill="#FFFFFF" d="M139.16,28.587c0,0.538-0.376,0.968-1.004,0.968c-0.573,0-0.95-0.43-0.95-0.968
			c0-0.538,0.395-0.986,0.986-0.986C138.767,27.601,139.16,28.031,139.16,28.587z M137.403,39.703v-8.678h1.578v8.678H137.403z"/>
		<path fill="#FFFFFF" d="M141.76,39.703v-7.477h-1.201v-1.201h1.201v-0.484c0-2.277,1.345-3.765,3.783-3.765
			c0.807,0,1.758,0.251,2.205,0.574l-0.447,1.201c-0.395-0.269-1.059-0.502-1.829-0.502c-1.668,0-2.151,1.166-2.151,2.546v0.43
			h5.038v8.678h-1.578v-7.477h-3.46v7.477H141.76z"/>
		<path fill="#FFFFFF" d="M157.162,39.398c-0.412,0.197-1.326,0.502-2.492,0.502c-2.617,0-4.32-1.775-4.32-4.429
			c0-2.671,1.828-4.625,4.661-4.625c0.933,0,1.757,0.233,2.188,0.466l-0.358,1.201c-0.377-0.197-0.969-0.413-1.829-0.413
			c-1.99,0-3.065,1.488-3.065,3.281c0,2.008,1.291,3.245,3.012,3.245c0.896,0,1.488-0.215,1.937-0.413L157.162,39.398z"/>
		<path fill="#FFFFFF" d="M165.104,37.624c0,0.753,0.036,1.488,0.126,2.08h-1.416l-0.126-1.094h-0.054
			c-0.484,0.681-1.416,1.291-2.653,1.291c-1.757,0-2.653-1.237-2.653-2.492c0-2.098,1.864-3.245,5.217-3.227v-0.18
			c0-0.699-0.197-2.008-1.972-1.99c-0.825,0-1.668,0.233-2.277,0.646l-0.358-1.058c0.717-0.448,1.774-0.753,2.868-0.753
			c2.653,0,3.299,1.811,3.299,3.532V37.624z M163.581,35.274c-1.722-0.036-3.676,0.269-3.676,1.955c0,1.04,0.682,1.506,1.471,1.506
			c1.147,0,1.882-0.717,2.133-1.452c0.055-0.179,0.072-0.358,0.072-0.502V35.274z"/>
		<path fill="#FFFFFF" d="M167.651,33.374c0-0.914-0.018-1.631-0.071-2.349h1.398l0.09,1.435h0.035
			c0.431-0.807,1.435-1.614,2.869-1.614c1.201,0,3.065,0.717,3.065,3.693v5.164h-1.577v-5.002c0-1.398-0.521-2.563-2.009-2.563
			c-1.021,0-1.828,0.735-2.115,1.613c-0.071,0.197-0.107,0.466-0.107,0.735v5.217h-1.578V33.374z"/>
		<path fill="#FFFFFF" d="M179.431,28.946v2.08h2.26v1.201h-2.26v4.68c0,1.076,0.305,1.685,1.184,1.685
			c0.431,0,0.682-0.036,0.914-0.107l0.072,1.201c-0.305,0.108-0.789,0.215-1.398,0.215c-0.735,0-1.327-0.251-1.703-0.664
			c-0.431-0.484-0.61-1.255-0.61-2.277v-4.733h-1.345v-1.201h1.345v-1.614L179.431,28.946z"/>
		<path fill="#FFFFFF" d="M184.236,35.651c0.036,2.133,1.381,3.012,2.977,3.012c1.129,0,1.828-0.197,2.402-0.448l0.286,1.13
			c-0.556,0.251-1.523,0.556-2.904,0.556c-2.671,0-4.267-1.775-4.267-4.393s1.542-4.662,4.069-4.662c2.851,0,3.586,2.474,3.586,4.07
			c0,0.323-0.018,0.556-0.054,0.735H184.236z M188.862,34.521c0.018-0.986-0.413-2.546-2.188-2.546
			c-1.614,0-2.295,1.452-2.421,2.546H188.862z"/>
		<path fill="#FFFFFF" d="M11.706,45.78c-0.875,1.187-1.499,2.734-1.499,4.917c0,2.135,0.66,3.658,1.499,4.857H10.89
			c-0.756-0.996-1.571-2.531-1.571-4.869c0.012-2.351,0.815-3.898,1.571-4.905H11.706z"/>
		<path fill="#FFFFFF" d="M17.044,50.313h-3.13v2.915h3.502v0.875h-4.558V46.02h4.378v0.875h-3.322v2.555h3.13V50.313z"/>
		<path fill="#FFFFFF" d="M18.595,53.036c0.324,0.192,0.875,0.408,1.403,0.408c0.756,0,1.115-0.372,1.115-0.863
			c0-0.504-0.3-0.768-1.067-1.056c-1.055-0.384-1.547-0.947-1.547-1.643c0-0.936,0.768-1.703,2.003-1.703
			c0.587,0,1.104,0.156,1.415,0.36l-0.252,0.768c-0.228-0.144-0.647-0.348-1.187-0.348c-0.624,0-0.959,0.36-0.959,0.792
			c0,0.479,0.335,0.695,1.091,0.996c0.996,0.372,1.523,0.875,1.523,1.739c0,1.031-0.803,1.751-2.159,1.751
			c-0.636,0-1.223-0.168-1.631-0.408L18.595,53.036z"/>
		<path fill="#FFFFFF" d="M27.628,53.899c-0.276,0.132-0.887,0.336-1.667,0.336c-1.751,0-2.891-1.187-2.891-2.962
			c0-1.787,1.224-3.094,3.119-3.094c0.624,0,1.175,0.156,1.463,0.312l-0.24,0.803c-0.252-0.132-0.647-0.276-1.223-0.276
			c-1.332,0-2.051,0.996-2.051,2.195c0,1.343,0.864,2.171,2.015,2.171c0.6,0,0.996-0.144,1.295-0.276L27.628,53.899z"/>
		<path fill="#FFFFFF" d="M34.047,51.153c0,2.146-1.499,3.082-2.89,3.082c-1.559,0-2.783-1.151-2.783-2.986
			c0-1.931,1.284-3.07,2.878-3.07C32.92,48.178,34.047,49.39,34.047,51.153z M29.454,51.212c0,1.271,0.72,2.231,1.751,2.231
			c1.007,0,1.763-0.947,1.763-2.255c0-0.983-0.492-2.219-1.739-2.219C29.994,48.97,29.454,50.121,29.454,51.212z"/>
		<path fill="#FFFFFF" d="M35.382,45.588h1.056v8.515h-1.056V45.588z"/>
		<path fill="#FFFFFF" d="M42.292,52.712c0,0.503,0.024,0.995,0.084,1.391h-0.947l-0.084-0.731h-0.036
			c-0.324,0.456-0.947,0.863-1.775,0.863c-1.175,0-1.775-0.828-1.775-1.667c0-1.403,1.247-2.171,3.49-2.159v-0.12
			c0-0.468-0.132-1.343-1.319-1.331c-0.552,0-1.116,0.156-1.523,0.432l-0.24-0.708c0.479-0.3,1.187-0.504,1.919-0.504
			c1.775,0,2.207,1.211,2.207,2.363V52.712z M41.272,51.141c-1.151-0.024-2.458,0.18-2.458,1.307c0,0.696,0.456,1.008,0.983,1.008
			c0.768,0,1.259-0.48,1.427-0.972c0.036-0.12,0.048-0.24,0.048-0.336V51.141z"/>
		<path fill="#FFFFFF" d="M43.315,55.59c0.264-0.72,0.588-2.003,0.72-2.878l1.175-0.12c-0.288,1.02-0.815,2.351-1.151,2.915
			L43.315,55.59z"/>
		<path fill="#FFFFFF" d="M50.105,46.02v4.797c0,1.799,0.803,2.566,1.883,2.566c1.188,0,1.967-0.792,1.967-2.566V46.02h1.056v4.726
			c0,2.482-1.308,3.49-3.059,3.49c-1.655,0-2.902-0.936-2.902-3.454V46.02H50.105z"/>
		<path fill="#FFFFFF" d="M56.826,46.14c0.456-0.108,1.187-0.18,1.907-0.18c1.043,0,1.715,0.18,2.207,0.588
			c0.419,0.312,0.684,0.792,0.684,1.427c0,0.792-0.528,1.475-1.367,1.775v0.036c0.768,0.18,1.667,0.816,1.667,2.015
			c0,0.696-0.276,1.235-0.696,1.619c-0.552,0.516-1.463,0.755-2.782,0.755c-0.72,0-1.271-0.048-1.619-0.096V46.14z M57.87,49.45
			h0.947c1.091,0,1.739-0.588,1.739-1.367c0-0.936-0.708-1.319-1.763-1.319c-0.479,0-0.755,0.036-0.923,0.072V49.45z M57.87,53.312
			c0.216,0.036,0.503,0.048,0.875,0.048c1.079,0,2.075-0.396,2.075-1.571c0-1.091-0.947-1.559-2.087-1.559H57.87V53.312z"/>
		<path fill="#FFFFFF" d="M63.198,52.832c0.468,0.3,1.139,0.528,1.859,0.528c1.067,0,1.691-0.563,1.691-1.379
			c0-0.743-0.432-1.187-1.523-1.595c-1.319-0.48-2.135-1.175-2.135-2.303c0-1.259,1.043-2.195,2.615-2.195
			c0.815,0,1.427,0.192,1.775,0.396l-0.288,0.852c-0.252-0.156-0.792-0.384-1.523-0.384c-1.103,0-1.523,0.66-1.523,1.211
			c0,0.755,0.492,1.127,1.607,1.559c1.368,0.528,2.051,1.188,2.051,2.375c0,1.247-0.912,2.338-2.819,2.338
			c-0.779,0-1.631-0.24-2.063-0.528L63.198,52.832z"/>
		<path fill="#FFFFFF" d="M68.526,55.59c0.264-0.72,0.588-2.003,0.72-2.878l1.175-0.12c-0.288,1.02-0.815,2.351-1.151,2.915
			L68.526,55.59z"/>
		<path fill="#FFFFFF" d="M74.273,46.115c0.503-0.084,1.163-0.156,2.003-0.156c1.031,0,1.787,0.24,2.267,0.672
			c0.432,0.384,0.708,0.971,0.708,1.691c0,0.731-0.216,1.307-0.624,1.727c-0.563,0.587-1.451,0.887-2.471,0.887
			c-0.312,0-0.6-0.012-0.839-0.072v3.238h-1.043V46.115z M75.317,50.013c0.228,0.06,0.516,0.084,0.863,0.084
			c1.259,0,2.027-0.624,2.027-1.715c0-1.08-0.768-1.595-1.907-1.595c-0.456,0-0.804,0.036-0.983,0.084V50.013z"/>
		<path fill="#FFFFFF" d="M80.43,50.109c0-0.684-0.012-1.271-0.048-1.811h0.924l0.048,1.151h0.036
			c0.264-0.78,0.911-1.271,1.618-1.271c0.108,0,0.192,0.012,0.288,0.024v0.996c-0.107-0.024-0.216-0.024-0.359-0.024
			c-0.744,0-1.271,0.552-1.415,1.343c-0.024,0.144-0.036,0.324-0.036,0.492v3.094H80.43V50.109z"/>
		<path fill="#FFFFFF" d="M89.487,51.153c0,2.146-1.499,3.082-2.891,3.082c-1.56,0-2.782-1.151-2.782-2.986
			c0-1.931,1.283-3.07,2.878-3.07C88.359,48.178,89.487,49.39,89.487,51.153z M84.894,51.212c0,1.271,0.72,2.231,1.751,2.231
			c1.008,0,1.763-0.947,1.763-2.255c0-0.983-0.491-2.219-1.738-2.219C85.434,48.97,84.894,50.121,84.894,51.212z"/>
		<path fill="#FFFFFF" d="M90.822,49.869c0-0.611-0.013-1.091-0.049-1.571h0.936l0.061,0.959h0.023c0.288-0.54,0.96-1.08,1.919-1.08
			c0.804,0,2.051,0.48,2.051,2.471v3.454h-1.055v-3.346c0-0.936-0.349-1.715-1.344-1.715c-0.684,0-1.224,0.492-1.415,1.079
			c-0.048,0.132-0.072,0.312-0.072,0.492v3.49h-1.055V49.869z"/>
		<path fill="#FFFFFF" d="M98.704,46.907v1.391h1.512v0.803h-1.512v3.13c0,0.72,0.204,1.127,0.792,1.127
			c0.288,0,0.456-0.024,0.611-0.072l0.048,0.803c-0.203,0.072-0.527,0.144-0.936,0.144c-0.491,0-0.887-0.168-1.139-0.444
			c-0.288-0.324-0.408-0.839-0.408-1.523v-3.167h-0.899v-0.803h0.899v-1.08L98.704,46.907z"/>
		<path fill="#FFFFFF" d="M106.587,51.153c0,2.146-1.499,3.082-2.891,3.082c-1.56,0-2.782-1.151-2.782-2.986
			c0-1.931,1.283-3.07,2.878-3.07C105.459,48.178,106.587,49.39,106.587,51.153z M101.993,51.212c0,1.271,0.72,2.231,1.751,2.231
			c1.008,0,1.763-0.947,1.763-2.255c0-0.983-0.491-2.219-1.738-2.219C102.533,48.97,101.993,50.121,101.993,51.212z"/>
		<path fill="#FFFFFF" d="M110.548,50.481v0.768h-2.963v-0.768H110.548z"/>
		<path fill="#FFFFFF" d="M115.863,52.712c0,0.503,0.024,0.995,0.084,1.391H115l-0.084-0.731h-0.036
			c-0.323,0.456-0.947,0.863-1.775,0.863c-1.175,0-1.774-0.828-1.774-1.667c0-1.403,1.247-2.171,3.49-2.159v-0.12
			c0-0.468-0.132-1.343-1.319-1.331c-0.552,0-1.115,0.156-1.523,0.432l-0.24-0.708c0.48-0.3,1.188-0.504,1.919-0.504
			c1.775,0,2.207,1.211,2.207,2.363V52.712z M114.844,51.141c-1.151-0.024-2.458,0.18-2.458,1.307c0,0.696,0.455,1.008,0.983,1.008
			c0.768,0,1.259-0.48,1.427-0.972c0.036-0.12,0.048-0.24,0.048-0.336V51.141z"/>
		<path fill="#FFFFFF" d="M118.792,46.907v1.391h1.512v0.803h-1.512v3.13c0,0.72,0.204,1.127,0.792,1.127
			c0.288,0,0.456-0.024,0.611-0.072l0.048,0.803c-0.203,0.072-0.527,0.144-0.936,0.144c-0.491,0-0.887-0.168-1.139-0.444
			c-0.288-0.324-0.408-0.839-0.408-1.523v-3.167h-0.899v-0.803h0.899v-1.08L118.792,46.907z"/>
		<path fill="#FFFFFF" d="M122.009,51.393c0.024,1.427,0.924,2.015,1.991,2.015c0.756,0,1.224-0.132,1.607-0.3l0.191,0.756
			c-0.372,0.168-1.02,0.372-1.942,0.372c-1.787,0-2.854-1.187-2.854-2.938c0-1.751,1.031-3.118,2.723-3.118
			c1.906,0,2.398,1.655,2.398,2.723c0,0.216-0.012,0.372-0.036,0.492H122.009z M125.104,50.637c0.012-0.659-0.276-1.703-1.463-1.703
			c-1.08,0-1.535,0.971-1.619,1.703H125.104z"/>
		<path fill="#FFFFFF" d="M127.434,49.869c0-0.611-0.013-1.091-0.049-1.571h0.936l0.061,0.959h0.023
			c0.288-0.54,0.96-1.08,1.919-1.08c0.804,0,2.051,0.48,2.051,2.471v3.454h-1.055v-3.346c0-0.936-0.349-1.715-1.344-1.715
			c-0.684,0-1.224,0.492-1.415,1.079c-0.048,0.132-0.072,0.312-0.072,0.492v3.49h-1.055V49.869z"/>
		<path fill="#FFFFFF" d="M139.095,45.588v7.016c0,0.516,0.023,1.103,0.048,1.499h-0.936l-0.048-1.007h-0.036
			c-0.312,0.647-1.008,1.139-1.955,1.139c-1.403,0-2.494-1.187-2.494-2.95c-0.013-1.931,1.199-3.106,2.603-3.106
			c0.899,0,1.487,0.42,1.751,0.875h0.023v-3.466H139.095z M138.051,50.661c0-0.132-0.012-0.312-0.048-0.444
			c-0.155-0.66-0.731-1.211-1.522-1.211c-1.092,0-1.739,0.959-1.739,2.231c0,1.175,0.587,2.146,1.715,2.146
			c0.708,0,1.355-0.479,1.547-1.259c0.036-0.144,0.048-0.288,0.048-0.456V50.661z"/>
		<path fill="#FFFFFF" d="M142.036,46.667c0,0.36-0.252,0.648-0.672,0.648c-0.384,0-0.636-0.288-0.636-0.648s0.265-0.66,0.66-0.66
			C141.772,46.007,142.036,46.295,142.036,46.667z M140.861,54.103v-5.805h1.055v5.805H140.861z"/>
		<path fill="#FFFFFF" d="M143.669,49.869c0-0.611-0.024-1.091-0.049-1.571h0.924l0.048,0.947h0.036
			c0.324-0.552,0.863-1.067,1.835-1.067c0.779,0,1.379,0.48,1.631,1.164h0.024c0.18-0.336,0.42-0.576,0.659-0.756
			c0.348-0.264,0.72-0.408,1.271-0.408c0.779,0,1.919,0.504,1.919,2.519v3.406h-1.031v-3.274c0-1.127-0.42-1.787-1.26-1.787
			c-0.611,0-1.067,0.443-1.259,0.947c-0.048,0.156-0.084,0.336-0.084,0.528v3.586h-1.031v-3.478c0-0.923-0.408-1.583-1.212-1.583
			c-0.647,0-1.139,0.527-1.307,1.055c-0.061,0.144-0.084,0.336-0.084,0.516v3.49h-1.031V49.869z"/>
		<path fill="#FFFFFF" d="M154.265,51.393c0.024,1.427,0.924,2.015,1.991,2.015c0.756,0,1.224-0.132,1.607-0.3l0.191,0.756
			c-0.372,0.168-1.02,0.372-1.942,0.372c-1.787,0-2.854-1.187-2.854-2.938c0-1.751,1.031-3.118,2.723-3.118
			c1.906,0,2.398,1.655,2.398,2.723c0,0.216-0.012,0.372-0.036,0.492H154.265z M157.359,50.637c0.012-0.659-0.276-1.703-1.463-1.703
			c-1.08,0-1.535,0.971-1.619,1.703H157.359z"/>
		<path fill="#FFFFFF" d="M159.689,49.869c0-0.611-0.013-1.091-0.049-1.571h0.936l0.061,0.959h0.023
			c0.288-0.54,0.96-1.08,1.919-1.08c0.804,0,2.051,0.48,2.051,2.471v3.454h-1.055v-3.346c0-0.936-0.349-1.715-1.344-1.715
			c-0.684,0-1.224,0.492-1.415,1.079c-0.048,0.132-0.072,0.312-0.072,0.492v3.49h-1.055V49.869z"/>
		<path fill="#FFFFFF" d="M167.571,46.907v1.391h1.512v0.803h-1.512v3.13c0,0.72,0.204,1.127,0.792,1.127
			c0.288,0,0.456-0.024,0.611-0.072l0.048,0.803c-0.203,0.072-0.527,0.144-0.936,0.144c-0.491,0-0.887-0.168-1.139-0.444
			c-0.288-0.324-0.408-0.839-0.408-1.523v-3.167h-0.899v-0.803h0.899v-1.08L167.571,46.907z"/>
		<path fill="#FFFFFF" d="M175.454,51.153c0,2.146-1.499,3.082-2.891,3.082c-1.56,0-2.782-1.151-2.782-2.986
			c0-1.931,1.283-3.07,2.878-3.07C174.326,48.178,175.454,49.39,175.454,51.153z M170.86,51.212c0,1.271,0.72,2.231,1.751,2.231
			c1.008,0,1.763-0.947,1.763-2.255c0-0.983-0.491-2.219-1.738-2.219C171.4,48.97,170.86,50.121,170.86,51.212z"/>
		<path fill="#FFFFFF" d="M175.816,55.59c0.265-0.72,0.588-2.003,0.72-2.878l1.176-0.12c-0.288,1.02-0.815,2.351-1.151,2.915
			L175.816,55.59z"/>
		<path fill="#FFFFFF" d="M182.608,46.02v3.382h3.91V46.02h1.055v8.083h-1.055v-3.79h-3.91v3.79h-1.056V46.02H182.608z"/>
		<path fill="#FFFFFF" d="M194.605,51.153c0,2.146-1.499,3.082-2.891,3.082c-1.56,0-2.782-1.151-2.782-2.986
			c0-1.931,1.283-3.07,2.878-3.07C193.478,48.178,194.605,49.39,194.605,51.153z M190.012,51.212c0,1.271,0.72,2.231,1.751,2.231
			c1.008,0,1.763-0.947,1.763-2.255c0-0.983-0.491-2.219-1.738-2.219C190.552,48.97,190.012,50.121,190.012,51.212z"/>
		<path fill="#FFFFFF" d="M195.796,53.036c0.324,0.192,0.876,0.408,1.403,0.408c0.756,0,1.115-0.372,1.115-0.863
			c0-0.504-0.3-0.768-1.067-1.056c-1.056-0.384-1.547-0.947-1.547-1.643c0-0.936,0.768-1.703,2.003-1.703
			c0.588,0,1.104,0.156,1.415,0.36l-0.252,0.768c-0.228-0.144-0.647-0.348-1.188-0.348c-0.623,0-0.959,0.36-0.959,0.792
			c0,0.479,0.336,0.695,1.091,0.996c0.996,0.372,1.523,0.875,1.523,1.739c0,1.031-0.804,1.751-2.158,1.751
			c-0.636,0-1.224-0.168-1.632-0.408L195.796,53.036z"/>
		<path fill="#FFFFFF" d="M200.692,50.193c0-0.744-0.024-1.343-0.049-1.895h0.936l0.061,0.995h0.023
			c0.42-0.708,1.115-1.115,2.063-1.115c1.415,0,2.471,1.188,2.471,2.938c0,2.087-1.283,3.118-2.651,3.118
			c-0.768,0-1.438-0.336-1.786-0.912h-0.024v3.154h-1.043V50.193z M201.735,51.74c0,0.156,0.012,0.3,0.048,0.432
			c0.192,0.732,0.828,1.235,1.583,1.235c1.115,0,1.764-0.911,1.764-2.243c0-1.151-0.612-2.147-1.728-2.147
			c-0.72,0-1.403,0.504-1.595,1.295c-0.036,0.132-0.072,0.288-0.072,0.42V51.74z"/>
		<path fill="#FFFFFF" d="M208.695,46.667c0,0.36-0.252,0.648-0.672,0.648c-0.384,0-0.636-0.288-0.636-0.648s0.265-0.66,0.66-0.66
			C208.432,46.007,208.695,46.295,208.695,46.667z M207.521,54.103v-5.805h1.055v5.805H207.521z"/>
		<path fill="#FFFFFF" d="M211.599,46.907v1.391h1.512v0.803h-1.512v3.13c0,0.72,0.204,1.127,0.792,1.127
			c0.288,0,0.456-0.024,0.611-0.072l0.048,0.803c-0.203,0.072-0.527,0.144-0.936,0.144c-0.491,0-0.887-0.168-1.139-0.444
			c-0.288-0.324-0.408-0.839-0.408-1.523v-3.167h-0.899v-0.803h0.899v-1.08L211.599,46.907z"/>
		<path fill="#FFFFFF" d="M218.378,52.712c0,0.503,0.024,0.995,0.084,1.391h-0.947l-0.084-0.731h-0.036
			c-0.324,0.456-0.947,0.863-1.775,0.863c-1.175,0-1.774-0.828-1.774-1.667c0-1.403,1.247-2.171,3.49-2.159v-0.12
			c0-0.468-0.132-1.343-1.319-1.331c-0.552,0-1.115,0.156-1.523,0.432l-0.24-0.708c0.48-0.3,1.188-0.504,1.919-0.504
			c1.775,0,2.207,1.211,2.207,2.363V52.712z M217.358,51.141c-1.151-0.024-2.458,0.18-2.458,1.307c0,0.696,0.455,1.008,0.983,1.008
			c0.768,0,1.259-0.48,1.427-0.972c0.036-0.12,0.048-0.24,0.048-0.336V51.141z"/>
		<path fill="#FFFFFF" d="M220.084,45.588h1.055v8.515h-1.055V45.588z"/>
		<path fill="#FFFFFF" d="M222.28,55.554c0.839-1.188,1.499-2.734,1.499-4.893c0-2.159-0.647-3.682-1.499-4.881h0.815
			c0.755,0.983,1.571,2.53,1.571,4.881c-0.013,2.351-0.816,3.886-1.571,4.893H222.28z"/>
	</g>
	<g>
		<path fill="#FFFFFF" d="M60.405,134.42v-12.084h1.721l3.854,6.114c0.878,1.416,1.596,2.689,2.151,3.926l0.054-0.018
			c-0.144-1.613-0.18-3.083-0.18-4.966v-5.056h1.47v12.084h-1.578l-3.837-6.132c-0.843-1.345-1.649-2.725-2.241-4.034l-0.054,0.018
			c0.09,1.524,0.108,2.976,0.108,4.984v5.164H60.405z"/>
		<path fill="#FFFFFF" d="M75.538,121.995l-2.188,2.564h-1.111l1.578-2.564H75.538z M72.328,134.42v-8.678h1.578v8.678H72.328z"/>
		<path fill="#FFFFFF" d="M77.133,125.742l1.703,4.859c0.287,0.807,0.52,1.524,0.699,2.241h0.054
			c0.197-0.717,0.448-1.435,0.735-2.241l1.686-4.859h1.649l-3.406,8.678h-1.506l-3.299-8.678H77.133z"/>
		<path fill="#FFFFFF" d="M85.848,130.368c0.036,2.133,1.381,3.012,2.976,3.012c1.13,0,1.829-0.197,2.403-0.448l0.286,1.13
			c-0.556,0.251-1.523,0.556-2.904,0.556c-2.671,0-4.267-1.775-4.267-4.393s1.542-4.662,4.069-4.662c2.851,0,3.586,2.474,3.586,4.07
			c0,0.323-0.018,0.556-0.054,0.735H85.848z M90.474,129.238c0.018-0.986-0.413-2.546-2.188-2.546c-1.614,0-2.295,1.452-2.421,2.546
			H90.474z"/>
		<path fill="#FFFFFF" d="M93.951,121.69h1.578v12.729h-1.578V121.69z"/>
		<path fill="#FFFFFF" d="M101.983,128.091c0-0.914-0.035-1.631-0.071-2.349h1.38l0.072,1.417h0.054
			c0.484-0.825,1.291-1.596,2.743-1.596c1.165,0,2.062,0.717,2.438,1.739h0.036c0.269-0.502,0.627-0.861,0.985-1.13
			c0.521-0.394,1.076-0.609,1.9-0.609c1.166,0,2.869,0.753,2.869,3.765v5.092h-1.542v-4.895c0-1.686-0.628-2.671-1.883-2.671
			c-0.914,0-1.596,0.663-1.882,1.416c-0.072,0.233-0.126,0.502-0.126,0.789v5.361h-1.542v-5.199c0-1.381-0.609-2.367-1.811-2.367
			c-0.969,0-1.703,0.789-1.954,1.578c-0.09,0.215-0.126,0.502-0.126,0.771v5.217h-1.542V128.091z"/>
		<path fill="#FFFFFF" d="M124.198,132.035c0,0.915,0.018,1.704,0.071,2.385h-1.398l-0.09-1.417h-0.035
			c-0.395,0.699-1.327,1.614-2.869,1.614c-1.362,0-2.994-0.771-2.994-3.801v-5.074h1.578v4.787c0,1.649,0.52,2.779,1.937,2.779
			c1.058,0,1.793-0.735,2.079-1.452c0.09-0.215,0.144-0.502,0.144-0.807v-5.307h1.578V132.035z"/>
		<path fill="#FFFFFF" d="M126.816,128.091c0-0.914-0.018-1.631-0.071-2.349h1.398l0.09,1.435h0.035
			c0.431-0.807,1.435-1.614,2.869-1.614c1.201,0,3.065,0.717,3.065,3.693v5.164h-1.577v-5.002c0-1.398-0.521-2.563-2.009-2.563
			c-1.021,0-1.828,0.735-2.115,1.613c-0.071,0.197-0.107,0.466-0.107,0.735v5.217h-1.578V128.091z"/>
		<path fill="#FFFFFF" d="M138.524,123.304c0,0.538-0.376,0.968-1.004,0.968c-0.573,0-0.95-0.43-0.95-0.968
			c0-0.538,0.395-0.986,0.986-0.986C138.131,122.318,138.524,122.748,138.524,123.304z M136.768,134.42v-8.678h1.578v8.678H136.768z
			"/>
		<path fill="#FFFFFF" d="M147.148,134.115c-0.412,0.197-1.326,0.502-2.492,0.502c-2.617,0-4.32-1.775-4.32-4.429
			c0-2.671,1.828-4.625,4.661-4.625c0.933,0,1.757,0.233,2.188,0.466l-0.358,1.201c-0.377-0.197-0.969-0.413-1.829-0.413
			c-1.99,0-3.065,1.488-3.065,3.281c0,2.008,1.291,3.245,3.012,3.245c0.896,0,1.488-0.215,1.937-0.413L147.148,134.115z"/>
		<path fill="#FFFFFF" d="M150.752,123.304c0,0.538-0.376,0.968-1.004,0.968c-0.573,0-0.95-0.43-0.95-0.968
			c0-0.538,0.395-0.986,0.986-0.986C150.358,122.318,150.752,122.748,150.752,123.304z M148.995,134.42v-8.678h1.578v8.678H148.995z
			"/>
		<path fill="#FFFFFF" d="M153.19,128.575c0-1.112-0.035-2.008-0.071-2.833h1.398l0.09,1.488h0.035
			c0.628-1.058,1.668-1.667,3.084-1.667c2.116,0,3.693,1.775,3.693,4.393c0,3.12-1.918,4.662-3.962,4.662
			c-1.147,0-2.151-0.502-2.672-1.363h-0.035v4.715h-1.561V128.575z M154.751,130.888c0,0.233,0.018,0.448,0.071,0.646
			c0.287,1.094,1.237,1.847,2.366,1.847c1.668,0,2.636-1.362,2.636-3.353c0-1.721-0.914-3.209-2.582-3.209
			c-1.075,0-2.098,0.753-2.384,1.937c-0.054,0.197-0.107,0.43-0.107,0.627V130.888z"/>
		<path fill="#FFFFFF" d="M169.488,132.34c0,0.753,0.036,1.488,0.126,2.08h-1.416l-0.126-1.094h-0.054
			c-0.484,0.681-1.416,1.291-2.653,1.291c-1.757,0-2.653-1.237-2.653-2.492c0-2.098,1.864-3.245,5.217-3.227v-0.18
			c0-0.699-0.197-2.008-1.972-1.99c-0.825,0-1.668,0.233-2.277,0.646l-0.358-1.058c0.717-0.448,1.774-0.753,2.868-0.753
			c2.653,0,3.299,1.811,3.299,3.532V132.34z M167.965,129.991c-1.722-0.036-3.676,0.269-3.676,1.955c0,1.04,0.682,1.506,1.471,1.506
			c1.147,0,1.882-0.717,2.133-1.452c0.055-0.179,0.072-0.358,0.072-0.502V129.991z"/>
		<path fill="#FFFFFF" d="M172.035,121.69h1.578v12.729h-1.578V121.69z"/>
	</g>
	<g>
		<path fill="#FFFFFF" d="M63.884,205.114V193.03h1.721l3.854,6.114c0.878,1.416,1.596,2.689,2.151,3.926l0.054-0.018
			c-0.144-1.613-0.18-3.083-0.18-4.966v-5.056h1.47v12.084h-1.578l-3.837-6.132c-0.843-1.345-1.649-2.725-2.241-4.034l-0.054,0.018
			c0.09,1.524,0.108,2.976,0.108,4.984v5.164H63.884z"/>
		<path fill="#FFFFFF" d="M79.016,192.689l-2.188,2.564h-1.111l1.578-2.564H79.016z M75.807,205.114v-8.678h1.578v8.678H75.807z"/>
		<path fill="#FFFFFF" d="M80.611,196.437l1.704,4.859c0.286,0.807,0.52,1.524,0.699,2.241h0.054
			c0.197-0.717,0.448-1.435,0.734-2.241l1.686-4.859h1.649l-3.406,8.678h-1.506l-3.299-8.678H80.611z"/>
		<path fill="#FFFFFF" d="M89.326,201.063c0.036,2.133,1.381,3.012,2.977,3.012c1.129,0,1.828-0.197,2.402-0.448l0.286,1.13
			c-0.556,0.251-1.523,0.556-2.904,0.556c-2.671,0-4.267-1.775-4.267-4.393s1.542-4.662,4.069-4.662c2.851,0,3.586,2.474,3.586,4.07
			c0,0.323-0.018,0.556-0.054,0.735H89.326z M93.952,199.933c0.018-0.986-0.413-2.546-2.188-2.546c-1.614,0-2.295,1.452-2.421,2.546
			H93.952z"/>
		<path fill="#FFFFFF" d="M97.43,192.385h1.578v12.729H97.43V192.385z"/>
		<path fill="#FFFFFF" d="M106.341,201.063c0.036,2.133,1.381,3.012,2.976,3.012c1.13,0,1.829-0.197,2.403-0.448l0.286,1.13
			c-0.556,0.251-1.523,0.556-2.904,0.556c-2.671,0-4.267-1.775-4.267-4.393s1.542-4.662,4.069-4.662c2.851,0,3.586,2.474,3.586,4.07
			c0,0.323-0.018,0.556-0.054,0.735H106.341z M110.967,199.933c0.018-0.986-0.413-2.546-2.188-2.546
			c-1.614,0-2.295,1.452-2.421,2.546H110.967z"/>
		<path fill="#FFFFFF" d="M114.229,203.519c0.484,0.287,1.309,0.609,2.098,0.609c1.13,0,1.667-0.556,1.667-1.291
			c0-0.753-0.448-1.147-1.596-1.578c-1.577-0.574-2.313-1.416-2.313-2.456c0-1.398,1.147-2.546,2.994-2.546
			c0.879,0,1.649,0.233,2.115,0.538l-0.376,1.147c-0.341-0.215-0.968-0.52-1.775-0.52c-0.932,0-1.434,0.538-1.434,1.183
			c0,0.717,0.502,1.04,1.631,1.488c1.488,0.556,2.277,1.309,2.277,2.6c0,1.542-1.201,2.618-3.228,2.618
			c-0.95,0-1.828-0.251-2.438-0.61L114.229,203.519z"/>
		<path fill="#FFFFFF" d="M123.445,194.357v2.08h2.26v1.201h-2.26v4.68c0,1.076,0.305,1.685,1.184,1.685
			c0.431,0,0.682-0.036,0.914-0.107l0.072,1.201c-0.305,0.108-0.789,0.215-1.398,0.215c-0.735,0-1.327-0.251-1.703-0.664
			c-0.431-0.484-0.61-1.255-0.61-2.277v-4.733h-1.345v-1.201h1.345v-1.614L123.445,194.357z"/>
		<path fill="#FFFFFF" d="M133.575,203.035c0,0.753,0.036,1.488,0.126,2.08h-1.416l-0.126-1.094h-0.054
			c-0.484,0.681-1.416,1.291-2.653,1.291c-1.757,0-2.653-1.237-2.653-2.492c0-2.098,1.864-3.245,5.217-3.227v-0.18
			c0-0.699-0.197-2.008-1.972-1.99c-0.825,0-1.668,0.233-2.277,0.646l-0.358-1.058c0.717-0.448,1.774-0.753,2.868-0.753
			c2.653,0,3.299,1.811,3.299,3.532V203.035z M132.052,200.686c-1.722-0.036-3.676,0.269-3.676,1.955
			c0,1.04,0.682,1.506,1.471,1.506c1.147,0,1.882-0.717,2.133-1.452c0.055-0.179,0.072-0.358,0.072-0.502V200.686z"/>
		<path fill="#FFFFFF" d="M143.599,192.385v10.488c0,0.771,0.036,1.649,0.072,2.241h-1.399l-0.071-1.506h-0.054
			c-0.466,0.968-1.506,1.703-2.923,1.703c-2.098,0-3.729-1.775-3.729-4.411c-0.019-2.887,1.793-4.644,3.891-4.644
			c1.345,0,2.223,0.627,2.617,1.309h0.036v-5.181H143.599z M142.039,199.969c0-0.197-0.019-0.466-0.072-0.664
			c-0.232-0.986-1.094-1.811-2.276-1.811c-1.632,0-2.6,1.434-2.6,3.334c0,1.757,0.878,3.209,2.563,3.209
			c1.058,0,2.026-0.717,2.313-1.883c0.054-0.215,0.072-0.43,0.072-0.681V199.969z"/>
		<path fill="#FFFFFF" d="M153.496,202.729c0,0.915,0.018,1.704,0.071,2.385h-1.398l-0.09-1.417h-0.035
			c-0.395,0.699-1.327,1.614-2.869,1.614c-1.362,0-2.994-0.771-2.994-3.801v-5.074h1.578v4.787c0,1.649,0.52,2.779,1.937,2.779
			c1.058,0,1.793-0.735,2.079-1.452c0.09-0.215,0.144-0.502,0.144-0.807v-5.307h1.578V202.729z"/>
		<path fill="#FFFFFF" d="M162.209,203.035c0,0.753,0.036,1.488,0.126,2.08h-1.416l-0.126-1.094h-0.054
			c-0.484,0.681-1.416,1.291-2.653,1.291c-1.757,0-2.653-1.237-2.653-2.492c0-2.098,1.864-3.245,5.217-3.227v-0.18
			c0-0.699-0.197-2.008-1.972-1.99c-0.825,0-1.668,0.233-2.277,0.646l-0.358-1.058c0.717-0.448,1.774-0.753,2.868-0.753
			c2.653,0,3.299,1.811,3.299,3.532V203.035z M160.686,200.686c-1.722-0.036-3.676,0.269-3.676,1.955
			c0,1.04,0.682,1.506,1.471,1.506c1.147,0,1.882-0.717,2.133-1.452c0.055-0.179,0.072-0.358,0.072-0.502V200.686z"/>
		<path fill="#FFFFFF" d="M164.756,192.385h1.578v12.729h-1.578V192.385z"/>
	</g>
	<g>
		<path fill="#FFFFFF" d="M63.902,265.564V253.48h1.721l3.854,6.113c0.878,1.417,1.596,2.689,2.151,3.927l0.054-0.018
			c-0.144-1.614-0.18-3.084-0.18-4.967v-5.056h1.47v12.084h-1.578l-3.837-6.132c-0.843-1.345-1.649-2.726-2.241-4.034l-0.054,0.019
			c0.09,1.523,0.108,2.976,0.108,4.983v5.164H63.902z"/>
		<path fill="#FFFFFF" d="M79.034,253.14l-2.188,2.563h-1.111l1.578-2.563H79.034z M75.825,265.564v-8.678h1.578v8.678H75.825z"/>
		<path fill="#FFFFFF" d="M80.63,256.887l1.703,4.858c0.287,0.808,0.521,1.524,0.699,2.241h0.054
			c0.197-0.717,0.448-1.434,0.735-2.241l1.686-4.858h1.649l-3.407,8.678h-1.506l-3.299-8.678H80.63z"/>
		<path fill="#FFFFFF" d="M89.344,261.513c0.036,2.134,1.381,3.012,2.977,3.012c1.129,0,1.828-0.197,2.402-0.448l0.286,1.13
			c-0.556,0.251-1.523,0.556-2.904,0.556c-2.671,0-4.267-1.775-4.267-4.393c0-2.618,1.542-4.662,4.069-4.662
			c2.851,0,3.586,2.475,3.586,4.07c0,0.323-0.018,0.556-0.054,0.735H89.344z M93.97,260.383c0.018-0.986-0.413-2.546-2.188-2.546
			c-1.614,0-2.295,1.452-2.421,2.546H93.97z"/>
		<path fill="#FFFFFF" d="M97.447,252.835h1.578v12.729h-1.578V252.835z"/>
		<path fill="#FFFFFF" d="M105.479,259.235c0-0.914-0.018-1.632-0.071-2.349h1.398l0.09,1.435h0.035
			c0.431-0.807,1.435-1.614,2.869-1.614c1.201,0,3.065,0.718,3.065,3.693v5.164h-1.577v-5.002c0-1.398-0.521-2.564-2.009-2.564
			c-1.021,0-1.828,0.735-2.115,1.614c-0.071,0.197-0.107,0.466-0.107,0.734v5.218h-1.578V259.235z"/>
		<path fill="#FFFFFF" d="M121.526,263.484c0,0.753,0.036,1.488,0.126,2.08h-1.416l-0.126-1.094h-0.054
			c-0.484,0.682-1.416,1.291-2.653,1.291c-1.757,0-2.653-1.237-2.653-2.492c0-2.098,1.864-3.245,5.217-3.228v-0.179
			c0-0.699-0.197-2.009-1.972-1.99c-0.825,0-1.668,0.232-2.277,0.646l-0.358-1.058c0.717-0.448,1.774-0.754,2.868-0.754
			c2.653,0,3.299,1.812,3.299,3.532V263.484z M120.003,261.136c-1.722-0.035-3.676,0.27-3.676,1.954c0,1.04,0.682,1.507,1.471,1.507
			c1.147,0,1.882-0.718,2.133-1.453c0.055-0.179,0.072-0.358,0.072-0.502V261.136z"/>
		<path fill="#FFFFFF" d="M130.259,265.26c-0.412,0.197-1.326,0.502-2.492,0.502c-2.617,0-4.32-1.775-4.32-4.429
			c0-2.671,1.828-4.626,4.661-4.626c0.933,0,1.757,0.233,2.188,0.467l-0.358,1.201c-0.377-0.197-0.969-0.412-1.829-0.412
			c-1.99,0-3.065,1.487-3.065,3.28c0,2.009,1.291,3.245,3.012,3.245c0.896,0,1.488-0.215,1.937-0.412L130.259,265.26z"/>
		<path fill="#FFFFFF" d="M133.862,254.448c0,0.538-0.376,0.969-1.004,0.969c-0.573,0-0.95-0.431-0.95-0.969
			s0.395-0.986,0.986-0.986C133.469,253.462,133.862,253.893,133.862,254.448z M132.105,265.564v-8.678h1.578v8.678H132.105z"/>
		<path fill="#FFFFFF" d="M144.154,261.154c0,3.209-2.241,4.607-4.321,4.607c-2.331,0-4.159-1.722-4.159-4.465
			c0-2.886,1.918-4.59,4.303-4.59C142.469,256.707,144.154,258.519,144.154,261.154z M137.287,261.243
			c0,1.9,1.076,3.335,2.617,3.335c1.507,0,2.636-1.416,2.636-3.37c0-1.471-0.734-3.317-2.6-3.317
			C138.094,257.891,137.287,259.612,137.287,261.243z"/>
		<path fill="#FFFFFF" d="M146.145,259.235c0-0.914-0.018-1.632-0.071-2.349h1.398l0.09,1.435h0.035
			c0.431-0.807,1.435-1.614,2.869-1.614c1.201,0,3.065,0.718,3.065,3.693v5.164h-1.577v-5.002c0-1.398-0.521-2.564-2.009-2.564
			c-1.021,0-1.828,0.735-2.115,1.614c-0.071,0.197-0.107,0.466-0.107,0.734v5.218h-1.578V259.235z"/>
		<path fill="#FFFFFF" d="M162.191,263.484c0,0.753,0.036,1.488,0.126,2.08h-1.416l-0.126-1.094h-0.054
			c-0.484,0.682-1.416,1.291-2.653,1.291c-1.757,0-2.653-1.237-2.653-2.492c0-2.098,1.864-3.245,5.217-3.228v-0.179
			c0-0.699-0.197-2.009-1.972-1.99c-0.825,0-1.668,0.232-2.277,0.646l-0.358-1.058c0.717-0.448,1.774-0.754,2.868-0.754
			c2.653,0,3.299,1.812,3.299,3.532V263.484z M160.668,261.136c-1.722-0.035-3.676,0.27-3.676,1.954c0,1.04,0.682,1.507,1.471,1.507
			c1.147,0,1.882-0.718,2.133-1.453c0.055-0.179,0.072-0.358,0.072-0.502V261.136z"/>
		<path fill="#FFFFFF" d="M164.737,252.835h1.578v12.729h-1.578V252.835z"/>
	</g>
	<g>
		
			<line fill="none" stroke="#FFFFFF" stroke-width="2" stroke-linecap="round" stroke-linejoin="round" x1="117" y1="71.691" x2="117" y2="73.191"/>
		
			<line fill="none" stroke="#FFFFFF" stroke-width="2" stroke-linecap="round" stroke-linejoin="round" stroke-dasharray="2.8991,2.8991" x1="117" y1="76.09" x2="117" y2="97.834"/>
		
			<line fill="none" stroke="#FFFFFF" stroke-width="2" stroke-linecap="round" stroke-linejoin="round" x1="117" y1="99.284" x2="117" y2="100.784"/>
		<g>
			<polygon fill="#FFFFFF" points="109.594,95.167 117,98.313 124.406,95.167 117,112.723 			"/>
		</g>
	</g>
	<g>
		
			<line fill="none" stroke="#FFFFFF" stroke-width="2" stroke-linecap="round" stroke-linejoin="round" x1="117" y1="147.966" x2="117" y2="149.466"/>
		
			<line fill="none" stroke="#FFFFFF" stroke-width="2" stroke-linecap="round" stroke-linejoin="round" stroke-dasharray="2.8057,2.8057" x1="117" y1="152.271" x2="117" y2="167.703"/>
		
			<line fill="none" stroke="#FFFFFF" stroke-width="2" stroke-linecap="round" stroke-linejoin="round" x1="117" y1="169.105" x2="117" y2="170.605"/>
		<g>
			<polygon fill="#FFFFFF" points="109.594,164.988 117,168.135 124.406,164.988 117,182.545 			"/>
		</g>
	</g>
	<g>
		
			<line fill="none" stroke="#FFFFFF" stroke-width="2" stroke-linecap="round" stroke-linejoin="round" x1="117" y1="218.661" x2="117" y2="220.161"/>
		
			<line fill="none" stroke="#FFFFFF" stroke-width="2" stroke-linecap="round" stroke-linejoin="round" stroke-dasharray="3.1312,3.1312" x1="117" y1="223.292" x2="117" y2="227.989"/>
		
			<line fill="none" stroke="#FFFFFF" stroke-width="2" stroke-linecap="round" stroke-linejoin="round" x1="117" y1="229.555" x2="117" y2="231.055"/>
		<g>
			<polygon fill="#FFFFFF" points="109.594,225.438 117,228.584 124.406,225.438 117,242.994 			"/>
		</g>
	</g>
</g>
</svg>
