<?xml version="1.0" encoding="utf-8"?>
<!-- Generator: Adobe Illustrator 16.0.0, SVG Export Plug-In . SVG Version: 6.00 Build 0)  -->
<!DOCTYPE svg PUBLIC "-//W3C//DTD SVG 1.1//EN" "http://www.w3.org/Graphics/SVG/1.1/DTD/svg11.dtd">
<svg version="1.1" xmlns="http://www.w3.org/2000/svg" xmlns:xlink="http://www.w3.org/1999/xlink" x="0px" y="0px"
	 width="245.385px" height="223.008px" viewBox="0 0 245.385 223.008" enable-background="new 0 0 245.385 223.008"
	 xml:space="preserve">
<g id="Layer_3">
	<rect x="0" fill="#B9ACD4" width="245.385" height="223.008"/>
	<rect x="0" fill="#3F2D4C" width="245.385" height="74.489"/>
	<rect x="0" y="75.869" opacity="0.5" fill="#FFFFFF" width="245.385" height="48.384"/>
	<rect x="0" y="154.869" opacity="0.5" fill="#FFFFFF" width="245.385" height="24.191"/>
	<rect x="0" y="198.816" opacity="0.5" fill="#FFFFFF" width="245.385" height="24.191"/>
	<g>
		<path fill="#231F20" d="M68.786,94.704c-0.527,0.272-1.632,0.544-3.025,0.544c-3.23,0-5.645-2.04-5.645-5.813
			c0-3.604,2.432-6.018,5.984-6.018c1.41,0,2.328,0.306,2.719,0.51l-0.373,1.207c-0.545-0.272-1.344-0.476-2.295-0.476
			c-2.686,0-4.471,1.717-4.471,4.726c0,2.822,1.615,4.606,4.386,4.606c0.918,0,1.835-0.187,2.431-0.476L68.786,94.704z"/>
		<path fill="#231F20" d="M77.864,90.879c0,3.043-2.125,4.369-4.098,4.369c-2.209,0-3.943-1.632-3.943-4.232
			c0-2.737,1.819-4.352,4.08-4.352C76.266,86.664,77.864,88.38,77.864,90.879z M71.353,90.964c0,1.802,1.021,3.162,2.481,3.162
			c1.428,0,2.499-1.343,2.499-3.195c0-1.394-0.696-3.145-2.465-3.145C72.118,87.785,71.353,89.417,71.353,90.964z"/>
		<path fill="#231F20" d="M79.75,89.06c0-0.867-0.017-1.547-0.067-2.227h1.325l0.086,1.36h0.033c0.408-0.765,1.36-1.53,2.721-1.53
			c1.139,0,2.906,0.68,2.906,3.501v4.896h-1.496v-4.743c0-1.326-0.492-2.431-1.903-2.431c-0.97,0-1.733,0.697-2.006,1.53
			c-0.068,0.187-0.103,0.442-0.103,0.697v4.946H79.75V89.06z"/>
		<path fill="#231F20" d="M89.34,95.061v-7.088h-1.14v-1.139h1.14v-0.391c0-1.156,0.271-2.21,0.951-2.873
			c0.561-0.544,1.309-0.765,2.006-0.765c0.544,0,0.986,0.119,1.275,0.238l-0.205,1.156c-0.221-0.102-0.51-0.187-0.951-0.187
			c-1.275,0-1.598,1.105-1.598,2.38v0.442h1.988v1.139h-1.988v7.088H89.34z"/>
		<path fill="#231F20" d="M94.762,91.219c0.034,2.023,1.309,2.856,2.822,2.856c1.07,0,1.733-0.187,2.277-0.425l0.271,1.071
			c-0.526,0.238-1.444,0.527-2.754,0.527c-2.532,0-4.045-1.683-4.045-4.165c0-2.482,1.462-4.419,3.858-4.419
			c2.703,0,3.399,2.346,3.399,3.858c0,0.306-0.017,0.527-0.051,0.697H94.762z M99.148,90.148c0.017-0.935-0.392-2.414-2.073-2.414
			c-1.53,0-2.176,1.377-2.295,2.414H99.148z"/>
		<path fill="#231F20" d="M102.446,89.4c0-0.969-0.017-1.802-0.067-2.566h1.31l0.067,1.632h0.051
			c0.374-1.105,1.292-1.802,2.295-1.802c0.153,0,0.272,0.017,0.408,0.034v1.411c-0.153-0.034-0.306-0.034-0.511-0.034
			c-1.053,0-1.801,0.782-2.006,1.904c-0.033,0.204-0.051,0.459-0.051,0.697v4.386h-1.496V89.4z"/>
		<path fill="#231F20" d="M108.668,91.219c0.034,2.023,1.309,2.856,2.822,2.856c1.07,0,1.733-0.187,2.277-0.425l0.271,1.071
			c-0.526,0.238-1.444,0.527-2.754,0.527c-2.532,0-4.045-1.683-4.045-4.165c0-2.482,1.462-4.419,3.858-4.419
			c2.703,0,3.399,2.346,3.399,3.858c0,0.306-0.017,0.527-0.051,0.697H108.668z M113.054,90.148c0.017-0.935-0.392-2.414-2.073-2.414
			c-1.53,0-2.176,1.377-2.295,2.414H113.054z"/>
		<path fill="#231F20" d="M119.957,89.519c0-1.054-0.034-1.904-0.067-2.686h1.325l0.085,1.411h0.034
			c0.595-1.003,1.581-1.581,2.924-1.581c2.006,0,3.501,1.683,3.501,4.165c0,2.958-1.818,4.419-3.756,4.419
			c-1.088,0-2.04-0.476-2.533-1.292h-0.033v4.471h-1.479V89.519z M121.436,91.712c0,0.221,0.017,0.425,0.067,0.612
			c0.272,1.037,1.173,1.751,2.244,1.751c1.581,0,2.499-1.292,2.499-3.179c0-1.632-0.867-3.042-2.448-3.042
			c-1.021,0-1.989,0.714-2.261,1.835c-0.051,0.187-0.102,0.408-0.102,0.595V91.712z"/>
		<path fill="#231F20" d="M129.629,89.4c0-0.969-0.017-1.802-0.068-2.566h1.31l0.067,1.632h0.051
			c0.375-1.105,1.293-1.802,2.295-1.802c0.153,0,0.272,0.017,0.408,0.034v1.411c-0.152-0.034-0.306-0.034-0.51-0.034
			c-1.054,0-1.802,0.782-2.006,1.904c-0.033,0.204-0.051,0.459-0.051,0.697v4.386h-1.496V89.4z"/>
		<path fill="#231F20" d="M142.463,90.879c0,3.043-2.124,4.369-4.096,4.369c-2.21,0-3.943-1.632-3.943-4.232
			c0-2.737,1.818-4.352,4.079-4.352C140.866,86.664,142.463,88.38,142.463,90.879z M135.954,90.964c0,1.802,1.02,3.162,2.482,3.162
			c1.428,0,2.498-1.343,2.498-3.195c0-1.394-0.697-3.145-2.465-3.145C136.719,87.785,135.954,89.417,135.954,90.964z"/>
		<path fill="#231F20" d="M146.153,84.861v1.972h2.143v1.139h-2.143v4.437c0,1.02,0.289,1.598,1.123,1.598
			c0.408,0,0.646-0.034,0.866-0.102l0.068,1.139c-0.289,0.102-0.748,0.204-1.326,0.204c-0.696,0-1.258-0.238-1.614-0.629
			c-0.408-0.459-0.578-1.19-0.578-2.159v-4.488h-1.275v-1.139h1.275v-1.53L146.153,84.861z"/>
		<path fill="#231F20" d="M150.709,91.219c0.035,2.023,1.31,2.856,2.822,2.856c1.07,0,1.734-0.187,2.277-0.425l0.272,1.071
			c-0.526,0.238-1.444,0.527-2.754,0.527c-2.532,0-4.046-1.683-4.046-4.165c0-2.482,1.463-4.419,3.859-4.419
			c2.702,0,3.399,2.346,3.399,3.858c0,0.306-0.017,0.527-0.052,0.697H150.709z M155.096,90.148c0.017-0.935-0.392-2.414-2.074-2.414
			c-1.53,0-2.176,1.377-2.295,2.414H155.096z"/>
		<path fill="#231F20" d="M164.258,94.754c-0.34,0.17-1.121,0.459-2.142,0.476l-0.425,0.68c0.629,0.119,1.189,0.544,1.189,1.241
			c0,1.02-0.85,1.411-1.768,1.411c-0.391,0-0.867-0.102-1.189-0.289l0.255-0.765c0.255,0.153,0.595,0.238,0.935,0.238
			c0.391,0,0.73-0.136,0.73-0.544c-0.017-0.442-0.526-0.629-1.325-0.714l0.714-1.309c-2.091-0.255-3.434-1.87-3.434-4.148
			c0-2.516,1.734-4.368,4.42-4.368c0.883,0,1.666,0.221,2.073,0.442l-0.34,1.139c-0.356-0.187-0.918-0.391-1.733-0.391
			c-1.887,0-2.907,1.394-2.907,3.11c0,1.887,1.224,3.06,2.856,3.06c0.85,0,1.428-0.204,1.835-0.391L164.258,94.754z"/>
		<path fill="#231F20" d="M171.772,93.089c0,0.714,0.034,1.411,0.119,1.972h-1.343l-0.119-1.037h-0.051
			c-0.459,0.646-1.343,1.224-2.516,1.224c-1.666,0-2.517-1.173-2.517-2.363c0-1.989,1.769-3.077,4.947-3.06v-0.17
			c0-0.663-0.188-1.904-1.87-1.887c-0.782,0-1.581,0.221-2.159,0.612l-0.34-1.003c0.681-0.425,1.684-0.714,2.721-0.714
			c2.516,0,3.127,1.717,3.127,3.349V93.089z M166.707,85.422c-0.034-1.105,0.425-1.768,1.156-1.768c0.374,0,0.663,0.17,1.054,0.374
			c0.271,0.153,0.51,0.289,0.714,0.289c0.272,0,0.442-0.153,0.476-0.714h0.799c0.018,1.122-0.356,1.717-1.155,1.717
			c-0.374,0-0.696-0.17-1.054-0.357c-0.34-0.204-0.527-0.306-0.73-0.306c-0.272,0-0.408,0.289-0.443,0.765H166.707z M170.328,90.862
			c-1.632-0.034-3.485,0.255-3.485,1.853c0,0.986,0.646,1.428,1.395,1.428c1.088,0,1.785-0.68,2.022-1.377
			c0.052-0.17,0.068-0.34,0.068-0.476V90.862z"/>
		<path fill="#231F20" d="M181.631,90.879c0,3.043-2.124,4.369-4.096,4.369c-2.21,0-3.943-1.632-3.943-4.232
			c0-2.737,1.818-4.352,4.079-4.352C180.034,86.664,181.631,88.38,181.631,90.879z M175.122,90.964c0,1.802,1.02,3.162,2.482,3.162
			c1.428,0,2.498-1.343,2.498-3.195c0-1.394-0.697-3.145-2.465-3.145C175.887,87.785,175.122,89.417,175.122,90.964z"/>
		<path fill="#231F20" d="M66.61,115.171c-0.391,0.187-1.258,0.476-2.363,0.476c-2.481,0-4.096-1.683-4.096-4.199
			c0-2.533,1.733-4.385,4.419-4.385c0.884,0,1.666,0.221,2.073,0.442l-0.34,1.139c-0.356-0.187-0.918-0.391-1.733-0.391
			c-1.887,0-2.907,1.411-2.907,3.111c0,1.904,1.225,3.077,2.856,3.077c0.85,0,1.411-0.204,1.835-0.391L66.61,115.171z"/>
		<path fill="#231F20" d="M75.705,111.279c0,3.043-2.124,4.369-4.097,4.369c-2.209,0-3.943-1.632-3.943-4.232
			c0-2.737,1.818-4.352,4.08-4.352C74.107,107.063,75.705,108.78,75.705,111.279z M69.194,111.364c0,1.802,1.021,3.162,2.482,3.162
			c1.428,0,2.498-1.343,2.498-3.195c0-1.394-0.696-3.145-2.465-3.145C69.959,108.185,69.194,109.817,69.194,111.364z"/>
		<path fill="#231F20" d="M77.592,109.46c0-0.867-0.017-1.547-0.068-2.227h1.326l0.085,1.36h0.034c0.408-0.765,1.359-1.53,2.72-1.53
			c1.14,0,2.907,0.68,2.907,3.501v4.896H83.1v-4.743c0-1.326-0.493-2.431-1.904-2.431c-0.969,0-1.733,0.697-2.006,1.53
			c-0.068,0.187-0.102,0.442-0.102,0.697v4.946h-1.496V109.46z"/>
		<path fill="#231F20" d="M88.761,105.262v1.972h2.142v1.139h-2.142v4.437c0,1.02,0.289,1.598,1.122,1.598
			c0.408,0,0.646-0.034,0.867-0.102l0.068,1.139c-0.289,0.102-0.748,0.204-1.326,0.204c-0.697,0-1.258-0.238-1.615-0.629
			c-0.408-0.459-0.578-1.19-0.578-2.159v-4.488h-1.274v-1.139h1.274v-1.53L88.761,105.262z"/>
		<path fill="#231F20" d="M92.586,109.8c0-0.969-0.017-1.802-0.068-2.566h1.31l0.067,1.632h0.051
			c0.375-1.105,1.293-1.802,2.295-1.802c0.153,0,0.272,0.017,0.408,0.034v1.411c-0.152-0.034-0.306-0.034-0.51-0.034
			c-1.054,0-1.802,0.782-2.006,1.904c-0.033,0.204-0.051,0.459-0.051,0.697v4.386h-1.496V109.8z"/>
		<path fill="#231F20" d="M103.84,113.489c0,0.714,0.033,1.411,0.119,1.972h-1.344l-0.119-1.037h-0.051
			c-0.459,0.646-1.342,1.224-2.516,1.224c-1.666,0-2.516-1.173-2.516-2.363c0-1.989,1.768-3.077,4.947-3.06v-0.17
			c0-0.663-0.188-1.904-1.87-1.887c-0.782,0-1.581,0.221-2.159,0.612l-0.34-1.003c0.68-0.425,1.683-0.714,2.72-0.714
			c2.516,0,3.128,1.717,3.128,3.349V113.489z M102.395,111.262c-1.632-0.034-3.484,0.255-3.484,1.853
			c0,0.986,0.646,1.428,1.395,1.428c1.088,0,1.784-0.68,2.021-1.377c0.052-0.17,0.068-0.34,0.068-0.476V111.262z"/>
		<path fill="#231F20" d="M111.388,104.003v4.793h5.542v-4.793h1.496v11.457h-1.496v-5.372h-5.542v5.372h-1.495v-11.457H111.388z"/>
		<path fill="#231F20" d="M120.994,104.14c0.714-0.119,1.649-0.221,2.839-0.221c1.461,0,2.532,0.34,3.213,0.952
			c0.611,0.544,1.002,1.377,1.002,2.396c0,1.037-0.306,1.853-0.883,2.448c-0.8,0.833-2.058,1.258-3.502,1.258
			c-0.442,0-0.85-0.017-1.19-0.102v4.589h-1.479V104.14z M122.472,109.664c0.323,0.085,0.731,0.119,1.224,0.119
			c1.785,0,2.873-0.884,2.873-2.431c0-1.53-1.088-2.261-2.703-2.261c-0.646,0-1.139,0.051-1.394,0.119V109.664z"/>
		<path fill="#231F20" d="M132.553,115.46l-3.757-11.457h1.615l1.784,5.644c0.477,1.547,0.901,2.941,1.225,4.284h0.033
			c0.323-1.326,0.782-2.771,1.31-4.267l1.938-5.661h1.581l-4.097,11.457H132.553z"/>
		<path fill="#231F20" d="M144.877,105.262v1.972h2.143v1.139h-2.143v4.437c0,1.02,0.289,1.598,1.123,1.598
			c0.408,0,0.646-0.034,0.866-0.102l0.068,1.139c-0.289,0.102-0.748,0.204-1.326,0.204c-0.696,0-1.258-0.238-1.614-0.629
			c-0.408-0.459-0.578-1.19-0.578-2.159v-4.488h-1.275v-1.139h1.275v-1.53L144.877,105.262z"/>
		<path fill="#231F20" d="M150.37,104.921c0,0.51-0.357,0.918-0.953,0.918c-0.543,0-0.9-0.408-0.9-0.918
			c0-0.51,0.374-0.935,0.936-0.935C149.995,103.987,150.37,104.395,150.37,104.921z M148.704,115.46v-8.227h1.496v8.227H148.704z"/>
		<path fill="#231F20" d="M152.681,109.919c0-1.054-0.034-1.904-0.067-2.686h1.325l0.085,1.411h0.034
			c0.595-1.003,1.581-1.581,2.924-1.581c2.006,0,3.501,1.683,3.501,4.165c0,2.958-1.818,4.419-3.756,4.419
			c-1.088,0-2.04-0.476-2.533-1.292h-0.033v4.471h-1.479V109.919z M154.161,112.112c0,0.221,0.017,0.425,0.067,0.612
			c0.272,1.037,1.173,1.751,2.244,1.751c1.581,0,2.499-1.292,2.499-3.179c0-1.632-0.867-3.043-2.448-3.043
			c-1.021,0-1.989,0.714-2.261,1.836c-0.051,0.187-0.102,0.408-0.102,0.595V112.112z"/>
		<path fill="#231F20" d="M169.799,111.279c0,3.043-2.125,4.369-4.097,4.369c-2.21,0-3.943-1.632-3.943-4.232
			c0-2.737,1.819-4.352,4.079-4.352C168.202,107.063,169.799,108.78,169.799,111.279z M163.29,111.364
			c0,1.802,1.02,3.162,2.481,3.162c1.428,0,2.499-1.343,2.499-3.195c0-1.394-0.697-3.145-2.465-3.145
			C164.054,108.185,163.29,109.817,163.29,111.364z"/>
		<path fill="#231F20" d="M171.483,113.948c0.459,0.272,1.241,0.578,1.989,0.578c1.071,0,1.581-0.527,1.581-1.224
			c0-0.714-0.426-1.088-1.514-1.496c-1.496-0.544-2.192-1.343-2.192-2.329c0-1.326,1.088-2.414,2.839-2.414
			c0.833,0,1.563,0.221,2.006,0.51l-0.357,1.088c-0.322-0.204-0.918-0.493-1.683-0.493c-0.884,0-1.36,0.51-1.36,1.122
			c0,0.68,0.477,0.986,1.547,1.411c1.411,0.527,2.159,1.241,2.159,2.464c0,1.462-1.139,2.482-3.06,2.482
			c-0.9,0-1.734-0.238-2.312-0.578L171.483,113.948z"/>
		<path fill="#231F20" d="M178.079,108.593c0-0.629,0.426-1.071,1.004-1.071c0.611,0,1.002,0.442,1.002,1.071
			c0,0.595-0.391,1.054-1.02,1.054C178.487,109.647,178.079,109.188,178.079,108.593z M178.079,114.594
			c0-0.629,0.426-1.071,1.004-1.071c0.611,0,1.002,0.442,1.002,1.071c0,0.595-0.391,1.054-1.02,1.054
			C178.487,115.647,178.079,115.188,178.079,114.594z"/>
	</g>
	<g>
		<g>
			<path fill="#231F20" d="M125.404,138.065c-0.306-0.017-0.696,0.017-1.122,0.085c-2.363,0.374-3.586,2.074-3.842,3.91h0.034
				c0.527-0.714,1.462-1.292,2.687-1.292c1.954,0,3.331,1.428,3.331,3.57c0,2.04-1.377,3.91-3.688,3.91
				c-2.346,0-3.893-1.836-3.893-4.709c0-2.176,0.765-3.893,1.869-4.98c0.918-0.901,2.143-1.462,3.536-1.632
				c0.442-0.068,0.815-0.085,1.088-0.085V138.065z M124.979,144.439c0-1.581-0.9-2.532-2.277-2.532c-0.901,0-1.752,0.544-2.159,1.36
				c-0.085,0.17-0.153,0.373-0.153,0.646c0.018,1.819,0.867,3.179,2.447,3.179C124.112,147.092,124.979,146.021,124.979,144.439z"/>
		</g>
	</g>
	<g>
		<g>
			<path fill="#231F20" d="M117.984,162.105h-0.034l-1.921,1.037l-0.289-1.139l2.414-1.292h1.274v11.049h-1.444V162.105z"/>
			<path fill="#231F20" d="M126.705,162.105h-0.034l-1.921,1.037l-0.289-1.139l2.414-1.292h1.274v11.049h-1.444V162.105z"/>
		</g>
	</g>
	<g>
		<g>
			<path fill="#231F20" d="M117.984,185.105h-0.034l-1.921,1.037l-0.289-1.139l2.414-1.292h1.274v11.049h-1.444V185.105z"/>
			<path fill="#231F20" d="M129.764,184.766c-0.307-0.018-0.697,0.018-1.122,0.085c-2.362,0.374-3.587,2.073-3.841,3.909h0.033
				c0.527-0.713,1.462-1.291,2.686-1.291c1.955,0,3.332,1.428,3.332,3.569c0,2.04-1.377,3.909-3.688,3.909
				c-2.346,0-3.893-1.836-3.893-4.708c0-2.176,0.765-3.893,1.87-4.98c0.918-0.901,2.141-1.462,3.535-1.632
				c0.441-0.068,0.816-0.085,1.088-0.085V184.766z M129.339,191.141c0-1.582-0.901-2.533-2.278-2.533c-0.9,0-1.75,0.544-2.158,1.359
				c-0.085,0.17-0.153,0.375-0.153,0.646c0.017,1.818,0.867,3.179,2.448,3.179C128.472,193.792,129.339,192.721,129.339,191.141z"/>
		</g>
	</g>
	<g>
		<g>
			<path fill="#231F20" d="M117.984,206.105h-0.034l-1.921,1.037l-0.289-1.139l2.414-1.292h1.274v11.049h-1.444V206.105z"/>
			<path fill="#231F20" d="M125.498,209.947c-1.241-0.578-1.768-1.529-1.768-2.481c0-1.751,1.479-2.94,3.434-2.94
				c2.142,0,3.229,1.325,3.229,2.719c0,0.936-0.477,1.955-1.836,2.584v0.051c1.377,0.545,2.227,1.53,2.227,2.855
				c0,1.938-1.648,3.213-3.756,3.213c-2.313,0-3.706-1.359-3.706-2.975c0-1.394,0.833-2.396,2.192-2.975L125.498,209.947z
				 M129.271,212.889c0-1.326-0.935-1.989-2.431-2.414c-1.292,0.373-1.988,1.24-1.988,2.295c-0.051,1.104,0.799,2.09,2.209,2.09
				C128.405,214.859,129.271,214.027,129.271,212.889z M125.158,207.363c-0.017,1.105,0.833,1.7,2.108,2.04
				c0.951-0.323,1.682-1.003,1.682-2.006c0-0.884-0.526-1.802-1.869-1.802C125.837,205.596,125.158,206.412,125.158,207.363z"/>
		</g>
	</g>
	<g>
		<path fill="#FFFFFF" d="M35.669,32.291L31.03,18.14h1.994l2.205,6.971c0.588,1.911,1.112,3.632,1.512,5.291h0.041
			c0.399-1.638,0.967-3.422,1.617-5.27l2.394-6.992h1.952l-5.06,14.151H35.669z"/>
		<path fill="#FFFFFF" d="M50.663,29.855c0,0.882,0.042,1.743,0.146,2.436h-1.658l-0.146-1.281h-0.063
			c-0.567,0.798-1.659,1.512-3.107,1.512c-2.058,0-3.107-1.449-3.107-2.918c0-2.457,2.184-3.8,6.11-3.779v-0.21
			c0-0.819-0.231-2.352-2.311-2.331c-0.965,0-1.952,0.273-2.666,0.756l-0.42-1.239c0.84-0.525,2.078-0.882,3.359-0.882
			c3.107,0,3.863,2.121,3.863,4.136V29.855z M48.877,27.105c-2.016-0.042-4.304,0.315-4.304,2.289c0,1.218,0.798,1.764,1.722,1.764
			c1.344,0,2.205-0.84,2.498-1.701c0.063-0.21,0.084-0.42,0.084-0.588V27.105z"/>
		<path fill="#FFFFFF" d="M60.889,31.934c-0.482,0.231-1.553,0.588-2.918,0.588c-3.065,0-5.061-2.079-5.061-5.186
			c0-3.128,2.143-5.417,5.459-5.417c1.092,0,2.059,0.273,2.563,0.546l-0.42,1.407c-0.441-0.231-1.135-0.483-2.143-0.483
			c-2.33,0-3.59,1.743-3.59,3.842c0,2.352,1.512,3.8,3.527,3.8c1.05,0,1.742-0.252,2.268-0.483L60.889,31.934z"/>
		<path fill="#FFFFFF" d="M65.112,19.273c0,0.63-0.441,1.134-1.176,1.134c-0.672,0-1.113-0.504-1.113-1.134s0.462-1.155,1.154-1.155
			C64.649,18.119,65.112,18.623,65.112,19.273z M63.053,32.291V22.129h1.848v10.162H63.053z"/>
		<path fill="#FFFFFF" d="M67.967,24.879c0-1.071-0.021-1.911-0.084-2.75h1.639l0.104,1.68h0.042c0.504-0.945,1.68-1.89,3.359-1.89
			c1.406,0,3.59,0.84,3.59,4.325v6.047H74.77v-5.858c0-1.638-0.608-3.002-2.352-3.002c-1.196,0-2.141,0.861-2.477,1.89
			c-0.084,0.231-0.127,0.546-0.127,0.861v6.11h-1.848V24.879z"/>
		<path fill="#FFFFFF" d="M86.761,29.855c0,0.882,0.042,1.743,0.147,2.436H85.25l-0.147-1.281H85.04
			c-0.566,0.798-1.658,1.512-3.107,1.512c-2.058,0-3.107-1.449-3.107-2.918c0-2.457,2.184-3.8,6.109-3.779v-0.21
			c0-0.819-0.23-2.352-2.309-2.331c-0.967,0-1.953,0.273-2.667,0.756l-0.42-1.239c0.84-0.525,2.079-0.882,3.359-0.882
			c3.107,0,3.863,2.121,3.863,4.136V29.855z M84.977,27.105c-2.016-0.042-4.305,0.315-4.305,2.289c0,1.218,0.798,1.764,1.722,1.764
			c1.344,0,2.204-0.84,2.499-1.701c0.063-0.21,0.084-0.42,0.084-0.588V27.105z"/>
		<path fill="#FFFFFF" d="M101.125,30.737h-0.043c-0.566,0.987-1.68,1.785-3.316,1.785c-2.373,0-4.305-2.037-4.305-5.123
			c0-3.821,2.457-5.48,4.598-5.48c1.575,0,2.625,0.777,3.129,1.743h0.042l0.063-1.533h1.742c-0.042,0.84-0.084,1.743-0.084,2.792
			v11.527h-1.826V30.737z M101.125,26.244c0-0.252-0.021-0.525-0.084-0.756c-0.295-1.134-1.26-2.1-2.646-2.1
			c-1.91,0-3.064,1.617-3.064,3.884c0,2.037,0.965,3.779,3.002,3.779c1.197,0,2.226-0.735,2.646-1.995
			c0.084-0.273,0.147-0.63,0.147-0.903V26.244z"/>
		<path fill="#FFFFFF" d="M114.522,29.499c0,1.071,0.021,1.995,0.084,2.792h-1.637l-0.105-1.659h-0.042
			c-0.462,0.819-1.554,1.89-3.359,1.89c-1.596,0-3.507-0.903-3.507-4.451v-5.942h1.848v5.606c0,1.932,0.609,3.254,2.268,3.254
			c1.239,0,2.1-0.861,2.436-1.701c0.105-0.252,0.168-0.588,0.168-0.945v-6.215h1.848V29.499z"/>
		<path fill="#FFFFFF" d="M124.729,29.855c0,0.882,0.041,1.743,0.146,2.436h-1.658l-0.147-1.281h-0.063
			c-0.566,0.798-1.658,1.512-3.107,1.512c-2.057,0-3.107-1.449-3.107-2.918c0-2.457,2.184-3.8,6.11-3.779v-0.21
			c0-0.819-0.231-2.352-2.31-2.331c-0.966,0-1.953,0.273-2.666,0.756l-0.42-1.239c0.84-0.525,2.078-0.882,3.359-0.882
			c3.107,0,3.863,2.121,3.863,4.136V29.855z M122.944,27.105c-2.016-0.042-4.305,0.315-4.305,2.289c0,1.218,0.799,1.764,1.723,1.764
			c1.344,0,2.204-0.84,2.498-1.701c0.063-0.21,0.084-0.42,0.084-0.588V27.105z"/>
		<path fill="#FFFFFF" d="M136.467,17.384v12.283c0,0.903,0.042,1.932,0.084,2.625h-1.638l-0.084-1.764h-0.063
			c-0.545,1.134-1.764,1.995-3.422,1.995c-2.457,0-4.367-2.079-4.367-5.165c-0.021-3.38,2.1-5.438,4.557-5.438
			c1.574,0,2.604,0.735,3.064,1.533h0.043v-6.068H136.467z M134.641,26.265c0-0.231-0.021-0.546-0.084-0.777
			c-0.273-1.155-1.281-2.121-2.667-2.121c-1.911,0-3.044,1.68-3.044,3.905c0,2.058,1.028,3.758,3.002,3.758
			c1.238,0,2.373-0.84,2.709-2.205c0.063-0.252,0.084-0.504,0.084-0.798V26.265z"/>
		<path fill="#FFFFFF" d="M139.555,25.299c0-1.197-0.021-2.226-0.084-3.17h1.617l0.084,2.016h0.063
			c0.463-1.365,1.596-2.226,2.835-2.226c0.188,0,0.336,0.021,0.504,0.042v1.743c-0.188-0.042-0.378-0.042-0.63-0.042
			c-1.302,0-2.226,0.966-2.478,2.352c-0.042,0.252-0.063,0.567-0.063,0.861v5.417h-1.848V25.299z"/>
		<path fill="#FFFFFF" d="M148.564,19.273c0,0.63-0.44,1.134-1.176,1.134c-0.672,0-1.112-0.504-1.112-1.134s0.461-1.155,1.154-1.155
			C148.102,18.119,148.564,18.623,148.564,19.273z M146.506,32.291V22.129h1.848v10.162H146.506z"/>
		<path fill="#FFFFFF" d="M152.134,22.129l1.995,5.69c0.336,0.945,0.608,1.785,0.818,2.625h0.063c0.231-0.84,0.525-1.68,0.861-2.625
			l1.974-5.69h1.932l-3.989,10.162h-1.764l-3.863-10.162H152.134z"/>
		<path fill="#FFFFFF" d="M168.576,29.855c0,0.882,0.042,1.743,0.147,2.436h-1.659l-0.147-1.281h-0.063
			c-0.566,0.798-1.658,1.512-3.107,1.512c-2.058,0-3.107-1.449-3.107-2.918c0-2.457,2.184-3.8,6.109-3.779v-0.21
			c0-0.819-0.23-2.352-2.309-2.331c-0.967,0-1.953,0.273-2.667,0.756l-0.42-1.239c0.84-0.525,2.079-0.882,3.359-0.882
			c3.107,0,3.863,2.121,3.863,4.136V29.855z M166.792,27.105c-2.016-0.042-4.305,0.315-4.305,2.289c0,1.218,0.798,1.764,1.722,1.764
			c1.344,0,2.204-0.84,2.499-1.701c0.063-0.21,0.084-0.42,0.084-0.588V27.105z"/>
		<path fill="#FFFFFF" d="M171.559,17.384h1.848v14.907h-1.848V17.384z"/>
		<path fill="#FFFFFF" d="M177.543,27.546c0.043,2.499,1.617,3.527,3.486,3.527c1.322,0,2.141-0.231,2.813-0.525l0.336,1.323
			c-0.65,0.294-1.784,0.651-3.4,0.651c-3.129,0-4.998-2.079-4.998-5.144s1.807-5.459,4.767-5.459c3.339,0,4.199,2.897,4.199,4.766
			c0,0.378-0.021,0.651-0.063,0.861H177.543z M182.961,26.223c0.021-1.155-0.483-2.981-2.563-2.981
			c-1.889,0-2.688,1.701-2.834,2.981H182.961z"/>
		<path fill="#FFFFFF" d="M187.036,24.879c0-1.071-0.021-1.911-0.084-2.75h1.639l0.104,1.68h0.042c0.504-0.945,1.68-1.89,3.359-1.89
			c1.406,0,3.59,0.84,3.59,4.325v6.047h-1.848v-5.858c0-1.638-0.608-3.002-2.352-3.002c-1.196,0-2.141,0.861-2.477,1.89
			c-0.084,0.231-0.127,0.546-0.127,0.861v6.11h-1.848V24.879z"/>
		<path fill="#FFFFFF" d="M200.833,19.693v2.436h2.646v1.407h-2.646v5.48c0,1.26,0.357,1.974,1.386,1.974
			c0.504,0,0.798-0.042,1.071-0.126l0.084,1.407c-0.357,0.126-0.924,0.252-1.639,0.252c-0.86,0-1.553-0.294-1.994-0.777
			c-0.504-0.567-0.714-1.47-0.714-2.667v-5.543h-1.575v-1.407h1.575v-1.89L200.833,19.693z"/>
		<path fill="#FFFFFF" d="M206.46,27.546c0.042,2.499,1.616,3.527,3.485,3.527c1.322,0,2.142-0.231,2.813-0.525l0.336,1.323
			c-0.651,0.294-1.784,0.651-3.401,0.651c-3.129,0-4.997-2.079-4.997-5.144s1.806-5.459,4.767-5.459
			c3.338,0,4.199,2.897,4.199,4.766c0,0.378-0.021,0.651-0.063,0.861H206.46z M211.877,26.223c0.021-1.155-0.482-2.981-2.562-2.981
			c-1.89,0-2.688,1.701-2.835,2.981H211.877z"/>
		<path fill="#FFFFFF" d="M17.126,50.5c0-1.197-0.021-2.226-0.084-3.17h1.616l0.084,2.016h0.063
			c0.462-1.365,1.596-2.226,2.835-2.226c0.188,0,0.336,0.021,0.504,0.042v1.743c-0.189-0.042-0.379-0.042-0.631-0.042
			c-1.301,0-2.225,0.966-2.477,2.352c-0.043,0.252-0.063,0.567-0.063,0.861v5.417h-1.848V50.5z"/>
		<path fill="#FFFFFF" d="M24.812,52.746c0.042,2.499,1.616,3.527,3.485,3.527c1.322,0,2.142-0.231,2.813-0.525l0.336,1.323
			c-0.651,0.294-1.784,0.651-3.401,0.651c-3.129,0-4.997-2.079-4.997-5.144s1.806-5.459,4.767-5.459
			c3.338,0,4.199,2.897,4.199,4.766c0,0.378-0.021,0.651-0.063,0.861H24.812z M30.229,51.423c0.021-1.155-0.482-2.981-2.562-2.981
			c-1.89,0-2.688,1.701-2.835,2.981H30.229z"/>
		<path fill="#FFFFFF" d="M41.547,57.134c-0.482,0.231-1.553,0.588-2.918,0.588c-3.065,0-5.061-2.079-5.061-5.186
			c0-3.128,2.143-5.417,5.459-5.417c1.092,0,2.059,0.273,2.563,0.546l-0.42,1.407c-0.441-0.231-1.135-0.483-2.143-0.483
			c-2.33,0-3.59,1.743-3.59,3.842c0,2.352,1.512,3.8,3.527,3.8c1.05,0,1.742-0.252,2.268-0.483L41.547,57.134z"/>
		<path fill="#FFFFFF" d="M52.783,52.326c0,3.758-2.624,5.396-5.06,5.396c-2.73,0-4.871-2.016-4.871-5.228
			c0-3.38,2.246-5.375,5.039-5.375C50.809,47.119,52.783,49.24,52.783,52.326z M44.741,52.431c0,2.226,1.26,3.905,3.066,3.905
			c1.764,0,3.086-1.659,3.086-3.947c0-1.722-0.861-3.884-3.045-3.884C45.686,48.505,44.741,50.521,44.741,52.431z"/>
		<path fill="#FFFFFF" d="M55.116,50.08c0-1.071-0.043-1.911-0.084-2.75h1.616l0.084,1.659h0.063
			c0.566-0.966,1.512-1.869,3.212-1.869c1.364,0,2.415,0.84,2.855,2.037h0.042c0.314-0.588,0.734-1.008,1.154-1.323
			c0.609-0.462,1.26-0.714,2.227-0.714c1.364,0,3.359,0.882,3.359,4.409v5.963h-1.807v-5.732c0-1.974-0.734-3.128-2.204-3.128
			c-1.071,0-1.868,0.777-2.204,1.659c-0.084,0.273-0.147,0.588-0.147,0.924v6.278h-1.806v-6.089c0-1.617-0.714-2.771-2.121-2.771
			c-1.133,0-1.994,0.924-2.288,1.848c-0.104,0.252-0.147,0.588-0.147,0.903v6.11h-1.805V50.08z"/>
		<path fill="#FFFFFF" d="M72.629,42.584h1.826v6.383h0.043c0.65-1.134,1.826-1.848,3.464-1.848c2.54,0,4.304,2.1,4.304,5.165
			c0,3.632-2.309,5.438-4.576,5.438c-1.471,0-2.646-0.567-3.423-1.89h-0.042l-0.105,1.659h-1.574
			c0.042-0.693,0.084-1.722,0.084-2.625V42.584z M74.456,53.418c0,0.231,0.021,0.462,0.084,0.672
			c0.336,1.281,1.428,2.163,2.771,2.163c1.953,0,3.087-1.575,3.087-3.905c0-2.037-1.05-3.779-3.044-3.779
			c-1.239,0-2.415,0.882-2.793,2.268c-0.063,0.231-0.105,0.483-0.105,0.777V53.418z"/>
		<path fill="#FFFFFF" d="M86.635,44.474c0,0.63-0.44,1.134-1.176,1.134c-0.672,0-1.112-0.504-1.112-1.134s0.462-1.155,1.155-1.155
			C86.174,43.319,86.635,43.823,86.635,44.474z M84.579,57.491V47.329h1.848v10.162H84.579z"/>
		<path fill="#FFFFFF" d="M89.493,50.08c0-1.071-0.021-1.911-0.084-2.75h1.637l0.105,1.68h0.042c0.504-0.945,1.68-1.89,3.359-1.89
			c1.407,0,3.591,0.84,3.591,4.325v6.047h-1.848v-5.858c0-1.638-0.609-3.002-2.352-3.002c-1.197,0-2.143,0.861-2.479,1.89
			c-0.084,0.231-0.125,0.546-0.125,0.861v6.11h-1.848V50.08z"/>
		<path fill="#FFFFFF" d="M108.286,55.056c0,0.882,0.042,1.743,0.146,2.436h-1.658l-0.146-1.281h-0.063
			c-0.567,0.798-1.659,1.512-3.107,1.512c-2.058,0-3.107-1.449-3.107-2.918c0-2.457,2.184-3.8,6.11-3.779v-0.21
			c0-0.819-0.231-2.352-2.311-2.331c-0.965,0-1.952,0.273-2.666,0.756l-0.42-1.239c0.84-0.525,2.078-0.882,3.359-0.882
			c3.107,0,3.863,2.121,3.863,4.136V55.056z M106.5,52.305c-2.016-0.042-4.304,0.315-4.304,2.289c0,1.218,0.798,1.764,1.722,1.764
			c1.344,0,2.205-0.84,2.498-1.701c0.063-0.21,0.084-0.42,0.084-0.588V52.305z"/>
		<path fill="#FFFFFF" d="M111.269,50.08c0-1.071-0.021-1.911-0.084-2.75h1.638l0.105,1.68h0.041c0.504-0.945,1.68-1.89,3.359-1.89
			c1.407,0,3.591,0.84,3.591,4.325v6.047h-1.848v-5.858c0-1.638-0.608-3.002-2.352-3.002c-1.196,0-2.142,0.861-2.478,1.89
			c-0.084,0.231-0.126,0.546-0.126,0.861v6.11h-1.848V50.08z"/>
		<path fill="#FFFFFF" d="M125.065,44.894v2.436h2.646v1.407h-2.646v5.48c0,1.26,0.357,1.974,1.387,1.974
			c0.504,0,0.797-0.042,1.07-0.126l0.084,1.407c-0.357,0.126-0.924,0.252-1.638,0.252c-0.86,0-1.554-0.294-1.995-0.777
			c-0.504-0.567-0.713-1.47-0.713-2.667v-5.543h-1.575v-1.407h1.575v-1.89L125.065,44.894z"/>
		<path fill="#FFFFFF" d="M130.694,52.746c0.041,2.499,1.616,3.527,3.484,3.527c1.323,0,2.143-0.231,2.814-0.525l0.336,1.323
			c-0.651,0.294-1.785,0.651-3.402,0.651c-3.128,0-4.996-2.079-4.996-5.144s1.805-5.459,4.766-5.459
			c3.338,0,4.199,2.897,4.199,4.766c0,0.378-0.021,0.651-0.063,0.861H130.694z M136.11,51.423c0.021-1.155-0.482-2.981-2.561-2.981
			c-1.891,0-2.688,1.701-2.835,2.981H136.11z"/>
		<path fill="#FFFFFF" d="M148.626,42.92c-1.532,2.079-2.624,4.787-2.624,8.608c0,3.737,1.154,6.404,2.624,8.503h-1.428
			c-1.323-1.743-2.751-4.43-2.751-8.524c0.021-4.115,1.428-6.824,2.751-8.587H148.626z"/>
		<path fill="#FFFFFF" d="M161.205,56.861c-0.819,0.315-2.456,0.777-4.367,0.777c-2.142,0-3.905-0.546-5.291-1.869
			c-1.218-1.176-1.974-3.065-1.974-5.27c0-4.22,2.918-7.307,7.664-7.307c1.637,0,2.939,0.357,3.548,0.651l-0.462,1.491
			c-0.756-0.357-1.701-0.609-3.129-0.609c-3.443,0-5.689,2.142-5.689,5.69c0,3.59,2.142,5.711,5.459,5.711
			c1.197,0,2.016-0.168,2.436-0.378v-4.22h-2.855v-1.47h4.661V56.861z"/>
		<path fill="#FFFFFF" d="M171.221,55.056c0,0.882,0.043,1.743,0.147,2.436h-1.659l-0.146-1.281H169.5
			c-0.567,0.798-1.659,1.512-3.107,1.512c-2.059,0-3.107-1.449-3.107-2.918c0-2.457,2.184-3.8,6.109-3.779v-0.21
			c0-0.819-0.23-2.352-2.31-2.331c-0.966,0-1.952,0.273-2.667,0.756l-0.42-1.239c0.84-0.525,2.079-0.882,3.359-0.882
			c3.107,0,3.863,2.121,3.863,4.136V55.056z M169.437,52.305c-2.016-0.042-4.304,0.315-4.304,2.289c0,1.218,0.797,1.764,1.721,1.764
			c1.344,0,2.205-0.84,2.499-1.701c0.063-0.21,0.084-0.42,0.084-0.588V52.305z"/>
		<path fill="#FFFFFF" d="M174.206,50.5c0-1.197-0.021-2.226-0.084-3.17h1.616l0.084,2.016h0.063
			c0.461-1.365,1.596-2.226,2.834-2.226c0.189,0,0.336,0.021,0.504,0.042v1.743c-0.189-0.042-0.378-0.042-0.63-0.042
			c-1.302,0-2.226,0.966-2.478,2.352c-0.042,0.252-0.063,0.567-0.063,0.861v5.417h-1.848V50.5z"/>
		<path fill="#FFFFFF" d="M189.618,42.584v12.283c0,0.903,0.042,1.932,0.084,2.625h-1.638l-0.084-1.764h-0.063
			c-0.545,1.134-1.764,1.995-3.422,1.995c-2.457,0-4.367-2.079-4.367-5.165c-0.021-3.38,2.1-5.438,4.557-5.438
			c1.574,0,2.604,0.735,3.064,1.533h0.043v-6.068H189.618z M187.792,51.465c0-0.231-0.021-0.546-0.084-0.777
			c-0.273-1.155-1.281-2.121-2.667-2.121c-1.911,0-3.044,1.68-3.044,3.905c0,2.058,1.028,3.758,3.002,3.758
			c1.238,0,2.373-0.84,2.709-2.205c0.063-0.252,0.084-0.504,0.084-0.798V51.465z"/>
		<path fill="#FFFFFF" d="M199.844,55.056c0,0.882,0.043,1.743,0.147,2.436h-1.659l-0.146-1.281h-0.063
			c-0.567,0.798-1.659,1.512-3.107,1.512c-2.059,0-3.107-1.449-3.107-2.918c0-2.457,2.184-3.8,6.109-3.779v-0.21
			c0-0.819-0.23-2.352-2.31-2.331c-0.966,0-1.952,0.273-2.667,0.756l-0.42-1.239c0.84-0.525,2.079-0.882,3.359-0.882
			c3.107,0,3.863,2.121,3.863,4.136V55.056z M198.06,52.305c-2.016-0.042-4.304,0.315-4.304,2.289c0,1.218,0.797,1.764,1.721,1.764
			c1.344,0,2.205-0.84,2.499-1.701c0.063-0.21,0.084-0.42,0.084-0.588V52.305z"/>
		<path fill="#FFFFFF" d="M202.577,55.623c0.566,0.336,1.532,0.714,2.456,0.714c1.323,0,1.952-0.651,1.952-1.512
			c0-0.882-0.524-1.344-1.868-1.848c-1.848-0.672-2.708-1.659-2.708-2.876c0-1.638,1.344-2.981,3.506-2.981
			c1.029,0,1.932,0.273,2.478,0.63l-0.44,1.344c-0.399-0.252-1.135-0.609-2.079-0.609c-1.092,0-1.68,0.63-1.68,1.386
			c0,0.84,0.588,1.218,1.911,1.743c1.742,0.651,2.666,1.533,2.666,3.044c0,1.806-1.406,3.065-3.779,3.065
			c-1.113,0-2.142-0.294-2.855-0.714L202.577,55.623z"/>
		<path fill="#FFFFFF" d="M213.202,44.474c0,0.63-0.441,1.134-1.176,1.134c-0.672,0-1.113-0.504-1.113-1.134
			s0.463-1.155,1.155-1.155C212.74,43.319,213.202,43.823,213.202,44.474z M211.144,57.491V47.329h1.848v10.162H211.144z"/>
		<path fill="#FFFFFF" d="M216.057,42.584h1.848v14.907h-1.848V42.584z"/>
		<path fill="#FFFFFF" d="M227.417,46.594c0,1.932-1.553,3.464-3.527,3.464c-1.973,0-3.549-1.533-3.549-3.464
			s1.576-3.443,3.57-3.443C225.864,43.151,227.417,44.663,227.417,46.594z M221.223,46.594c0,1.533,1.154,2.75,2.688,2.75
			c1.49,0.021,2.625-1.218,2.625-2.729c0-1.533-1.135-2.771-2.668-2.771C222.377,43.844,221.223,45.083,221.223,46.594z
			 M223.344,48.379h-0.799v-3.443c0.314-0.042,0.756-0.105,1.322-0.105c0.652,0,0.945,0.105,1.176,0.273
			c0.211,0.147,0.357,0.399,0.357,0.735c0,0.42-0.314,0.693-0.713,0.819v0.042c0.336,0.105,0.504,0.378,0.607,0.84
			c0.105,0.525,0.189,0.714,0.252,0.84h-0.84c-0.104-0.126-0.168-0.42-0.271-0.84c-0.064-0.357-0.273-0.525-0.715-0.525h-0.377
			V48.379z M223.364,46.447h0.379c0.441,0,0.797-0.147,0.797-0.504c0-0.315-0.23-0.525-0.734-0.525
			c-0.209,0-0.357,0.021-0.441,0.042V46.447z"/>
		<path fill="#FFFFFF" d="M228.7,60.032c1.469-2.079,2.623-4.787,2.623-8.566s-1.133-6.446-2.623-8.545h1.428
			c1.322,1.722,2.75,4.43,2.75,8.545c-0.021,4.115-1.428,6.803-2.75,8.566H228.7z"/>
	</g>
</g>
<g id="Layer_2" display="none" opacity="0.5">
	<g display="inline">
		<g>
			<defs>
				<polygon id="SVGID_1_" points="59.028,264.082 421.953,264.082 421.953,-6.319 59.028,-6.319 59.028,264.082 				"/>
			</defs>
			<clipPath id="SVGID_2_">
				<use xlink:href="#SVGID_1_"  overflow="visible"/>
			</clipPath>
			<g clip-path="url(#SVGID_2_)">
				<defs>
					<polygon id="SVGID_3_" points="59.028,264.094 421.947,264.094 421.947,-6.319 59.028,-6.319 59.028,264.094 					"/>
				</defs>
				<clipPath id="SVGID_4_">
					<use xlink:href="#SVGID_3_"  overflow="visible"/>
				</clipPath>
				<polygon clip-path="url(#SVGID_4_)" fill-rule="evenodd" clip-rule="evenodd" fill="#FFFFFF" points="59.028,-6.319 
					421.947,-6.319 421.947,264.094 59.028,264.094 59.028,-6.319 				"/>
			</g>
			<g clip-path="url(#SVGID_2_)">
				<defs>
					<rect id="SVGID_5_" x="59.028" y="-6.319" width="362.919" height="270.413"/>
				</defs>
				<clipPath id="SVGID_6_">
					<use xlink:href="#SVGID_5_"  overflow="visible"/>
				</clipPath>
				<g clip-path="url(#SVGID_6_)">
					<text transform="matrix(1.0066 0 0 1 90.2808 60.9121)"><tspan x="0" y="0" fill="#F6EB0F" font-family="'Arial-BoldMT'" font-size="9.0137">M</tspan><tspan x="7.562" y="0" fill="#F6EB0F" font-family="'Arial-BoldMT'" font-size="9.0137">od</tspan><tspan x="18.61" y="0" fill="#F6EB0F" font-family="'Arial-BoldMT'" font-size="9.0137">e</tspan><tspan x="23.65" y="0" fill="#F6EB0F" font-family="'Arial-BoldMT'" font-size="9.0137">lo</tspan><tspan x="31.696" y="0" fill="#F6EB0F" font-family="'Arial-BoldMT'" font-size="9.0137"> </tspan><tspan x="33.866" y="0" fill="#F6EB0F" font-family="'Arial-BoldMT'" font-size="9.0137">es</tspan><tspan x="43.947" y="0" fill="#F6EB0F" font-family="'Arial-BoldMT'" font-size="9.0137">t</tspan><tspan x="46.948" y="0" fill="#F6EB0F" font-family="'Arial-BoldMT'" font-size="9.0137">r</tspan><tspan x="50.438" y="0" fill="#F6EB0F" font-family="'Arial-BoldMT'" font-size="9.0137">u</tspan><tspan x="55.962" y="0" fill="#F6EB0F" font-family="'Arial-BoldMT'" font-size="9.0137">t</tspan><tspan x="58.964" y="0" fill="#F6EB0F" font-family="'Arial-BoldMT'" font-size="9.0137">u</tspan><tspan x="64.487" y="0" fill="#F6EB0F" font-family="'Arial-BoldMT'" font-size="9.0137">r</tspan><tspan x="67.977" y="0" fill="#F6EB0F" font-family="'Arial-BoldMT'" font-size="9.0137">a</tspan><tspan x="73.017" y="0" fill="#F6EB0F" font-family="'Arial-BoldMT'" font-size="9.0137">l</tspan><tspan x="75.539" y="0" fill="#F6EB0F" font-family="'Arial-BoldMT'" font-size="9.0137"> </tspan><tspan x="77.944" y="0" fill="#F6EB0F" font-family="'Arial-BoldMT'" font-size="9.0137">d</tspan><tspan x="83.468" y="0" fill="#F6EB0F" font-family="'Arial-BoldMT'" font-size="9.0137">a</tspan><tspan x="88.508" y="0" fill="#F6EB0F" font-family="'Arial-BoldMT'" font-size="9.0137"> </tspan><tspan x="90.912" y="0" fill="#F6EB0F" font-family="'Arial-BoldMT'" font-size="9.0137">V</tspan><tspan x="96.925" y="0" fill="#F6EB0F" font-family="'Arial-BoldMT'" font-size="9.0137">L</tspan><tspan x="102.449" y="0" fill="#F6EB0F" font-family="'Arial-BoldMT'" font-size="9.0137">P</tspan><tspan x="108.344" y="0" fill="#F6EB0F" font-family="'Arial-BoldMT'" font-size="9.0137"> do</tspan><tspan x="121.914" y="0" fill="#F6EB0F" font-family="'Arial-BoldMT'" font-size="9.0137"> </tspan><tspan x="124.319" y="0" fill="#F6EB0F" font-family="'Arial-BoldMT'" font-size="9.0137">p</tspan><tspan x="129.842" y="0" fill="#F6EB0F" font-family="'Arial-BoldMT'" font-size="9.0137">a</tspan><tspan x="134.882" y="0" fill="#F6EB0F" font-family="'Arial-BoldMT'" font-size="9.0137">pilo</tspan><tspan x="150.975" y="0" fill="#F6EB0F" font-family="'Arial-BoldMT'" font-size="9.0137">m</tspan><tspan x="159.026" y="0" fill="#F6EB0F" font-family="'Arial-BoldMT'" font-size="9.0137">a</tspan><tspan x="164.066" y="0" fill="#F6EB0F" font-family="'Arial-BoldMT'" font-size="9.0137">v</tspan><tspan x="168.997" y="0" fill="#F6EB0F" font-family="'Arial-BoldMT'" font-size="9.0137">í</tspan><tspan x="171.52" y="0" fill="#F6EB0F" font-family="'Arial-BoldMT'" font-size="9.0137">r</tspan><tspan x="175.009" y="0" fill="#F6EB0F" font-family="'Arial-BoldMT'" font-size="9.0137">u</tspan><tspan x="180.534" y="0" fill="#F6EB0F" font-family="'Arial-BoldMT'" font-size="9.0137">s</tspan></text>
				</g>
			</g>
			<g clip-path="url(#SVGID_2_)">
				<defs>
					<polygon id="SVGID_7_" points="59.028,264.094 421.947,264.094 421.947,-6.319 59.028,-6.319 59.028,264.094 					"/>
				</defs>
				<clipPath id="SVGID_8_">
					<use xlink:href="#SVGID_7_"  overflow="visible"/>
				</clipPath>
			</g>
			<g clip-path="url(#SVGID_2_)">
				<defs>
					<rect id="SVGID_9_" x="59.028" y="-6.319" width="362.919" height="270.413"/>
				</defs>
				<clipPath id="SVGID_10_">
					<use xlink:href="#SVGID_9_"  overflow="visible"/>
				</clipPath>
			</g>
			<g clip-path="url(#SVGID_2_)">
				<defs>
					<rect id="SVGID_11_" x="59.028" y="-6.319" width="362.919" height="270.413"/>
				</defs>
				<clipPath id="SVGID_12_">
					<use xlink:href="#SVGID_11_"  overflow="visible"/>
				</clipPath>
			</g>
			<g clip-path="url(#SVGID_2_)">
				<defs>
					<rect id="SVGID_13_" x="59.028" y="-6.319" width="362.919" height="270.413"/>
				</defs>
				<clipPath id="SVGID_14_">
					<use xlink:href="#SVGID_13_"  overflow="visible"/>
				</clipPath>
			</g>
			<g clip-path="url(#SVGID_2_)">
				<defs>
					<rect id="SVGID_15_" x="59.028" y="-6.319" width="362.919" height="270.413"/>
				</defs>
				<clipPath id="SVGID_16_">
					<use xlink:href="#SVGID_15_"  overflow="visible"/>
				</clipPath>
			</g>
			<g clip-path="url(#SVGID_2_)">
				<defs>
					<rect id="SVGID_17_" x="59.028" y="-6.319" width="362.919" height="270.413"/>
				</defs>
				<clipPath id="SVGID_18_">
					<use xlink:href="#SVGID_17_"  overflow="visible"/>
				</clipPath>
				<g clip-path="url(#SVGID_18_)">
					<text transform="matrix(1.0066 0 0 1 202.2651 87.5215)"><tspan x="0" y="0" fill="#F6EB0F" font-family="'Arial-BoldMT'" font-size="9.0137">C</tspan><tspan x="6.491" y="0" fill="#F6EB0F" font-family="'Arial-BoldMT'" font-size="9.0137">a</tspan><tspan x="11.531" y="0" fill="#F6EB0F" font-family="'Arial-BoldMT'" font-size="9.0137">p</tspan><tspan x="17.055" y="0" fill="#F6EB0F" font-family="'Arial-BoldMT'" font-size="9.0137">s</tspan><tspan x="22.095" y="0" fill="#F6EB0F" font-family="'Arial-BoldMT'" font-size="9.0137">ô</tspan><tspan x="27.618" y="0" fill="#F6EB0F" font-family="'Arial-BoldMT'" font-size="9.0137">m</tspan><tspan x="35.669" y="0" fill="#F6EB0F" font-family="'Arial-BoldMT'" font-size="9.0137">e</tspan><tspan x="40.709" y="0" fill="#F6EB0F" font-family="'Arial-BoldMT'" font-size="9.0137">r</tspan><tspan x="44.2" y="0" fill="#F6EB0F" font-family="'Arial-BoldMT'" font-size="9.0137">o</tspan><tspan x="49.723" y="0" fill="#F6EB0F" font-family="'Arial-BoldMT'" font-size="9.0137"> </tspan><tspan x="51.894" y="0" fill="#F6EB0F" font-family="'Arial-BoldMT'" font-size="9.0137">L</tspan><tspan x="57.418" y="0" fill="#F6EB0F" font-family="'Arial-BoldMT'" font-size="9.0137">1</tspan><tspan x="62.458" y="0" fill="#F6EB0F" font-family="'Arial-BoldMT'" font-size="9.0137"> </tspan></text>
				</g>
			</g>
			<g clip-path="url(#SVGID_2_)">
				<defs>
					<rect id="SVGID_19_" x="59.028" y="-6.319" width="362.919" height="270.413"/>
				</defs>
				<clipPath id="SVGID_20_">
					<use xlink:href="#SVGID_19_"  overflow="visible"/>
				</clipPath>
				<g clip-path="url(#SVGID_20_)">
					<text transform="matrix(1.0066 0 0 1 214.7183 98.334)"><tspan x="0" y="0" fill="#F6EB0F" font-family="'Arial-BoldMT'" font-size="9.0137">(</tspan><tspan x="3.002" y="0" fill="#F6EB0F" font-family="'Arial-BoldMT'" font-size="9.0137">~</tspan><tspan x="8.284" y="0" fill="#F6EB0F" font-family="'Arial-BoldMT'" font-size="9.0137">280</tspan><tspan x="23.404" y="0" fill="#F6EB0F" font-family="'Arial-BoldMT'" font-size="9.0137"> </tspan><tspan x="25.692" y="0" fill="#F6EB0F" font-family="'Arial-BoldMT'" font-size="9.0137">k</tspan><tspan x="30.732" y="0" fill="#F6EB0F" font-family="'Arial-BoldMT'" font-size="9.0137">D</tspan><tspan x="37.223" y="0" fill="#F6EB0F" font-family="'Arial-BoldMT'" font-size="9.0137">)</tspan></text>
				</g>
			</g>
			<g clip-path="url(#SVGID_2_)">
				<defs>
					<rect id="SVGID_21_" x="59.028" y="-6.319" width="362.919" height="270.413"/>
				</defs>
				<clipPath id="SVGID_22_">
					<use xlink:href="#SVGID_21_"  overflow="visible"/>
				</clipPath>
				<g clip-path="url(#SVGID_22_)">
					<text transform="matrix(1.0066 0 0 1 159.0464 139.9121)"><tspan x="0" y="0" fill="#FFFFFF" font-family="'ArialMT'" font-size="9.0137">5</tspan><tspan x="5.04" y="0" fill="#FFFFFF" font-family="'ArialMT'" font-size="9.0137"> </tspan><tspan x="7.445" y="0" fill="#FFFFFF" font-family="'ArialMT'" font-size="9.0137">x</tspan><tspan x="11.78" y="0" fill="#FFFFFF" font-family="'ArialMT'" font-size="9.0137"> </tspan><tspan x="14.42" y="0" fill="#FFFFFF" font-family="'ArialMT'" font-size="9.0137">L</tspan><tspan x="19.459" y="0" fill="#FFFFFF" font-family="'ArialMT'" font-size="9.0137">1</tspan></text>
				</g>
			</g>
			<g clip-path="url(#SVGID_2_)">
				<defs>
					<rect id="SVGID_23_" x="59.028" y="-6.319" width="362.919" height="270.413"/>
				</defs>
				<clipPath id="SVGID_24_">
					<use xlink:href="#SVGID_23_"  overflow="visible"/>
				</clipPath>
				<g clip-path="url(#SVGID_24_)">
					<text transform="matrix(1.0066 0 0 1 85.4526 87.5215)"><tspan x="0" y="0" fill="#F6EB0F" font-family="'Arial-BoldMT'" font-size="9.0137">P</tspan><tspan x="6.012" y="0" fill="#F6EB0F" font-family="'Arial-BoldMT'" font-size="9.0137">r</tspan><tspan x="9.502" y="0" fill="#F6EB0F" font-family="'Arial-BoldMT'" font-size="9.0137">o</tspan><tspan x="15.026" y="0" fill="#F6EB0F" font-family="'Arial-BoldMT'" font-size="9.0137">t</tspan><tspan x="18.028" y="0" fill="#F6EB0F" font-family="'Arial-BoldMT'" font-size="9.0137">e</tspan><tspan x="23.068" y="0" fill="#F6EB0F" font-family="'Arial-BoldMT'" font-size="9.0137">ín</tspan><tspan x="31.114" y="0" fill="#F6EB0F" font-family="'Arial-BoldMT'" font-size="9.0137">a</tspan><tspan x="36.154" y="0" fill="#F6EB0F" font-family="'Arial-BoldMT'" font-size="9.0137"> </tspan><tspan x="38.442" y="0" fill="#F6EB0F" font-family="'Arial-BoldMT'" font-size="9.0137">L</tspan><tspan x="43.966" y="0" fill="#F6EB0F" font-family="'Arial-BoldMT'" font-size="9.0137">1</tspan><tspan x="49.006" y="0" fill="#F6EB0F" font-family="'Arial-BoldMT'" font-size="9.0137"> </tspan></text>
				</g>
			</g>
			<g clip-path="url(#SVGID_2_)">
				<defs>
					<rect id="SVGID_25_" x="59.028" y="-6.319" width="362.919" height="270.413"/>
				</defs>
				<clipPath id="SVGID_26_">
					<use xlink:href="#SVGID_25_"  overflow="visible"/>
				</clipPath>
				<g clip-path="url(#SVGID_26_)">
					<text transform="matrix(1.0066 0 0 1 88.7183 98.334)"><tspan x="0" y="0" fill="#F6EB0F" font-family="'Arial-BoldMT'" font-size="9.0137">(</tspan><tspan x="3.002" y="0" fill="#F6EB0F" font-family="'Arial-BoldMT'" font-size="9.0137">5</tspan><tspan x="8.042" y="0" fill="#F6EB0F" font-family="'Arial-BoldMT'" font-size="9.0137">5</tspan></text>
				</g>
			</g>
			<g clip-path="url(#SVGID_2_)">
				<defs>
					<rect id="SVGID_27_" x="59.028" y="-6.319" width="362.919" height="270.413"/>
				</defs>
				<clipPath id="SVGID_28_">
					<use xlink:href="#SVGID_27_"  overflow="visible"/>
				</clipPath>
				<g clip-path="url(#SVGID_28_)">
					<text transform="matrix(1.0066 0 0 1 101.8979 98.334)" fill="#F6EB0F" font-family="'Arial-BoldMT'" font-size="9.0137">–</text>
				</g>
			</g>
			<g clip-path="url(#SVGID_2_)">
				<defs>
					<rect id="SVGID_29_" x="59.028" y="-6.319" width="362.919" height="270.413"/>
				</defs>
				<clipPath id="SVGID_30_">
					<use xlink:href="#SVGID_29_"  overflow="visible"/>
				</clipPath>
				<g clip-path="url(#SVGID_30_)">
					<text transform="matrix(1.0066 0 0 1 106.9839 98.334)"><tspan x="0" y="0" fill="#F6EB0F" font-family="'Arial-BoldMT'" font-size="9.0137">57</tspan><tspan x="10.08" y="0" fill="#F6EB0F" font-family="'Arial-BoldMT'" font-size="9.0137"> </tspan><tspan x="12.251" y="0" fill="#F6EB0F" font-family="'Arial-BoldMT'" font-size="9.0137">k</tspan><tspan x="17.291" y="0" fill="#F6EB0F" font-family="'Arial-BoldMT'" font-size="9.0137">D</tspan></text>
				</g>
			</g>
			<g clip-path="url(#SVGID_2_)">
				<defs>
					<rect id="SVGID_31_" x="59.028" y="-6.319" width="362.919" height="270.413"/>
				</defs>
				<clipPath id="SVGID_32_">
					<use xlink:href="#SVGID_31_"  overflow="visible"/>
				</clipPath>
				<g clip-path="url(#SVGID_32_)">
					<text transform="matrix(1.0066 0 0 1 130.937 98.334)" fill="#FFFFFF" font-family="'ArialMT'" font-size="9.0137">)</text>
				</g>
			</g>
			<g clip-path="url(#SVGID_2_)">
				<defs>
					<rect id="SVGID_33_" x="59.028" y="-6.319" width="362.919" height="270.413"/>
				</defs>
				<clipPath id="SVGID_34_">
					<use xlink:href="#SVGID_33_"  overflow="visible"/>
				</clipPath>
			</g>
			<g clip-path="url(#SVGID_2_)">
				<defs>
					<rect id="SVGID_35_" x="59.028" y="-6.319" width="362.919" height="270.413"/>
				</defs>
				<clipPath id="SVGID_36_">
					<use xlink:href="#SVGID_35_"  overflow="visible"/>
				</clipPath>
			</g>
			<g clip-path="url(#SVGID_2_)">
				<defs>
					<rect id="SVGID_37_" x="59.028" y="-6.319" width="362.919" height="270.413"/>
				</defs>
				<clipPath id="SVGID_38_">
					<use xlink:href="#SVGID_37_"  overflow="visible"/>
				</clipPath>
			</g>
			<g clip-path="url(#SVGID_2_)">
				<defs>
					<rect id="SVGID_39_" x="59.028" y="-6.319" width="362.919" height="270.413"/>
				</defs>
				<clipPath id="SVGID_40_">
					<use xlink:href="#SVGID_39_"  overflow="visible"/>
				</clipPath>
			</g>
			<g clip-path="url(#SVGID_2_)">
				<defs>
					<rect id="SVGID_41_" x="59.028" y="-6.319" width="362.919" height="270.413"/>
				</defs>
				<clipPath id="SVGID_42_">
					<use xlink:href="#SVGID_41_"  overflow="visible"/>
				</clipPath>
			</g>
			<g clip-path="url(#SVGID_2_)">
				<defs>
					<rect id="SVGID_43_" x="59.028" y="-6.319" width="362.919" height="270.413"/>
				</defs>
				<clipPath id="SVGID_44_">
					<use xlink:href="#SVGID_43_"  overflow="visible"/>
				</clipPath>
			</g>
			<g clip-path="url(#SVGID_2_)">
				<defs>
					<rect id="SVGID_45_" x="59.028" y="-6.319" width="362.919" height="270.413"/>
				</defs>
				<clipPath id="SVGID_46_">
					<use xlink:href="#SVGID_45_"  overflow="visible"/>
				</clipPath>
			</g>
			<g clip-path="url(#SVGID_2_)">
				<defs>
					<rect id="SVGID_47_" x="59.028" y="-6.319" width="362.919" height="270.413"/>
				</defs>
				<clipPath id="SVGID_48_">
					<use xlink:href="#SVGID_47_"  overflow="visible"/>
				</clipPath>
			</g>
			<g clip-path="url(#SVGID_2_)">
				<defs>
					<rect id="SVGID_49_" x="59.028" y="-6.319" width="362.919" height="270.413"/>
				</defs>
				<clipPath id="SVGID_50_">
					<use xlink:href="#SVGID_49_"  overflow="visible"/>
				</clipPath>
			</g>
			<g clip-path="url(#SVGID_2_)">
				<defs>
					<rect id="SVGID_51_" x="59.028" y="-6.319" width="362.919" height="270.413"/>
				</defs>
				<clipPath id="SVGID_52_">
					<use xlink:href="#SVGID_51_"  overflow="visible"/>
				</clipPath>
			</g>
			<g clip-path="url(#SVGID_2_)">
				<defs>
					<rect id="SVGID_53_" x="59.028" y="-6.319" width="362.919" height="270.413"/>
				</defs>
				<clipPath id="SVGID_54_">
					<use xlink:href="#SVGID_53_"  overflow="visible"/>
				</clipPath>
			</g>
			<g clip-path="url(#SVGID_2_)">
				<defs>
					<rect id="SVGID_55_" x="59.028" y="-6.319" width="362.919" height="270.413"/>
				</defs>
				<clipPath id="SVGID_56_">
					<use xlink:href="#SVGID_55_"  overflow="visible"/>
				</clipPath>
			</g>
			<g clip-path="url(#SVGID_2_)">
				<defs>
					<rect id="SVGID_57_" x="59.028" y="-6.319" width="362.919" height="270.413"/>
				</defs>
				<clipPath id="SVGID_58_">
					<use xlink:href="#SVGID_57_"  overflow="visible"/>
				</clipPath>
				<g clip-path="url(#SVGID_58_)">
					<text transform="matrix(1.0066 0 0 1 152.8667 30.7637)"><tspan x="0" y="0" fill="#F6EB0F" font-family="'Calibri-Bold'" font-size="15.9844">M</tspan><tspan x="13.955" y="0" fill="#F6EB0F" font-family="'Calibri-Bold'" font-size="15.9844">o</tspan><tspan x="22.596" y="0" fill="#F6EB0F" font-family="'Calibri-Bold'" font-size="15.9844">n</tspan><tspan x="31.013" y="0" fill="#F6EB0F" font-family="'Calibri-Bold'" font-size="15.9844">t</tspan><tspan x="36.427" y="0" fill="#F6EB0F" font-family="'Calibri-Bold'" font-size="15.9844">a</tspan><tspan x="44.349" y="0" fill="#F6EB0F" font-family="'Calibri-Bold'" font-size="15.9844">g</tspan><tspan x="51.816" y="0" fill="#F6EB0F" font-family="'Calibri-Bold'" font-size="15.9844">e</tspan><tspan x="59.863" y="0" fill="#F6EB0F" font-family="'Calibri-Bold'" font-size="15.9844">m</tspan><tspan x="72.85" y="0" fill="#F6EB0F" font-family="'Calibri-Bold'" font-size="15.9844"> </tspan><tspan x="76.463" y="0" fill="#F6EB0F" font-family="'Calibri-Bold'" font-size="15.9844">d</tspan><tspan x="85.009" y="0" fill="#F6EB0F" font-family="'Calibri-Bold'" font-size="15.9844">a</tspan><tspan x="92.931" y="0" fill="#F6EB0F" font-family="'Calibri-Bold'" font-size="15.9844">s </tspan><tspan x="102.922" y="0" fill="#F6EB0F" font-family="'Calibri-Bold'" font-size="15.9844">V</tspan><tspan x="112.405" y="0" fill="#F6EB0F" font-family="'Calibri-Bold'" font-size="15.9844">L</tspan><tspan x="119.149" y="0" fill="#F6EB0F" font-family="'Calibri-Bold'" font-size="15.9844">P</tspan><tspan x="127.577" y="0" fill="#F6EB0F" font-family="'Calibri-Bold'" font-size="15.9844">s </tspan><tspan x="137.568" y="0" fill="#F6EB0F" font-family="'Calibri-Bold'" font-size="15.9844">d</tspan><tspan x="146.113" y="0" fill="#F6EB0F" font-family="'Calibri-Bold'" font-size="15.9844">o</tspan><tspan x="154.754" y="0" fill="#F6EB0F" font-family="'Calibri-Bold'" font-size="15.9844"> H</tspan><tspan x="168.452" y="0" fill="#F6EB0F" font-family="'Calibri-Bold'" font-size="15.9844">P</tspan><tspan x="176.88" y="0" fill="#F6EB0F" font-family="'Calibri-Bold'" font-size="15.9844">V</tspan></text>
				</g>
			</g>
			<g clip-path="url(#SVGID_2_)">
				<defs>
					<polygon id="SVGID_59_" points="59.028,264.094 421.947,264.094 421.947,-6.319 59.028,-6.319 59.028,264.094 					"/>
				</defs>
				<clipPath id="SVGID_60_">
					<use xlink:href="#SVGID_59_"  overflow="visible"/>
				</clipPath>
				
					<line clip-path="url(#SVGID_60_)" fill="none" stroke="#3A62AD" stroke-width="2.003" stroke-linejoin="round" stroke-miterlimit="10" x1="189.2" y1="146.289" x2="151.522" y2="146.289"/>
				<polygon clip-path="url(#SVGID_60_)" fill-rule="evenodd" clip-rule="evenodd" fill="#3A62AD" points="188.192,143.283 
					194.241,146.289 188.192,149.293 188.192,143.283 				"/>
				<polygon clip-path="url(#SVGID_60_)" fill-rule="evenodd" clip-rule="evenodd" fill="#FFCC05" points="211.189,134.987 
					234.691,118.872 258.193,134.987 249.215,161.061 220.167,161.061 211.189,134.987 				"/>
				<polygon clip-path="url(#SVGID_60_)" fill="none" stroke="#FFFFFF" stroke-width="0.3756" stroke-miterlimit="8" points="
					211.189,134.987 234.691,118.872 258.193,134.987 249.215,161.061 220.167,161.061 211.189,134.987 				"/>
				<polygon clip-path="url(#SVGID_60_)" fill-rule="evenodd" clip-rule="evenodd" fill="#FFCC05" points="83.923,128.741 
					106.369,135.298 91.114,153.391 83.923,128.741 				"/>
				<polygon clip-path="url(#SVGID_60_)" fill="none" stroke="#FFFFFF" stroke-width="0.3756" stroke-miterlimit="8" points="
					83.923,128.741 106.369,135.298 91.114,153.391 83.923,128.741 				"/>
				<polygon clip-path="url(#SVGID_60_)" fill-rule="evenodd" clip-rule="evenodd" fill="#FFCC05" points="97.447,139.76 
					112.615,157.525 89.796,164.272 97.447,139.76 				"/>
				<polygon clip-path="url(#SVGID_60_)" fill="none" stroke="#FFFFFF" stroke-width="0.3756" stroke-miterlimit="8" points="
					97.447,139.76 112.615,157.525 89.796,164.272 97.447,139.76 				"/>
				<polygon clip-path="url(#SVGID_60_)" fill-rule="evenodd" clip-rule="evenodd" fill="#FFCC05" points="97.806,144.08 
					120.942,140.743 114.626,163.477 97.806,144.08 				"/>
				<polygon clip-path="url(#SVGID_60_)" fill="none" stroke="#FFFFFF" stroke-width="0.3756" stroke-miterlimit="8" points="
					97.806,144.08 120.942,140.743 114.626,163.477 97.806,144.08 				"/>
				<polygon clip-path="url(#SVGID_60_)" fill-rule="evenodd" clip-rule="evenodd" fill="#FFCC05" points="119.711,126.038 
					108.706,146.609 93.958,128.04 119.711,126.038 				"/>
				<polygon clip-path="url(#SVGID_60_)" fill="none" stroke="#FFFFFF" stroke-width="0.3756" stroke-miterlimit="8" points="
					119.711,126.038 108.706,146.609 93.958,128.04 119.711,126.038 				"/>
				<polygon clip-path="url(#SVGID_60_)" fill-rule="evenodd" clip-rule="evenodd" fill="#FFCC05" points="126.397,125.583 
					129.369,148.691 106.535,141.992 126.397,125.583 				"/>
				<polygon clip-path="url(#SVGID_60_)" fill="none" stroke="#FFFFFF" stroke-width="0.3756" stroke-miterlimit="8" points="
					126.397,125.583 129.369,148.691 106.535,141.992 126.397,125.583 				"/>
			</g>
		</g>
	</g>
</g>
</svg>
