<?xml version="1.0" encoding="utf-8"?>
<!-- Generator: Adobe Illustrator 16.0.0, SVG Export Plug-In . SVG Version: 6.00 Build 0)  -->
<!DOCTYPE svg PUBLIC "-//W3C//DTD SVG 1.1//EN" "http://www.w3.org/Graphics/SVG/1.1/DTD/svg11.dtd">
<svg version="1.1" xmlns="http://www.w3.org/2000/svg" xmlns:xlink="http://www.w3.org/1999/xlink" x="0px" y="0px"
	 width="325.061px" height="106.293px" viewBox="0 0 325.061 106.293" enable-background="new 0 0 325.061 106.293"
	 xml:space="preserve">
<g id="fundo">
</g>
<g id="Layer_4">
</g>
<g id="ENFERMEIRA_E_MENINA">
</g>
<g id="Layer_5">
</g>
<g id="pele_01">
</g>
<g id="Layer_6">
	<g>
		<rect x="114.012" y="22.901" fill="#3F2D4C" width="211.049" height="60.49"/>
		<g>
			<path fill="#FFFFFF" d="M128.75,40.959l-0.641-1.961h-3.46l-0.686,1.961h-1.422l3.776-9.426h0.337l3.504,9.426H128.75z
				 M126.427,33.971l-1.44,4.094h2.761L126.427,33.971z"/>
			<path fill="#FFFFFF" d="M138.081,40.179c-0.482,0.605-1.221,0.908-2.216,0.908c-0.533,0-0.995-0.193-1.387-0.581
				c-0.391-0.387-0.587-0.868-0.587-1.444c0-0.69,0.302-1.273,0.904-1.749c0.604-0.477,1.372-0.714,2.308-0.714
				c0.254,0,0.541,0.055,0.863,0.165c0-1.1-0.49-1.65-1.473-1.65c-0.754,0-1.333,0.203-1.739,0.609l-0.508-1.009
				c0.229-0.186,0.545-0.346,0.949-0.479c0.403-0.133,0.79-0.2,1.158-0.2c0.985,0,1.702,0.224,2.148,0.673s0.67,1.162,0.67,2.139
				v2.438c0,0.597,0.178,0.995,0.533,1.193v0.603c-0.491,0-0.858-0.07-1.102-0.209S138.188,40.5,138.081,40.179z M137.967,37.621
				c-0.381-0.084-0.647-0.127-0.8-0.127c-0.609,0-1.106,0.157-1.491,0.47c-0.386,0.313-0.578,0.684-0.578,1.111
				c0,0.707,0.417,1.06,1.25,1.06c0.609,0,1.149-0.29,1.619-0.87V37.621z"/>
			<path fill="#FFFFFF" d="M142.277,40.585v3.041h-1.207v-9.464h1.207v0.559c0.457-0.457,1.009-0.686,1.656-0.686
				c0.965,0,1.716,0.3,2.254,0.901c0.537,0.601,0.806,1.481,0.806,2.641c0,1.033-0.271,1.875-0.813,2.53
				c-0.542,0.653-1.325,0.98-2.349,0.98c-0.287,0-0.596-0.051-0.924-0.152S142.37,40.716,142.277,40.585z M142.277,35.627v3.961
				c0.076,0.114,0.236,0.223,0.482,0.327c0.245,0.104,0.484,0.155,0.717,0.155c1.498,0,2.247-0.846,2.247-2.539
				c0-0.859-0.178-1.487-0.533-1.885s-0.925-0.597-1.708-0.597c-0.169,0-0.376,0.059-0.621,0.178
				C142.615,35.346,142.421,35.479,142.277,35.627z"/>
			<path fill="#FFFFFF" d="M152.008,35.323c-0.262-0.182-0.527-0.273-0.793-0.273c-0.428,0-0.801,0.197-1.121,0.59
				c-0.319,0.394-0.479,0.868-0.479,1.422v3.897h-1.207v-6.798h1.207v1.085c0.439-0.808,1.094-1.212,1.961-1.212
				c0.216,0,0.527,0.038,0.934,0.114L152.008,35.323z"/>
			<path fill="#FFFFFF" d="M159.092,37.678h-4.9c0,0.795,0.218,1.407,0.654,1.834c0.385,0.373,0.88,0.559,1.484,0.559
				c0.69,0,1.266-0.201,1.727-0.603l0.508,0.87c-0.186,0.186-0.471,0.347-0.856,0.482c-0.482,0.178-1.021,0.267-1.612,0.267
				c-0.855,0-1.58-0.29-2.178-0.87c-0.664-0.639-0.996-1.498-0.996-2.577c0-1.122,0.341-2.021,1.021-2.698
				c0.609-0.605,1.332-0.908,2.165-0.908c0.97,0,1.729,0.273,2.278,0.819c0.533,0.525,0.801,1.221,0.801,2.088
				C159.188,37.208,159.155,37.454,159.092,37.678z M156.166,35.05c-0.538,0-0.988,0.173-1.353,0.521
				c-0.347,0.33-0.544,0.741-0.591,1.231h3.765c0-0.487-0.152-0.893-0.457-1.219C157.195,35.228,156.741,35.05,156.166,35.05z"/>
			<path fill="#FFFFFF" d="M160.012,40.553l0.426-1.143c0.673,0.44,1.215,0.66,1.625,0.66c0.744,0,1.117-0.313,1.117-0.939
				c0-0.449-0.359-0.833-1.079-1.155c-0.554-0.254-0.928-0.446-1.12-0.578c-0.193-0.131-0.359-0.28-0.502-0.448
				c-0.142-0.167-0.247-0.345-0.317-0.533c-0.069-0.188-0.104-0.39-0.104-0.606c0-0.559,0.203-0.995,0.609-1.308
				s0.938-0.47,1.594-0.47c0.494,0,1.119,0.157,1.872,0.47l-0.343,1.117c-0.479-0.381-0.959-0.571-1.441-0.571
				c-0.287,0-0.529,0.068-0.727,0.203c-0.196,0.135-0.295,0.307-0.295,0.514c0,0.436,0.248,0.766,0.742,0.99l0.863,0.394
				c0.529,0.241,0.914,0.516,1.156,0.825c0.24,0.309,0.361,0.696,0.361,1.162c0,0.609-0.214,1.086-0.641,1.431
				c-0.428,0.345-1.021,0.518-1.777,0.518C161.315,41.086,160.643,40.909,160.012,40.553z"/>
			<path fill="#FFFFFF" d="M171.444,37.678h-4.9c0,0.795,0.218,1.407,0.653,1.834c0.386,0.373,0.881,0.559,1.486,0.559
				c0.689,0,1.265-0.201,1.727-0.603l0.508,0.87c-0.187,0.186-0.473,0.347-0.857,0.482c-0.482,0.178-1.02,0.267-1.612,0.267
				c-0.854,0-1.581-0.29-2.177-0.87c-0.665-0.639-0.997-1.498-0.997-2.577c0-1.122,0.341-2.021,1.022-2.698
				c0.609-0.605,1.33-0.908,2.164-0.908c0.969,0,1.729,0.273,2.279,0.819c0.533,0.525,0.799,1.221,0.799,2.088
				C171.539,37.208,171.508,37.454,171.444,37.678z M168.518,35.05c-0.537,0-0.988,0.173-1.352,0.521
				c-0.348,0.33-0.544,0.741-0.59,1.231h3.764c0-0.487-0.152-0.893-0.457-1.219C169.549,35.228,169.094,35.05,168.518,35.05z"/>
			<path fill="#FFFFFF" d="M176.992,40.959v-3.955c0-0.724-0.109-1.23-0.327-1.52c-0.218-0.29-0.583-0.435-1.095-0.435
				c-0.275,0-0.563,0.083-0.863,0.248s-0.531,0.368-0.691,0.609v5.053h-1.207v-6.798h0.826l0.381,0.876
				c0.397-0.668,1.047-1.003,1.948-1.003c1.489,0,2.234,0.906,2.234,2.717v4.208H176.992z"/>
			<path fill="#FFFFFF" d="M180.344,35.113h-0.787v-0.952h0.787v-1.422l1.206-0.463v1.885h1.866v0.952h-1.866v3.377
				c0,0.571,0.097,0.978,0.288,1.219c0.193,0.241,0.504,0.362,0.931,0.362c0.31,0,0.628-0.078,0.958-0.235l0.178,1.06
				c-0.499,0.127-1.047,0.19-1.644,0.19c-0.538,0-0.991-0.2-1.362-0.6c-0.369-0.4-0.555-0.905-0.555-1.514V35.113z"/>
			<path fill="#FFFFFF" d="M188.906,40.179c-0.482,0.605-1.221,0.908-2.215,0.908c-0.533,0-0.996-0.193-1.387-0.581
				c-0.392-0.387-0.588-0.868-0.588-1.444c0-0.69,0.303-1.273,0.904-1.749c0.604-0.477,1.373-0.714,2.309-0.714
				c0.254,0,0.541,0.055,0.863,0.165c0-1.1-0.491-1.65-1.473-1.65c-0.754,0-1.334,0.203-1.74,0.609l-0.508-1.009
				c0.229-0.186,0.545-0.346,0.949-0.479c0.404-0.133,0.791-0.2,1.158-0.2c0.986,0,1.703,0.224,2.148,0.673
				c0.447,0.449,0.67,1.162,0.67,2.139v2.438c0,0.597,0.178,0.995,0.533,1.193v0.603c-0.49,0-0.857-0.07-1.102-0.209
				C189.188,40.731,189.013,40.5,188.906,40.179z M188.793,37.621c-0.381-0.084-0.648-0.127-0.801-0.127
				c-0.609,0-1.105,0.157-1.491,0.47s-0.577,0.684-0.577,1.111c0,0.707,0.416,1.06,1.25,1.06c0.609,0,1.148-0.29,1.619-0.87V37.621z
				"/>
			<path fill="#FFFFFF" d="M197.025,34.713l-0.597,0.851c-0.122-0.123-0.339-0.239-0.651-0.349c-0.311-0.11-0.616-0.165-0.916-0.165
				c-0.656,0-1.177,0.229-1.563,0.689c-0.385,0.459-0.577,1.088-0.577,1.888c0,0.795,0.196,1.402,0.591,1.819
				c0.393,0.417,0.939,0.625,1.637,0.625c0.542,0,1.088-0.209,1.639-0.628l0.476,1.016c-0.647,0.419-1.449,0.628-2.405,0.628
				c-0.928,0-1.693-0.311-2.299-0.933c-0.604-0.622-0.907-1.464-0.907-2.526c0-1.083,0.313-1.953,0.942-2.609
				s1.488-0.984,2.58-0.984c0.352,0,0.732,0.074,1.143,0.222C196.528,34.404,196.83,34.557,197.025,34.713z M193.623,43.848
				l-0.152-0.628c0.33,0,0.605-0.057,0.825-0.171s0.33-0.273,0.33-0.476c0-0.313-0.19-0.47-0.571-0.47v-0.755
				c0.419,0,0.744,0.119,0.978,0.355s0.349,0.527,0.349,0.87c0,0.398-0.154,0.71-0.463,0.937
				C194.609,43.734,194.178,43.848,193.623,43.848z"/>
			<path fill="#FFFFFF" d="M202.174,40.179c-0.482,0.605-1.221,0.908-2.216,0.908c-0.533,0-0.995-0.193-1.388-0.581
				c-0.391-0.387-0.586-0.868-0.586-1.444c0-0.69,0.301-1.273,0.904-1.749c0.604-0.477,1.372-0.714,2.307-0.714
				c0.254,0,0.542,0.055,0.863,0.165c0-1.1-0.49-1.65-1.473-1.65c-0.753,0-1.332,0.203-1.738,0.609l-0.508-1.009
				c0.229-0.186,0.545-0.346,0.949-0.479c0.403-0.133,0.789-0.2,1.158-0.2c0.985,0,1.701,0.224,2.148,0.673
				c0.446,0.449,0.67,1.162,0.67,2.139v2.438c0,0.597,0.178,0.995,0.533,1.193v0.603c-0.491,0-0.858-0.07-1.102-0.209
				C202.453,40.731,202.279,40.5,202.174,40.179z M202.764,31.489c-0.225,0.876-0.631,1.314-1.219,1.314
				c-0.267,0-0.56-0.082-0.879-0.245c-0.32-0.163-0.545-0.244-0.676-0.244c-0.301,0-0.529,0.163-0.686,0.489h-0.578
				c0.059-0.355,0.195-0.664,0.41-0.923c0.213-0.261,0.466-0.391,0.758-0.391c0.348,0,0.668,0.082,0.961,0.244
				c0.295,0.163,0.516,0.245,0.664,0.245c0.343,0,0.571-0.163,0.686-0.489H202.764z M202.059,37.621
				c-0.381-0.084-0.646-0.127-0.799-0.127c-0.609,0-1.107,0.157-1.492,0.47s-0.578,0.684-0.578,1.111c0,0.707,0.418,1.06,1.251,1.06
				c0.609,0,1.149-0.29,1.618-0.87V37.621z"/>
			<path fill="#FFFFFF" d="M204.719,37.544c0-1.049,0.283-1.897,0.848-2.542c0.564-0.646,1.309-0.968,2.23-0.968
				c0.974,0,1.729,0.31,2.267,0.93c0.538,0.62,0.806,1.48,0.806,2.58c0,1.096-0.274,1.96-0.824,2.593
				c-0.551,0.633-1.3,0.949-2.248,0.949c-0.969,0-1.725-0.319-2.266-0.958S204.719,38.628,204.719,37.544z M205.988,37.544
				c0,1.706,0.604,2.558,1.809,2.558c0.563,0,1.004-0.229,1.324-0.686c0.319-0.457,0.479-1.081,0.479-1.873
				c0-1.684-0.601-2.526-1.803-2.526c-0.55,0-0.988,0.224-1.316,0.673S205.988,36.757,205.988,37.544z"/>
			<path fill="#FFFFFF" d="M220.365,40.953v-0.501c-0.418,0.419-1.027,0.628-1.828,0.628c-0.85,0-1.54-0.305-2.068-0.914
				c-0.529-0.609-0.794-1.422-0.794-2.438c0-1.02,0.305-1.891,0.914-2.612c0.609-0.722,1.335-1.083,2.177-1.083
				c0.703,0,1.236,0.165,1.6,0.495v-3.155h1.207v9.579H220.365z M220.365,35.735c-0.305-0.457-0.721-0.686-1.25-0.686
				c-0.647,0-1.172,0.241-1.57,0.724c-0.4,0.482-0.601,1.096-0.601,1.841c0,1.638,0.745,2.457,2.234,2.457
				c0.19,0,0.419-0.061,0.686-0.181c0.267-0.121,0.434-0.249,0.501-0.384V35.735z"/>
			<path fill="#FFFFFF" d="M227.139,40.179c-0.482,0.605-1.221,0.908-2.215,0.908c-0.533,0-0.996-0.193-1.388-0.581
				c-0.392-0.387-0.587-0.868-0.587-1.444c0-0.69,0.302-1.273,0.904-1.749c0.604-0.477,1.373-0.714,2.308-0.714
				c0.254,0,0.542,0.055,0.863,0.165c0-1.1-0.491-1.65-1.473-1.65c-0.753,0-1.333,0.203-1.739,0.609l-0.508-1.009
				c0.229-0.186,0.545-0.346,0.949-0.479c0.404-0.133,0.79-0.2,1.158-0.2c0.986,0,1.702,0.224,2.148,0.673
				c0.447,0.449,0.67,1.162,0.67,2.139v2.438c0,0.597,0.178,0.995,0.533,1.193v0.603c-0.49,0-0.857-0.07-1.102-0.209
				C227.419,40.731,227.244,40.5,227.139,40.179z M227.024,37.621c-0.381-0.084-0.647-0.127-0.8-0.127
				c-0.609,0-1.106,0.157-1.492,0.47c-0.385,0.313-0.577,0.684-0.577,1.111c0,0.707,0.417,1.06,1.251,1.06
				c0.609,0,1.148-0.29,1.618-0.87V37.621z"/>
			<path fill="#FFFFFF" d="M236.495,41.086h-0.317l-2.914-6.944h1.32l1.797,4.761l1.834-4.761h1.264L236.495,41.086z"/>
			<path fill="#FFFFFF" d="M244.252,40.179c-0.482,0.605-1.221,0.908-2.215,0.908c-0.533,0-0.996-0.193-1.388-0.581
				c-0.392-0.387-0.587-0.868-0.587-1.444c0-0.69,0.302-1.273,0.904-1.749c0.604-0.477,1.373-0.714,2.308-0.714
				c0.254,0,0.542,0.055,0.863,0.165c0-1.1-0.491-1.65-1.473-1.65c-0.753,0-1.333,0.203-1.739,0.609l-0.508-1.009
				c0.229-0.186,0.545-0.346,0.949-0.479c0.404-0.133,0.79-0.2,1.158-0.2c0.986,0,1.702,0.224,2.148,0.673
				c0.447,0.449,0.67,1.162,0.67,2.139v2.438c0,0.597,0.178,0.995,0.533,1.193v0.603c-0.49,0-0.857-0.07-1.102-0.209
				C244.532,40.731,244.357,40.5,244.252,40.179z M244.138,37.621c-0.381-0.084-0.647-0.127-0.8-0.127
				c-0.609,0-1.106,0.157-1.492,0.47c-0.385,0.313-0.577,0.684-0.577,1.111c0,0.707,0.417,1.06,1.251,1.06
				c0.609,0,1.148-0.29,1.618-0.87V37.621z"/>
			<path fill="#FFFFFF" d="M252.371,34.713l-0.598,0.851c-0.122-0.123-0.339-0.239-0.65-0.349c-0.311-0.11-0.617-0.165-0.917-0.165
				c-0.655,0-1.177,0.229-1.562,0.689c-0.385,0.459-0.578,1.088-0.578,1.888c0,0.795,0.197,1.402,0.591,1.819
				c0.394,0.417,0.939,0.625,1.638,0.625c0.541,0,1.088-0.209,1.638-0.628l0.476,1.016c-0.646,0.419-1.449,0.628-2.405,0.628
				c-0.927,0-1.692-0.311-2.298-0.933s-0.908-1.464-0.908-2.526c0-1.083,0.314-1.953,0.943-2.609
				c0.628-0.656,1.488-0.984,2.58-0.984c0.352,0,0.732,0.074,1.143,0.222S252.176,34.557,252.371,34.713z"/>
			<path fill="#FFFFFF" d="M254.262,40.959v-5.783h-0.933v-1.016h2.14v6.798H254.262z M254.922,31.59
				c0.208,0,0.385,0.073,0.53,0.219c0.146,0.146,0.22,0.321,0.22,0.524c0,0.208-0.073,0.384-0.22,0.53
				c-0.146,0.146-0.322,0.219-0.53,0.219c-0.203,0-0.377-0.073-0.523-0.219c-0.146-0.146-0.219-0.322-0.219-0.53
				s0.072-0.383,0.216-0.527S254.715,31.59,254.922,31.59z"/>
			<path fill="#FFFFFF" d="M261.568,40.959v-3.955c0-0.724-0.109-1.23-0.327-1.52c-0.218-0.29-0.583-0.435-1.095-0.435
				c-0.275,0-0.563,0.083-0.863,0.248s-0.531,0.368-0.691,0.609v5.053h-1.207v-6.798h0.826l0.381,0.876
				c0.397-0.668,1.047-1.003,1.948-1.003c1.489,0,2.234,0.906,2.234,2.717v4.208H261.568z"/>
			<path fill="#FFFFFF" d="M268.328,40.179c-0.482,0.605-1.221,0.908-2.215,0.908c-0.533,0-0.996-0.193-1.387-0.581
				c-0.392-0.387-0.588-0.868-0.588-1.444c0-0.69,0.303-1.273,0.904-1.749c0.604-0.477,1.373-0.714,2.309-0.714
				c0.254,0,0.541,0.055,0.863,0.165c0-1.1-0.491-1.65-1.473-1.65c-0.754,0-1.334,0.203-1.74,0.609l-0.508-1.009
				c0.229-0.186,0.545-0.346,0.949-0.479c0.404-0.133,0.791-0.2,1.158-0.2c0.986,0,1.703,0.224,2.148,0.673
				c0.447,0.449,0.67,1.162,0.67,2.139v2.438c0,0.597,0.178,0.995,0.533,1.193v0.603c-0.49,0-0.857-0.07-1.102-0.209
				C268.609,40.731,268.435,40.5,268.328,40.179z M268.215,37.621c-0.381-0.084-0.648-0.127-0.801-0.127
				c-0.609,0-1.105,0.157-1.491,0.47s-0.577,0.684-0.577,1.111c0,0.707,0.416,1.06,1.25,1.06c0.609,0,1.148-0.29,1.619-0.87V37.621z
				"/>
			<path fill="#FFFFFF" d="M280.662,40.959v-4.494H276.6v4.494h-1.27V31.66h1.27v3.726h4.063V31.66h1.27v9.299H280.662z"/>
			<path fill="#FFFFFF" d="M285.105,37.379v3.58h-1.27V31.66c0.961-0.042,1.541-0.063,1.739-0.063c2.7,0,4.05,0.903,4.05,2.71
				c0,2.09-1.193,3.136-3.58,3.136C285.9,37.443,285.588,37.422,285.105,37.379z M285.105,32.803v3.434
				c0.537,0.042,0.82,0.063,0.851,0.063c1.574,0,2.361-0.62,2.361-1.86c0-1.134-0.84-1.701-2.521-1.701
				C285.628,32.739,285.397,32.76,285.105,32.803z"/>
			<path fill="#FFFFFF" d="M294.322,41.086h-0.641l-3.467-9.426h1.41l2.393,6.849l2.305-6.849h1.364L294.322,41.086z"/>
			<path fill="#FFFFFF" d="M126.439,47.197v0.527c-0.838,1.21-1.257,2.977-1.257,5.3c0,2.759,0.419,4.621,1.257,5.586v0.667
				c-0.855-0.597-1.518-1.453-1.99-2.567c-0.472-1.115-0.707-2.348-0.707-3.698c0-1.151,0.268-2.314,0.806-3.488
				C125.086,48.349,125.716,47.573,126.439,47.197z"/>
			<path fill="#FFFFFF" d="M128.578,50.713h-0.787v-0.952h0.787v-1.422l1.207-0.463v1.885h1.865v0.952h-1.865v3.377
				c0,0.571,0.096,0.978,0.288,1.219s0.503,0.362,0.931,0.362c0.309,0,0.628-0.078,0.958-0.235l0.178,1.06
				c-0.499,0.127-1.048,0.19-1.644,0.19c-0.538,0-0.992-0.2-1.362-0.6c-0.37-0.4-0.556-0.905-0.556-1.514V50.713z"/>
			<path fill="#FFFFFF" d="M133.885,56.56v-5.783h-0.933v-1.016h2.14v6.798H133.885z M134.545,47.19c0.208,0,0.385,0.073,0.53,0.219
				c0.146,0.146,0.22,0.321,0.22,0.524c0,0.208-0.073,0.384-0.22,0.53c-0.146,0.146-0.322,0.219-0.53,0.219
				c-0.203,0-0.377-0.073-0.523-0.219c-0.146-0.146-0.219-0.322-0.219-0.53s0.072-0.383,0.216-0.527S134.338,47.19,134.545,47.19z"
				/>
			<path fill="#FFFFFF" d="M138.215,56.185v3.041h-1.207v-9.464h1.207v0.559c0.457-0.457,1.009-0.686,1.656-0.686
				c0.965,0,1.716,0.3,2.254,0.901c0.537,0.601,0.806,1.481,0.806,2.641c0,1.033-0.271,1.875-0.813,2.53
				c-0.542,0.653-1.325,0.98-2.349,0.98c-0.287,0-0.596-0.051-0.924-0.152S138.308,56.316,138.215,56.185z M138.215,51.228v3.961
				c0.076,0.114,0.236,0.223,0.482,0.327c0.245,0.104,0.484,0.155,0.717,0.155c1.498,0,2.247-0.846,2.247-2.539
				c0-0.859-0.178-1.487-0.533-1.885s-0.925-0.597-1.708-0.597c-0.169,0-0.376,0.059-0.621,0.178
				C138.553,50.946,138.358,51.08,138.215,51.228z"/>
			<path fill="#FFFFFF" d="M143.807,53.145c0-1.049,0.283-1.897,0.848-2.542c0.564-0.646,1.309-0.968,2.23-0.968
				c0.974,0,1.729,0.31,2.267,0.93c0.538,0.62,0.806,1.48,0.806,2.58c0,1.096-0.274,1.96-0.824,2.593
				c-0.551,0.633-1.3,0.949-2.248,0.949c-0.969,0-1.725-0.319-2.266-0.958S143.807,54.228,143.807,53.145z M145.076,53.145
				c0,1.706,0.604,2.558,1.809,2.558c0.563,0,1.004-0.229,1.324-0.686c0.319-0.457,0.479-1.081,0.479-1.873
				c0-1.684-0.601-2.526-1.803-2.526c-0.55,0-0.988,0.224-1.316,0.673S145.076,52.357,145.076,53.145z"/>
			<path fill="#FFFFFF" d="M150.783,56.153l0.425-1.143c0.673,0.44,1.214,0.66,1.625,0.66c0.745,0,1.117-0.313,1.117-0.939
				c0-0.449-0.36-0.833-1.079-1.155c-0.555-0.254-0.928-0.446-1.12-0.578s-0.36-0.28-0.502-0.448
				c-0.142-0.167-0.247-0.345-0.317-0.533c-0.069-0.188-0.104-0.39-0.104-0.606c0-0.559,0.203-0.995,0.609-1.308
				s0.938-0.47,1.593-0.47c0.496,0,1.119,0.157,1.873,0.47l-0.343,1.117c-0.478-0.381-0.958-0.571-1.44-0.571
				c-0.288,0-0.53,0.068-0.728,0.203c-0.196,0.135-0.295,0.307-0.295,0.514c0,0.436,0.247,0.766,0.743,0.99l0.863,0.394
				c0.528,0.241,0.914,0.516,1.154,0.825c0.242,0.309,0.362,0.696,0.362,1.162c0,0.609-0.214,1.086-0.642,1.431
				c-0.427,0.345-1.02,0.518-1.777,0.518C152.086,56.687,151.413,56.509,150.783,56.153z"/>
			<path fill="#FFFFFF" d="M163.814,47.095l0.615,0.679c-0.372,0.148-0.91,0.648-1.615,1.501c-0.704,0.853-1.095,1.51-1.171,1.971
				c0.351-0.338,0.84-0.508,1.466-0.508c0.821,0,1.479,0.262,1.975,0.787s0.742,1.246,0.742,2.165c0,0.91-0.254,1.642-0.765,2.196
				c-0.51,0.554-1.149,0.832-1.92,0.832c-2.04,0-3.06-1.352-3.06-4.056c0-1.125,0.398-2.278,1.196-3.456
				C162.076,48.027,162.922,47.324,163.814,47.095z M161.415,53.652c0,1.325,0.544,1.987,1.632,1.987
				c0.457,0,0.817-0.172,1.082-0.517c0.264-0.345,0.396-0.801,0.396-1.368c0-0.588-0.14-1.058-0.419-1.409s-0.64-0.527-1.079-0.527
				C161.953,51.818,161.415,52.429,161.415,53.652z"/>
			<path fill="#FFFFFF" d="M167.788,58.864l-0.323-0.457c0.728-0.597,1.092-1.104,1.092-1.523c0-0.186-0.064-0.373-0.191-0.559
				c-0.363-0.173-0.545-0.423-0.545-0.749c0-0.224,0.086-0.41,0.26-0.555c0.174-0.146,0.392-0.219,0.654-0.219
				c0.232,0,0.44,0.102,0.625,0.305c0.184,0.203,0.275,0.44,0.275,0.711c0,0.563-0.117,1.07-0.352,1.52
				C169.048,57.788,168.55,58.297,167.788,58.864z"/>
			<path fill="#FFFFFF" d="M178.217,56.56v-7.128l-1.891,1.181v-1.187c0.478-0.241,0.986-0.573,1.525-0.997
				c0.541-0.423,0.958-0.825,1.254-1.206h0.381v9.337H178.217z"/>
			<path fill="#FFFFFF" d="M185.035,56.56v-7.128l-1.893,1.181v-1.187c0.479-0.241,0.988-0.573,1.527-0.997s0.957-0.825,1.254-1.206
				h0.381v9.337H185.035z"/>
			<path fill="#FFFFFF" d="M190.113,58.864l-0.324-0.457c0.729-0.597,1.092-1.104,1.092-1.523c0-0.186-0.063-0.373-0.19-0.559
				c-0.364-0.173-0.546-0.423-0.546-0.749c0-0.224,0.087-0.41,0.26-0.555c0.174-0.146,0.393-0.219,0.654-0.219
				c0.232,0,0.441,0.102,0.625,0.305s0.276,0.44,0.276,0.711c0,0.563-0.118,1.07-0.353,1.52
				C191.373,57.788,190.875,58.297,190.113,58.864z"/>
			<path fill="#FFFFFF" d="M200.542,56.56v-7.128l-1.892,1.181v-1.187c0.479-0.241,0.987-0.573,1.526-0.997
				c0.54-0.423,0.958-0.825,1.254-1.206h0.381v9.337H200.542z"/>
			<path fill="#FFFFFF" d="M208.464,47.095l0.616,0.679c-0.373,0.148-0.911,0.648-1.616,1.501c-0.704,0.853-1.095,1.51-1.171,1.971
				c0.352-0.338,0.84-0.508,1.467-0.508c0.82,0,1.479,0.262,1.974,0.787s0.743,1.246,0.743,2.165c0,0.91-0.256,1.642-0.766,2.196
				s-1.15,0.832-1.92,0.832c-2.039,0-3.06-1.352-3.06-4.056c0-1.125,0.399-2.278,1.196-3.456
				C206.726,48.027,207.57,47.324,208.464,47.095z M206.064,53.652c0,1.325,0.544,1.987,1.631,1.987
				c0.457,0,0.818-0.172,1.083-0.517c0.265-0.345,0.396-0.801,0.396-1.368c0-0.588-0.14-1.058-0.419-1.409s-0.639-0.527-1.079-0.527
				C206.602,51.818,206.064,52.429,206.064,53.652z"/>
			<path fill="#FFFFFF" d="M221.515,53.278h-4.9c0,0.795,0.218,1.407,0.653,1.834c0.386,0.373,0.881,0.559,1.486,0.559
				c0.689,0,1.265-0.201,1.727-0.603l0.508,0.87c-0.187,0.186-0.473,0.347-0.857,0.482c-0.482,0.178-1.02,0.267-1.612,0.267
				c-0.854,0-1.581-0.29-2.177-0.87c-0.665-0.639-0.997-1.498-0.997-2.577c0-1.122,0.341-2.021,1.022-2.698
				c0.609-0.605,1.33-0.908,2.164-0.908c0.969,0,1.729,0.273,2.279,0.819c0.533,0.525,0.799,1.221,0.799,2.088
				C221.609,52.808,221.578,53.054,221.515,53.278z M218.588,50.65c-0.537,0-0.988,0.173-1.352,0.521
				c-0.348,0.33-0.544,0.741-0.59,1.231h3.764c0-0.487-0.152-0.893-0.457-1.219C219.619,50.828,219.164,50.65,218.588,50.65z"/>
			<path fill="#FFFFFF" d="M229.1,56.56v-7.128l-1.891,1.181v-1.187c0.478-0.241,0.986-0.573,1.525-0.997
				c0.541-0.423,0.958-0.825,1.254-1.206h0.381v9.337H229.1z"/>
			<path fill="#FFFFFF" d="M234.997,51.386c-0.394-0.211-0.716-0.506-0.965-0.882s-0.374-0.766-0.374-1.168
				c0-0.69,0.233-1.236,0.701-1.638c0.467-0.402,1.071-0.603,1.813-0.603c0.799,0,1.42,0.201,1.859,0.603s0.66,0.95,0.66,1.644
				c0,0.406-0.133,0.82-0.4,1.241c-0.266,0.421-0.575,0.731-0.926,0.93c1.117,0.626,1.676,1.449,1.676,2.469
				c0,0.859-0.259,1.524-0.775,1.996c-0.516,0.472-1.225,0.708-2.126,0.708c-1.879,0-2.818-0.901-2.818-2.704
				c0-0.521,0.161-1.033,0.482-1.536S234.523,51.589,234.997,51.386z M235.987,51.938c-0.931,0.503-1.396,1.185-1.396,2.044
				c0,0.461,0.144,0.848,0.432,1.158c0.288,0.312,0.66,0.467,1.117,0.467c0.474,0,0.864-0.152,1.171-0.457s0.461-0.694,0.461-1.168
				c0-0.343-0.106-0.666-0.318-0.968C237.242,52.712,236.754,52.353,235.987,51.938z M236.553,50.993
				c0.575-0.542,0.863-1.103,0.863-1.682c0-0.347-0.115-0.623-0.346-0.828c-0.231-0.206-0.531-0.308-0.898-0.308
				c-0.83,0-1.244,0.383-1.244,1.149C234.928,49.89,235.469,50.447,236.553,50.993z"/>
			<path fill="#FFFFFF" d="M240.799,59.276V58.61c0.838-0.965,1.257-2.827,1.257-5.586c0-2.323-0.419-4.09-1.257-5.3v-0.527
				c0.724,0.376,1.354,1.152,1.892,2.327c0.538,1.174,0.806,2.337,0.806,3.488c0,1.35-0.235,2.583-0.707,3.698
				C242.316,57.824,241.654,58.68,240.799,59.276z"/>
			<path fill="#FFFFFF" d="M254.846,53.278h-4.9c0,0.795,0.219,1.407,0.654,1.834c0.385,0.373,0.881,0.559,1.485,0.559
				c0.69,0,1.265-0.201,1.727-0.603l0.508,0.87c-0.187,0.186-0.472,0.347-0.856,0.482c-0.482,0.178-1.021,0.267-1.613,0.267
				c-0.854,0-1.58-0.29-2.177-0.87c-0.665-0.639-0.997-1.498-0.997-2.577c0-1.122,0.342-2.021,1.022-2.698
				c0.609-0.605,1.331-0.908,2.165-0.908c0.969,0,1.729,0.273,2.278,0.819c0.533,0.525,0.8,1.221,0.8,2.088
				C254.941,52.808,254.91,53.054,254.846,53.278z M251.92,50.65c-0.537,0-0.988,0.173-1.352,0.521
				c-0.348,0.33-0.545,0.741-0.591,1.231h3.765c0-0.487-0.152-0.893-0.457-1.219C252.95,50.828,252.496,50.65,251.92,50.65z
				 M253.494,46.289l-1.435,2.114h-0.889l1.073-2.114H253.494z"/>
			<path fill="#FFFFFF" d="M261.27,49.761v4.335c0,1.049,0.455,1.574,1.365,1.574c0.398,0,0.762-0.114,1.092-0.343
				s0.548-0.493,0.654-0.793v-4.773h1.205v6.798h-1.205V55.62c-0.136,0.267-0.408,0.511-0.816,0.733
				c-0.408,0.222-0.807,0.333-1.196,0.333c-0.745,0-1.315-0.214-1.711-0.641s-0.593-1.035-0.593-1.822v-4.462H261.27z"/>
			<path fill="#FFFFFF" d="M271.414,56.56v-3.955c0-0.724-0.109-1.23-0.328-1.52c-0.217-0.29-0.582-0.435-1.094-0.435
				c-0.275,0-0.563,0.083-0.863,0.248c-0.301,0.165-0.531,0.368-0.692,0.609v5.053h-1.206v-6.798h0.825l0.381,0.876
				c0.397-0.668,1.048-1.003,1.948-1.003c1.49,0,2.234,0.906,2.234,2.717v4.208H271.414z"/>
			<path fill="#FFFFFF" d="M274.918,56.56v-5.783h-0.934v-1.016h2.139v6.798H274.918z M275.578,47.19
				c0.207,0,0.384,0.073,0.529,0.219c0.146,0.146,0.219,0.321,0.219,0.524c0,0.208-0.072,0.384-0.219,0.53
				c-0.146,0.146-0.322,0.219-0.529,0.219c-0.203,0-0.378-0.073-0.524-0.219c-0.146-0.146-0.219-0.322-0.219-0.53
				s0.071-0.383,0.216-0.527S275.37,47.19,275.578,47.19z"/>
			<path fill="#FFFFFF" d="M282.351,56.553v-0.501c-0.419,0.419-1.028,0.628-1.828,0.628c-0.851,0-1.54-0.305-2.069-0.914
				s-0.793-1.422-0.793-2.438c0-1.02,0.305-1.891,0.914-2.612c0.609-0.722,1.334-1.083,2.177-1.083c0.702,0,1.235,0.165,1.6,0.495
				v-3.155h1.206v9.579H282.351z M282.351,51.335c-0.305-0.457-0.722-0.686-1.251-0.686c-0.646,0-1.171,0.241-1.57,0.724
				c-0.4,0.482-0.6,1.096-0.6,1.841c0,1.638,0.744,2.457,2.234,2.457c0.189,0,0.418-0.061,0.686-0.181
				c0.266-0.121,0.434-0.249,0.501-0.384V51.335z"/>
			<path fill="#FFFFFF" d="M284.839,53.145c0-1.049,0.282-1.897,0.847-2.542c0.566-0.646,1.31-0.968,2.232-0.968
				c0.973,0,1.729,0.31,2.266,0.93c0.537,0.62,0.807,1.48,0.807,2.58c0,1.096-0.275,1.96-0.826,2.593
				c-0.55,0.633-1.299,0.949-2.246,0.949c-0.97,0-1.725-0.319-2.267-0.958S284.839,54.228,284.839,53.145z M286.108,53.145
				c0,1.706,0.603,2.558,1.81,2.558c0.563,0,1.004-0.229,1.322-0.686c0.32-0.457,0.48-1.081,0.48-1.873
				c0-1.684-0.602-2.526-1.803-2.526c-0.551,0-0.99,0.224-1.318,0.673C286.272,51.74,286.108,52.357,286.108,53.145z"/>
			<path fill="#FFFFFF" d="M291.814,56.153l0.426-1.143c0.673,0.44,1.215,0.66,1.625,0.66c0.744,0,1.117-0.313,1.117-0.939
				c0-0.449-0.359-0.833-1.079-1.155c-0.554-0.254-0.928-0.446-1.12-0.578c-0.193-0.131-0.359-0.28-0.502-0.448
				c-0.142-0.167-0.247-0.345-0.317-0.533c-0.069-0.188-0.104-0.39-0.104-0.606c0-0.559,0.203-0.995,0.609-1.308
				s0.938-0.47,1.594-0.47c0.494,0,1.119,0.157,1.872,0.47l-0.343,1.117c-0.479-0.381-0.959-0.571-1.441-0.571
				c-0.287,0-0.529,0.068-0.727,0.203c-0.196,0.135-0.295,0.307-0.295,0.514c0,0.436,0.248,0.766,0.742,0.99l0.863,0.394
				c0.529,0.241,0.914,0.516,1.156,0.825c0.24,0.309,0.361,0.696,0.361,1.162c0,0.609-0.214,1.086-0.641,1.431
				c-0.428,0.345-1.021,0.518-1.777,0.518C293.118,56.687,292.445,56.509,291.814,56.153z"/>
			<path fill="#FFFFFF" d="M303.247,53.278h-4.9c0,0.795,0.218,1.407,0.653,1.834c0.386,0.373,0.881,0.559,1.486,0.559
				c0.689,0,1.265-0.201,1.727-0.603l0.508,0.87c-0.187,0.186-0.473,0.347-0.857,0.482c-0.482,0.178-1.02,0.267-1.612,0.267
				c-0.854,0-1.581-0.29-2.177-0.87c-0.665-0.639-0.997-1.498-0.997-2.577c0-1.122,0.341-2.021,1.022-2.698
				c0.609-0.605,1.33-0.908,2.164-0.908c0.969,0,1.729,0.273,2.279,0.819c0.533,0.525,0.799,1.221,0.799,2.088
				C303.342,52.808,303.311,53.054,303.247,53.278z M300.32,50.65c-0.537,0-0.988,0.173-1.352,0.521
				c-0.348,0.33-0.544,0.741-0.59,1.231h3.764c0-0.487-0.152-0.893-0.457-1.219C301.352,50.828,300.896,50.65,300.32,50.65z"/>
			<path fill="#FFFFFF" d="M305.177,58.864l-0.323-0.457c0.728-0.597,1.092-1.104,1.092-1.523c0-0.186-0.064-0.373-0.191-0.559
				c-0.363-0.173-0.545-0.423-0.545-0.749c0-0.224,0.086-0.41,0.26-0.555c0.174-0.146,0.392-0.219,0.654-0.219
				c0.232,0,0.44,0.102,0.625,0.305c0.184,0.203,0.275,0.44,0.275,0.711c0,0.563-0.117,1.07-0.352,1.52
				C306.437,57.788,305.938,58.297,305.177,58.864z"/>
			<path fill="#FFFFFF" d="M127.557,72.159v-3.955c0-0.724-0.109-1.23-0.327-1.52c-0.218-0.29-0.583-0.435-1.095-0.435
				c-0.275,0-0.563,0.083-0.863,0.248s-0.531,0.368-0.691,0.609v5.053h-1.207v-6.798h0.826l0.381,0.876
				c0.397-0.668,1.047-1.003,1.948-1.003c1.489,0,2.234,0.906,2.234,2.717v4.208H127.557z"/>
			<path fill="#FFFFFF" d="M134.316,71.378c-0.482,0.605-1.221,0.908-2.215,0.908c-0.533,0-0.996-0.193-1.387-0.581
				c-0.392-0.387-0.588-0.868-0.588-1.444c0-0.69,0.303-1.273,0.904-1.749c0.604-0.477,1.373-0.714,2.309-0.714
				c0.254,0,0.541,0.055,0.863,0.165c0-1.1-0.491-1.65-1.473-1.65c-0.754,0-1.334,0.203-1.74,0.609l-0.508-1.009
				c0.229-0.186,0.545-0.346,0.949-0.479c0.404-0.133,0.791-0.2,1.158-0.2c0.986,0,1.703,0.224,2.148,0.673
				c0.447,0.449,0.67,1.162,0.67,2.139v2.438c0,0.597,0.178,0.995,0.533,1.193v0.603c-0.49,0-0.857-0.07-1.102-0.209
				C134.598,71.931,134.423,71.7,134.316,71.378z M134.203,68.82c-0.381-0.084-0.648-0.127-0.801-0.127
				c-0.609,0-1.105,0.157-1.491,0.47s-0.577,0.684-0.577,1.111c0,0.707,0.416,1.06,1.25,1.06c0.609,0,1.148-0.29,1.619-0.87V68.82z"
				/>
			<path fill="#FFFFFF" d="M144.898,63.653c-0.246-0.084-0.475-0.127-0.686-0.127c-0.368,0-0.672,0.14-0.911,0.419
				s-0.358,0.633-0.358,1.06c0,0.114,0.011,0.233,0.031,0.355h1.385v1.016h-1.385v5.783h-1.205v-5.783h-0.99v-1.016h0.99
				c0-0.868,0.213-1.549,0.641-2.044s0.992-0.743,1.695-0.743c0.351,0,0.728,0.063,1.129,0.19L144.898,63.653z"/>
			<path fill="#FFFFFF" d="M145.584,68.744c0-1.049,0.283-1.897,0.848-2.542c0.564-0.646,1.309-0.968,2.23-0.968
				c0.974,0,1.729,0.31,2.267,0.93c0.538,0.62,0.806,1.48,0.806,2.58c0,1.096-0.274,1.96-0.824,2.593
				c-0.551,0.633-1.3,0.949-2.248,0.949c-0.969,0-1.725-0.319-2.266-0.958S145.584,69.828,145.584,68.744z M146.854,68.744
				c0,1.706,0.604,2.558,1.809,2.558c0.563,0,1.004-0.229,1.324-0.686c0.319-0.457,0.479-1.081,0.479-1.873
				c0-1.684-0.601-2.526-1.803-2.526c-0.55,0-0.988,0.224-1.316,0.673S146.854,67.957,146.854,68.744z"/>
			<path fill="#FFFFFF" d="M156.699,66.522c-0.263-0.182-0.527-0.273-0.794-0.273c-0.427,0-0.801,0.197-1.12,0.59
				c-0.32,0.394-0.479,0.868-0.479,1.422v3.897H153.1v-6.798h1.206v1.085c0.44-0.808,1.094-1.212,1.962-1.212
				c0.215,0,0.526,0.038,0.933,0.114L156.699,66.522z"/>
			<path fill="#FFFFFF" d="M165.928,72.159v-4.304c0-1.071-0.463-1.606-1.39-1.606c-0.292,0-0.565,0.09-0.819,0.27
				c-0.254,0.18-0.427,0.384-0.52,0.612v5.027h-1.207v-4.831c0-0.334-0.125-0.598-0.377-0.791c-0.252-0.192-0.586-0.289-1-0.289
				c-0.241,0-0.498,0.093-0.771,0.279c-0.272,0.186-0.467,0.392-0.58,0.616v5.015h-1.207v-6.798h0.787l0.4,0.787
				c0.465-0.609,1.047-0.914,1.746-0.914c0.973,0,1.654,0.303,2.043,0.908c0.136-0.258,0.388-0.474,0.756-0.647
				s0.747-0.26,1.137-0.26c0.702,0,1.246,0.208,1.631,0.625c0.385,0.417,0.578,1.001,0.578,1.755v4.545H165.928z"/>
			<path fill="#FFFFFF" d="M172.688,71.378c-0.482,0.605-1.221,0.908-2.216,0.908c-0.533,0-0.995-0.193-1.387-0.581
				c-0.391-0.387-0.587-0.868-0.587-1.444c0-0.69,0.302-1.273,0.904-1.749c0.604-0.477,1.372-0.714,2.308-0.714
				c0.254,0,0.541,0.055,0.863,0.165c0-1.1-0.49-1.65-1.473-1.65c-0.754,0-1.333,0.203-1.739,0.609l-0.508-1.009
				c0.229-0.186,0.545-0.346,0.949-0.479c0.403-0.133,0.79-0.2,1.158-0.2c0.985,0,1.702,0.224,2.148,0.673s0.67,1.162,0.67,2.139
				v2.438c0,0.597,0.178,0.995,0.533,1.193v0.603c-0.491,0-0.858-0.07-1.102-0.209S172.795,71.7,172.688,71.378z M172.574,68.82
				c-0.381-0.084-0.647-0.127-0.8-0.127c-0.609,0-1.106,0.157-1.491,0.47c-0.386,0.313-0.578,0.684-0.578,1.111
				c0,0.707,0.417,1.06,1.25,1.06c0.609,0,1.149-0.29,1.619-0.87V68.82z"/>
			<path fill="#FFFFFF" d="M183.904,72.153v-0.501c-0.418,0.419-1.027,0.628-1.828,0.628c-0.85,0-1.54-0.305-2.068-0.914
				c-0.529-0.609-0.794-1.422-0.794-2.438c0-1.02,0.305-1.891,0.914-2.612c0.609-0.722,1.335-1.083,2.177-1.083
				c0.703,0,1.236,0.165,1.6,0.495v-3.155h1.207v9.579H183.904z M183.904,66.935c-0.305-0.457-0.721-0.686-1.25-0.686
				c-0.647,0-1.172,0.241-1.57,0.724c-0.4,0.482-0.601,1.096-0.601,1.841c0,1.638,0.745,2.457,2.234,2.457
				c0.19,0,0.419-0.061,0.686-0.181c0.267-0.121,0.434-0.249,0.501-0.384V66.935z"/>
			<path fill="#FFFFFF" d="M192.563,68.877h-4.9c0,0.795,0.219,1.407,0.654,1.834c0.385,0.373,0.881,0.559,1.485,0.559
				c0.69,0,1.265-0.201,1.727-0.603l0.508,0.87c-0.187,0.186-0.472,0.347-0.856,0.482c-0.482,0.178-1.021,0.267-1.613,0.267
				c-0.854,0-1.58-0.29-2.177-0.87c-0.665-0.639-0.997-1.498-0.997-2.577c0-1.122,0.342-2.021,1.022-2.698
				c0.609-0.605,1.331-0.908,2.165-0.908c0.969,0,1.729,0.273,2.278,0.819c0.533,0.525,0.8,1.221,0.8,2.088
				C192.658,68.408,192.627,68.653,192.563,68.877z M189.637,66.25c-0.537,0-0.988,0.173-1.352,0.521
				c-0.348,0.33-0.545,0.741-0.591,1.231h3.765c0-0.487-0.152-0.893-0.457-1.219C190.667,66.427,190.213,66.25,189.637,66.25z"/>
			<path fill="#FFFFFF" d="M197.4,71.753l0.425-1.143c0.673,0.44,1.214,0.66,1.625,0.66c0.745,0,1.117-0.313,1.117-0.939
				c0-0.449-0.36-0.833-1.079-1.155c-0.555-0.254-0.928-0.446-1.12-0.578s-0.36-0.28-0.502-0.448
				c-0.142-0.167-0.247-0.345-0.317-0.533c-0.069-0.188-0.104-0.39-0.104-0.606c0-0.559,0.203-0.995,0.609-1.308
				s0.938-0.47,1.593-0.47c0.496,0,1.119,0.157,1.873,0.47l-0.343,1.117c-0.478-0.381-0.958-0.571-1.44-0.571
				c-0.288,0-0.53,0.068-0.728,0.203c-0.196,0.135-0.295,0.307-0.295,0.514c0,0.436,0.247,0.766,0.743,0.99l0.863,0.394
				c0.528,0.241,0.914,0.516,1.154,0.825c0.242,0.309,0.362,0.696,0.362,1.162c0,0.609-0.214,1.086-0.642,1.431
				c-0.427,0.345-1.02,0.518-1.777,0.518C198.703,72.286,198.03,72.108,197.4,71.753z"/>
			<path fill="#FFFFFF" d="M204.249,65.361v4.335c0,1.049,0.455,1.574,1.364,1.574c0.398,0,0.762-0.114,1.092-0.343
				s0.549-0.493,0.654-0.793v-4.773h1.206v6.798h-1.206V71.22c-0.135,0.267-0.407,0.511-0.816,0.733
				c-0.408,0.222-0.807,0.333-1.195,0.333c-0.745,0-1.315-0.214-1.711-0.641c-0.396-0.427-0.594-1.035-0.594-1.822v-4.462H204.249z"
				/>
			<path fill="#FFFFFF" d="M209.766,71.753l0.425-1.143c0.673,0.44,1.214,0.66,1.625,0.66c0.745,0,1.117-0.313,1.117-0.939
				c0-0.449-0.36-0.833-1.079-1.155c-0.555-0.254-0.928-0.446-1.12-0.578s-0.36-0.28-0.502-0.448
				c-0.142-0.167-0.247-0.345-0.317-0.533c-0.069-0.188-0.104-0.39-0.104-0.606c0-0.559,0.203-0.995,0.609-1.308
				s0.938-0.47,1.593-0.47c0.496,0,1.119,0.157,1.873,0.47l-0.343,1.117c-0.478-0.381-0.958-0.571-1.44-0.571
				c-0.288,0-0.53,0.068-0.728,0.203c-0.196,0.135-0.295,0.307-0.295,0.514c0,0.436,0.247,0.766,0.743,0.99l0.863,0.394
				c0.528,0.241,0.914,0.516,1.154,0.825c0.242,0.309,0.362,0.696,0.362,1.162c0,0.609-0.214,1.086-0.642,1.431
				c-0.427,0.345-1.02,0.518-1.777,0.518C211.068,72.286,210.396,72.108,209.766,71.753z"/>
			<path fill="#FFFFFF" d="M216.678,71.785v3.041h-1.206v-9.464h1.206v0.559c0.457-0.457,1.01-0.686,1.656-0.686
				c0.965,0,1.717,0.3,2.254,0.901s0.807,1.481,0.807,2.641c0,1.033-0.271,1.875-0.813,2.53c-0.542,0.653-1.325,0.98-2.35,0.98
				c-0.287,0-0.596-0.051-0.924-0.152C216.981,72.032,216.771,71.916,216.678,71.785z M216.678,66.827v3.961
				c0.076,0.114,0.236,0.223,0.482,0.327c0.246,0.104,0.484,0.155,0.717,0.155c1.498,0,2.248-0.846,2.248-2.539
				c0-0.859-0.178-1.487-0.533-1.885s-0.926-0.597-1.708-0.597c-0.169,0-0.376,0.059-0.622,0.178S216.822,66.679,216.678,66.827z"/>
			<path fill="#FFFFFF" d="M228.439,68.877h-4.9c0,0.795,0.219,1.407,0.654,1.834c0.385,0.373,0.881,0.559,1.485,0.559
				c0.69,0,1.265-0.201,1.727-0.603l0.508,0.87c-0.187,0.186-0.472,0.347-0.856,0.482c-0.482,0.178-1.021,0.267-1.613,0.267
				c-0.854,0-1.58-0.29-2.177-0.87c-0.665-0.639-0.997-1.498-0.997-2.577c0-1.122,0.342-2.021,1.022-2.698
				c0.609-0.605,1.331-0.908,2.165-0.908c0.969,0,1.729,0.273,2.278,0.819c0.533,0.525,0.8,1.221,0.8,2.088
				C228.535,68.408,228.504,68.653,228.439,68.877z M225.514,66.25c-0.537,0-0.988,0.173-1.352,0.521
				c-0.348,0.33-0.545,0.741-0.591,1.231h3.765c0-0.487-0.152-0.893-0.457-1.219C226.544,66.427,226.09,66.25,225.514,66.25z"/>
			<path fill="#FFFFFF" d="M233.988,72.159v-3.955c0-0.724-0.109-1.23-0.328-1.52c-0.217-0.29-0.582-0.435-1.094-0.435
				c-0.275,0-0.563,0.083-0.863,0.248c-0.301,0.165-0.531,0.368-0.692,0.609v5.053h-1.206v-6.798h0.825l0.381,0.876
				c0.397-0.668,1.048-1.003,1.948-1.003c1.49,0,2.234,0.906,2.234,2.717v4.208H233.988z"/>
			<path fill="#FFFFFF" d="M236.463,71.753l0.426-1.143c0.673,0.44,1.215,0.66,1.625,0.66c0.744,0,1.117-0.313,1.117-0.939
				c0-0.449-0.359-0.833-1.079-1.155c-0.554-0.254-0.928-0.446-1.12-0.578c-0.193-0.131-0.359-0.28-0.502-0.448
				c-0.142-0.167-0.247-0.345-0.317-0.533c-0.069-0.188-0.104-0.39-0.104-0.606c0-0.559,0.203-0.995,0.609-1.308
				s0.938-0.47,1.594-0.47c0.494,0,1.119,0.157,1.872,0.47l-0.343,1.117c-0.479-0.381-0.959-0.571-1.441-0.571
				c-0.287,0-0.529,0.068-0.727,0.203c-0.196,0.135-0.295,0.307-0.295,0.514c0,0.436,0.248,0.766,0.742,0.99l0.863,0.394
				c0.529,0.241,0.914,0.516,1.156,0.825c0.24,0.309,0.361,0.696,0.361,1.162c0,0.609-0.214,1.086-0.641,1.431
				c-0.428,0.345-1.021,0.518-1.777,0.518C237.767,72.286,237.094,72.108,236.463,71.753z"/>
			<path fill="#FFFFFF" d="M246.01,71.378c-0.482,0.605-1.221,0.908-2.215,0.908c-0.533,0-0.996-0.193-1.387-0.581
				c-0.392-0.387-0.588-0.868-0.588-1.444c0-0.69,0.303-1.273,0.904-1.749c0.604-0.477,1.373-0.714,2.309-0.714
				c0.254,0,0.541,0.055,0.863,0.165c0-1.1-0.491-1.65-1.473-1.65c-0.754,0-1.334,0.203-1.74,0.609l-0.508-1.009
				c0.229-0.186,0.545-0.346,0.949-0.479c0.404-0.133,0.791-0.2,1.158-0.2c0.986,0,1.703,0.224,2.148,0.673
				c0.447,0.449,0.67,1.162,0.67,2.139v2.438c0,0.597,0.178,0.995,0.533,1.193v0.603c-0.49,0-0.857-0.07-1.102-0.209
				C246.291,71.931,246.116,71.7,246.01,71.378z M246.601,62.688c-0.224,0.876-0.63,1.314-1.219,1.314
				c-0.267,0-0.56-0.082-0.88-0.245c-0.318-0.163-0.544-0.244-0.676-0.244c-0.3,0-0.528,0.163-0.686,0.489h-0.577
				c0.06-0.355,0.196-0.664,0.409-0.923c0.214-0.261,0.467-0.391,0.759-0.391c0.347,0,0.667,0.082,0.962,0.244
				c0.294,0.163,0.516,0.245,0.663,0.245c0.343,0,0.571-0.163,0.686-0.489H246.601z M245.896,68.82
				c-0.381-0.084-0.648-0.127-0.801-0.127c-0.609,0-1.105,0.157-1.491,0.47s-0.577,0.684-0.577,1.111c0,0.707,0.416,1.06,1.25,1.06
				c0.609,0,1.148-0.29,1.619-0.87V68.82z"/>
			<path fill="#FFFFFF" d="M248.556,68.744c0-1.049,0.282-1.897,0.847-2.542c0.566-0.646,1.31-0.968,2.232-0.968
				c0.973,0,1.729,0.31,2.266,0.93c0.537,0.62,0.807,1.48,0.807,2.58c0,1.096-0.275,1.96-0.826,2.593
				c-0.55,0.633-1.299,0.949-2.246,0.949c-0.97,0-1.725-0.319-2.267-0.958S248.556,69.828,248.556,68.744z M249.825,68.744
				c0,1.706,0.603,2.558,1.81,2.558c0.563,0,1.004-0.229,1.322-0.686c0.32-0.457,0.48-1.081,0.48-1.873
				c0-1.684-0.602-2.526-1.803-2.526c-0.551,0-0.99,0.224-1.318,0.673C249.989,67.339,249.825,67.957,249.825,68.744z"/>
			<path fill="#FFFFFF" d="M260.477,72.159v-5.783h-0.934v-1.016h2.14v6.798H260.477z M261.137,62.79
				c0.207,0,0.385,0.073,0.529,0.219c0.146,0.146,0.22,0.321,0.22,0.524c0,0.208-0.073,0.384-0.22,0.53
				c-0.145,0.146-0.322,0.219-0.529,0.219c-0.203,0-0.377-0.073-0.523-0.219c-0.146-0.146-0.219-0.322-0.219-0.53
				s0.071-0.383,0.215-0.527C260.754,62.862,260.93,62.79,261.137,62.79z"/>
			<path fill="#FFFFFF" d="M267.783,72.159v-3.955c0-0.724-0.109-1.23-0.328-1.52c-0.217-0.29-0.582-0.435-1.094-0.435
				c-0.275,0-0.563,0.083-0.863,0.248c-0.301,0.165-0.531,0.368-0.692,0.609v5.053H263.6v-6.798h0.825l0.381,0.876
				c0.397-0.668,1.048-1.003,1.948-1.003c1.49,0,2.234,0.906,2.234,2.717v4.208H267.783z"/>
			<path fill="#FFFFFF" d="M269.96,74.825v-1.079c0.829,0,1.397-0.126,1.704-0.378c0.307-0.251,0.461-0.665,0.461-1.241v-5.751
				h-1.353v-1.016h2.558v6.741c0,0.935-0.274,1.623-0.824,2.063C271.955,74.605,271.107,74.825,269.96,74.825z M272.563,62.79
				c0.207,0,0.384,0.073,0.53,0.219c0.146,0.146,0.219,0.321,0.219,0.524c0,0.208-0.073,0.384-0.219,0.53
				c-0.146,0.146-0.323,0.219-0.53,0.219s-0.383-0.073-0.527-0.219c-0.144-0.146-0.215-0.322-0.215-0.53s0.071-0.383,0.215-0.527
				C272.18,62.862,272.355,62.79,272.563,62.79z"/>
			<path fill="#FFFFFF" d="M281.195,68.877h-4.9c0,0.795,0.218,1.407,0.654,1.834c0.385,0.373,0.88,0.559,1.484,0.559
				c0.69,0,1.266-0.201,1.727-0.603l0.508,0.87c-0.186,0.186-0.471,0.347-0.856,0.482c-0.482,0.178-1.021,0.267-1.612,0.267
				c-0.855,0-1.58-0.29-2.178-0.87c-0.664-0.639-0.996-1.498-0.996-2.577c0-1.122,0.341-2.021,1.021-2.698
				c0.609-0.605,1.332-0.908,2.165-0.908c0.97,0,1.729,0.273,2.278,0.819c0.533,0.525,0.801,1.221,0.801,2.088
				C281.291,68.408,281.259,68.653,281.195,68.877z M278.27,66.25c-0.538,0-0.988,0.173-1.353,0.521
				c-0.347,0.33-0.544,0.741-0.591,1.231h3.765c0-0.487-0.152-0.893-0.457-1.219C279.299,66.427,278.845,66.25,278.27,66.25z"/>
			<path fill="#FFFFFF" d="M282.992,66.313h-0.787v-0.952h0.787v-1.422l1.205-0.463v1.885h1.867v0.952h-1.867v3.377
				c0,0.571,0.097,0.978,0.289,1.219c0.193,0.241,0.503,0.362,0.93,0.362c0.31,0,0.629-0.078,0.959-0.235l0.178,1.06
				c-0.5,0.127-1.047,0.19-1.645,0.19c-0.537,0-0.99-0.2-1.361-0.6c-0.37-0.4-0.555-0.905-0.555-1.514V66.313z"/>
			<path fill="#FFFFFF" d="M291.555,71.378c-0.482,0.605-1.221,0.908-2.215,0.908c-0.533,0-0.996-0.193-1.388-0.581
				c-0.392-0.387-0.587-0.868-0.587-1.444c0-0.69,0.302-1.273,0.904-1.749c0.604-0.477,1.373-0.714,2.308-0.714
				c0.254,0,0.542,0.055,0.863,0.165c0-1.1-0.491-1.65-1.473-1.65c-0.753,0-1.333,0.203-1.739,0.609l-0.508-1.009
				c0.229-0.186,0.545-0.346,0.949-0.479c0.404-0.133,0.79-0.2,1.158-0.2c0.986,0,1.702,0.224,2.148,0.673
				c0.447,0.449,0.67,1.162,0.67,2.139v2.438c0,0.597,0.178,0.995,0.533,1.193v0.603c-0.49,0-0.857-0.07-1.102-0.209
				C291.835,71.931,291.66,71.7,291.555,71.378z M291.44,68.82c-0.381-0.084-0.647-0.127-0.8-0.127c-0.609,0-1.106,0.157-1.492,0.47
				c-0.385,0.313-0.577,0.684-0.577,1.111c0,0.707,0.417,1.06,1.251,1.06c0.609,0,1.148-0.29,1.618-0.87V68.82z M291.713,61.889
				l-1.434,2.114h-0.889l1.072-2.114H291.713z"/>
			<path fill="#FFFFFF" d="M296.994,72.286h-0.316l-2.914-6.944h1.32l1.797,4.761l1.834-4.761h1.264L296.994,72.286z"/>
			<path fill="#FFFFFF" d="M306.637,68.877h-4.9c0,0.795,0.218,1.407,0.654,1.834c0.385,0.373,0.88,0.559,1.484,0.559
				c0.69,0,1.266-0.201,1.727-0.603l0.508,0.87c-0.186,0.186-0.471,0.347-0.856,0.482c-0.482,0.178-1.021,0.267-1.612,0.267
				c-0.855,0-1.58-0.29-2.178-0.87c-0.664-0.639-0.996-1.498-0.996-2.577c0-1.122,0.341-2.021,1.021-2.698
				c0.609-0.605,1.332-0.908,2.165-0.908c0.97,0,1.729,0.273,2.278,0.819c0.533,0.525,0.801,1.221,0.801,2.088
				C306.732,68.408,306.7,68.653,306.637,68.877z M303.711,66.25c-0.538,0-0.988,0.173-1.353,0.521
				c-0.347,0.33-0.544,0.741-0.591,1.231h3.765c0-0.487-0.152-0.893-0.457-1.219C304.74,66.427,304.286,66.25,303.711,66.25z"/>
			<path fill="#FFFFFF" d="M308.097,70.236v-7.662h1.206v7.458c0,0.364,0.104,0.651,0.314,0.86c0.209,0.21,0.483,0.314,0.822,0.314
				v1.079C308.877,72.286,308.097,71.603,308.097,70.236z"/>
			<path fill="#FFFFFF" d="M313.226,70.375c0.263,0,0.487,0.093,0.673,0.279s0.279,0.411,0.279,0.673s-0.094,0.488-0.279,0.676
				c-0.186,0.188-0.41,0.282-0.673,0.282s-0.487-0.094-0.673-0.282c-0.186-0.188-0.279-0.414-0.279-0.676s0.094-0.487,0.279-0.673
				S312.963,70.375,313.226,70.375z"/>
		</g>
	</g>
	<g>
		<g>
			<g>
				<circle fill="#3F2D4C" cx="50.369" cy="56.923" r="50.369"/>
				<circle fill="#DEDFE0" cx="50.37" cy="57.815" r="41.712"/>
			</g>
			<g>
				<g opacity="0.5">
					<g>
						<path fill="#FFFFFF" d="M44.119,84.994l0.578-0.932h2.104c0.129,0,0.233-0.104,0.233-0.234V41.541l3.312-2.328l3.789,2.336
							l-0.371,42.277c-0.001,0.124,0.095,0.227,0.218,0.235l2.224,0.146l0.393,0.786H44.119z"/>
					</g>
					<g>
						<path fill="#231F20" d="M50.354,39.491l3.546,2.188L53.53,83.825c-0.001,0.247,0.189,0.452,0.435,0.468l2.091,0.138
							l0.165,0.329h-9.42h-2.264l0.29-0.466h1.974c0.258,0,0.467-0.208,0.467-0.466V41.661L50.354,39.491 M50.337,38.934
							l-3.536,2.485v42.408h-2.232l-0.869,1.398h3.102h10.173l-0.62-1.242l-2.357-0.156l0.372-42.408L50.337,38.934L50.337,38.934z"
							/>
					</g>
				</g>
				<g opacity="0.5">
					<g>
						<path fill="#FFFFFF" d="M50.337,95.113c-2.743,0-4.317-0.486-4.393-0.747c0.046-0.148,0.852-0.541,2.948-0.689
							c0.122-0.008,0.217-0.109,0.217-0.231V53.488h2.629v39.971c0,0.122,0.093,0.223,0.215,0.232
							c1.974,0.157,2.732,0.536,2.775,0.685C54.654,94.626,53.08,95.113,50.337,95.113z"/>
					</g>
					<g>
						<g>
							<path fill="#231F20" d="M51.506,53.721v39.737c0,0.243,0.187,0.444,0.428,0.465c1.329,0.105,2.05,0.306,2.38,0.448
								c-0.524,0.221-1.89,0.508-3.977,0.508c-2.088,0-3.454-0.287-3.978-0.509c0.367-0.156,1.181-0.365,2.549-0.46
								c0.244-0.018,0.434-0.221,0.434-0.465V53.721H51.506 M51.972,53.255h-3.095v40.191c-1.839,0.128-3.164,0.494-3.164,0.924
								c0,0.539,2.07,0.976,4.624,0.976s4.624-0.438,4.624-0.976c0-0.417-1.243-0.773-2.989-0.912V53.255L51.972,53.255z"/>
						</g>
					</g>
				</g>
				<g>
					<g>
						<polygon points="47.313,53.022 47.313,51.353 50.243,50.824 53.609,51.357 53.597,53.022 						"/>
					</g>
					<g>
						<path fill="#231F20" d="M50.245,51.061l3.13,0.495l-0.01,1.233h-5.819v-1.242L50.245,51.061 M50.241,50.588l-3.161,0.569
							v2.097h6.747l0.017-2.097L50.241,50.588L50.241,50.588z"/>
					</g>
				</g>
				<g>
					<g>
						<path fill="#7D7E80" d="M50.647,29.228c-0.129,0-0.232-0.104-0.232-0.233v-8.212c0-0.129,0.104-0.234,0.232-0.234
							c0.128,0,0.232,0.104,0.232,0.234v8.212C50.88,29.124,50.775,29.228,50.647,29.228z"/>
					</g>
					<g>
						<path fill="#7AA834" d="M51.735,37.208h0.582v-0.756h-0.582c0,0-0.351-5.069-0.816-7.458h-0.582c0,0-1.165,5.825-1.165,7.515
							l-0.815,0.117v0.64l0.865-0.043"/>
						<path fill="#231F20" d="M48.123,37.513v-1.088l0.82-0.117c0.076-1.897,1.119-7.127,1.165-7.357l0.037-0.187h0.966l0.036,0.188
							c0.408,2.092,0.73,6.271,0.804,7.267h0.599v1.224h-0.814v-0.466h0.349v-0.292h-0.566l-0.016-0.217
							c-0.003-0.049-0.336-4.823-0.775-7.24h-0.198c-0.198,1.01-1.124,5.804-1.124,7.282v0.202l-0.815,0.117v0.194l0.622-0.032
							l0.022,0.465L48.123,37.513z"/>
					</g>
					<g>
						<g>
							<polygon fill="#7AA834" points="50.33,39.237 49.715,39.582 49.481,37.456 51.481,37.444 51.293,39.711 							"/>
						</g>
						<g>
							<g>
								<path fill="#231F20" d="M51.229,37.678l-0.139,1.673l-0.548-0.269l-0.22-0.108l-0.213,0.12l-0.201,0.113l-0.167-1.521
									L51.229,37.678 M51.735,37.208l-2.514,0.016l0.3,2.733l0.815-0.457l1.159,0.571L51.735,37.208L51.735,37.208z"/>
							</g>
						</g>
					</g>
				</g>
				<g>
					<path fill="#231F20" d="M50.923,50.355h-3.846c-0.128,0-0.232-0.104-0.232-0.233c0-0.13,0.104-0.232,0.232-0.232h3.846
						c0.129,0,0.232,0.103,0.232,0.232C51.155,50.25,51.052,50.355,50.923,50.355z"/>
				</g>
				<g>
					<path fill="#231F20" d="M50.891,58.802h-3.813c-0.128,0-0.232-0.104-0.232-0.234c0-0.129,0.104-0.232,0.232-0.232h3.813
						c0.128,0,0.232,0.104,0.232,0.232C51.123,58.698,51.019,58.802,50.891,58.802z"/>
				</g>
				<g>
					<path fill="#231F20" d="M50.891,66.841h-3.813c-0.128,0-0.232-0.104-0.232-0.232c0-0.13,0.104-0.234,0.232-0.234h3.813
						c0.128,0,0.232,0.104,0.232,0.234C51.123,66.736,51.019,66.841,50.891,66.841z"/>
				</g>
				<g>
					<path fill="#231F20" d="M50.891,75.113h-3.813c-0.128,0-0.232-0.105-0.232-0.234c0-0.129,0.104-0.232,0.232-0.232h3.813
						c0.128,0,0.232,0.104,0.232,0.232C51.123,75.008,51.019,75.113,50.891,75.113z"/>
				</g>
				<g>
					<path fill="#231F20" d="M52.848,49.628h-0.464l-0.025,0.184c0.025-0.004,0.048-0.004,0.077-0.004
						c0.113,0,0.229,0.027,0.315,0.086c0.089,0.061,0.145,0.161,0.145,0.3c0,0.223-0.191,0.42-0.514,0.42
						c-0.145,0-0.268-0.034-0.333-0.068l0.049-0.21c0.054,0.026,0.163,0.06,0.271,0.06c0.115,0,0.238-0.056,0.238-0.182
						c0-0.125-0.098-0.2-0.336-0.2c-0.066,0-0.112,0.003-0.163,0.011l0.08-0.628h0.659V49.628z"/>
				</g>
				<g>
					<path fill="#231F20" d="M51.939,58.093h-0.004l-0.229,0.108l-0.045-0.21l0.316-0.147h0.232v1.197h-0.271V58.093z"/>
					<path fill="#231F20" d="M53.49,58.438c0,0.37-0.149,0.623-0.454,0.623c-0.31,0-0.446-0.277-0.448-0.616
						c0-0.347,0.148-0.621,0.457-0.621C53.366,57.824,53.49,58.11,53.49,58.438z M52.87,58.445
						c-0.002,0.274,0.064,0.404,0.173,0.404s0.168-0.136,0.168-0.408c0-0.266-0.057-0.406-0.17-0.406
						C52.938,58.036,52.868,58.167,52.87,58.445z"/>
				</g>
				<g>
					<path fill="#231F20" d="M51.939,66.191h-0.004l-0.229,0.108l-0.045-0.211l0.316-0.147h0.232v1.198h-0.271V66.191z"/>
					<path fill="#231F20" d="M53.406,66.172h-0.465l-0.025,0.185c0.025-0.004,0.048-0.004,0.077-0.004
						c0.114,0,0.229,0.025,0.315,0.086c0.09,0.06,0.145,0.16,0.145,0.301c0,0.221-0.191,0.418-0.513,0.418
						c-0.146,0-0.269-0.034-0.334-0.067l0.049-0.211c0.055,0.027,0.163,0.06,0.271,0.06c0.116,0,0.239-0.056,0.239-0.183
						c0-0.123-0.098-0.199-0.337-0.199c-0.065,0-0.112,0.004-0.162,0.011l0.08-0.628h0.659V66.172z"/>
				</g>
				<g>
					<path fill="#231F20" d="M51.582,75.47v-0.171l0.156-0.139c0.26-0.233,0.388-0.369,0.392-0.509c0-0.097-0.059-0.174-0.197-0.174
						c-0.104,0-0.193,0.052-0.256,0.1l-0.079-0.201c0.09-0.068,0.229-0.124,0.392-0.124c0.271,0,0.421,0.159,0.421,0.376
						c0,0.2-0.146,0.361-0.319,0.515l-0.11,0.093v0.003h0.451v0.231H51.582z"/>
					<path fill="#231F20" d="M53.49,74.866c0,0.371-0.149,0.624-0.454,0.624c-0.31,0-0.446-0.278-0.448-0.617
						c0-0.346,0.148-0.621,0.457-0.621C53.366,74.251,53.49,74.538,53.49,74.866z M52.87,74.873
						c-0.002,0.275,0.064,0.405,0.173,0.405s0.168-0.136,0.168-0.408c0-0.266-0.057-0.405-0.17-0.405
						C52.938,74.464,52.868,74.594,52.87,74.873z"/>
				</g>
				<g opacity="0.5">
					<polygon fill="#E8F5FC" points="47.08,41.907 47.08,51.383 53.837,51.383 53.837,41.907 50.238,39.505 					"/>
				</g>
			</g>
		</g>
		<g>
			<circle fill="#3F2D4C" cx="19.875" cy="11.188" r="11.188"/>
			<g>
				<path fill="#FFFFFF" d="M19.122,6.776h-0.04L16.816,8l-0.342-1.344l2.848-1.523h1.504v13.032h-1.704V6.776z"/>
			</g>
		</g>
	</g>
	<g>
		<defs>
			<rect id="SVGID_5_" x="-531.888" y="78.515" width="464.29" height="436.069"/>
		</defs>
		<clipPath id="SVGID_2_">
			<use xlink:href="#SVGID_5_"  overflow="visible"/>
		</clipPath>
	</g>
	<g>
		<defs>
			<circle id="SVGID_7_" cx="50.154" cy="236.952" r="43.527"/>
		</defs>
		<clipPath id="SVGID_4_">
			<use xlink:href="#SVGID_7_"  overflow="visible"/>
		</clipPath>
		<g clip-path="url(#SVGID_4_)">
			<defs>
				<rect id="SVGID_9_" x="-165.064" y="46.763" width="419.196" height="393.714"/>
			</defs>
			<clipPath id="SVGID_6_">
				<use xlink:href="#SVGID_9_"  overflow="visible"/>
			</clipPath>
			<g clip-path="url(#SVGID_6_)">
				<polygon fill="#E6E7E8" points="83.916,61.817 207.66,55.037 204.694,417.794 83.068,411.014 				"/>
				<polygon fill="#D1D3D4" points="246.647,388.976 205.117,418.217 207.66,55.037 246.647,67.75 				"/>
				<polygon fill="#929094" points="83.916,96.144 207.66,90.635 207.66,55.037 83.916,61.817 				"/>
				<polygon fill="#767679" points="247.071,100.805 207.66,90.635 207.66,55.037 246.647,67.75 				"/>
				<path fill="#161312" d="M97.893,80.036c-0.253,3.881-3.088,6.975-6.336,6.908c-3.246-0.067-5.676-3.268-5.424-7.146
					c0.253-3.882,3.09-6.974,6.334-6.904C95.713,72.959,98.142,76.157,97.893,80.036z"/>
				<path fill="#EC1C24" d="M94.15,79.962c-0.094,1.446-1.129,2.601-2.31,2.576c-1.179-0.022-2.063-1.216-1.968-2.662
					c0.096-1.452,1.129-2.604,2.309-2.581C93.361,77.322,94.244,78.513,94.15,79.962z"/>
				<path fill="#161312" d="M118.416,78.81c-0.152,3.317-2.591,6.006-5.447,6.003l-7.562-0.014
					c-2.855-0.004-5.048-2.697-4.896-6.014l0,0c0.153-3.318,2.592-6.009,5.449-6.003l7.561,0.011
					C116.378,72.794,118.568,75.491,118.416,78.81L118.416,78.81z"/>
				<path fill="#EC1C24" d="M112.842,78.803c-0.038,0.841-0.613,1.521-1.289,1.521l-4.316-0.006
					c-0.677-0.002-1.189-0.683-1.153-1.526l0,0c0.039-0.843,0.618-1.524,1.293-1.523l4.317,0.007
					C112.369,77.275,112.882,77.959,112.842,78.803L112.842,78.803z"/>
				<polygon fill="#161312" points="169.642,81.809 162.98,81.811 163.339,73.711 169.997,73.71 				"/>
				<polygon fill="#161312" points="178.366,81.808 171.704,81.808 172.06,73.71 178.724,73.707 				"/>
				<path fill="#EC1C24" d="M168.027,77.76c-0.045,1.032-0.77,1.869-1.617,1.871c-0.851,0.002-1.503-0.837-1.457-1.871
					c0.045-1.03,0.772-1.868,1.62-1.867C167.424,75.892,168.074,76.727,168.027,77.76z"/>
				<path fill="#EC1C24" d="M176.754,77.757c-0.048,1.031-0.774,1.871-1.62,1.872c-0.852,0-1.503-0.837-1.455-1.87
					c0.044-1.032,0.771-1.868,1.617-1.87C176.146,75.889,176.798,76.726,176.754,77.757z"/>
				<path fill="#EC1C24" d="M203.34,81.199c-0.044,1.119-1.006,2.039-2.146,2.047l-16.252,0.097
					c-1.141,0.009-2.03-0.895-1.988-2.016l0,0c0.043-1.118,1-2.034,2.143-2.041l16.254-0.102
					C202.489,79.177,203.379,80.081,203.34,81.199L203.34,81.199z"/>
				<path fill="#EC1C24" d="M199.067,69.89c-0.073,1.896-1.692,3.44-3.621,3.452l-6.56,0.041c-1.928,0.013-3.435-1.515-3.361-3.41
					l0,0c0.072-1.894,1.693-3.438,3.623-3.45l6.558-0.038C197.636,66.469,199.142,67.996,199.067,69.89L199.067,69.89z"/>
				<g>
					<path fill="#161312" d="M120.588,85.761c-0.016,1.086,1.018,1.913,2.305,1.841l33.479-1.837c1.285-0.07,2.339-1.01,2.353-2.1
						l0.168-14.256c0.015-1.09-1.018-1.911-2.303-1.843l-33.481,1.841c-1.285,0.07-2.339,1.009-2.352,2.097L120.588,85.761z"/>
					<path fill="#295E2F" d="M128.063,80.745c-0.008,0.774,0.902,1.348,2.03,1.288l19.196-1.057
						c1.134-0.063,2.056-0.738,2.064-1.513l0.023-2.033c0.01-0.771-0.898-1.349-2.029-1.285l-19.195,1.054
						c-1.13,0.063-2.057,0.738-2.061,1.513L128.063,80.745z"/>
					<polygon fill="#343230" points="127.746,75.002 151.81,73.682 151.864,69.242 127.799,70.565 					"/>
					<g>
						<path fill="#EC1C24" d="M135.026,71.437l-0.541,0.908l1.276-0.015l-0.233,0.392l-1.276,0.015l-0.545,0.917l-0.598,0.006
							l0.545-0.916l-1.275,0.014l0.233-0.393l1.275-0.014l0.541-0.908L135.026,71.437z"/>
						<path fill="#EC1C24" d="M137.121,73.616l0.385-0.646l-1.759,0.019l0.246-0.413l2.484-1.666l1.134-0.013l-0.945,1.588
							l0.476-0.005l-0.282,0.476l-0.476,0.005l-0.385,0.646L137.121,73.616z M137.788,72.494l0.357-0.6
							c0.097-0.162,0.208-0.329,0.33-0.504h-0.024c-0.232,0.177-0.43,0.336-0.666,0.508l-0.883,0.598l-0.005,0.008L137.788,72.494z"
							/>
						<path fill="#EC1C24" d="M141.964,71.332c-0.212,0.357-0.799,0.621-1.3,0.626c-0.538,0.007-0.761-0.261-0.563-0.594
							c0.2-0.346,0.779-0.626,1.298-0.632C141.948,70.728,142.161,71.003,141.964,71.332z M140.594,71.354
							c-0.108,0.179,0,0.314,0.25,0.313c0.25-0.003,0.515-0.143,0.623-0.326c0.098-0.163,0.038-0.318-0.242-0.315
							C140.957,71.028,140.693,71.185,140.594,71.354z"/>
						<path fill="#EC1C24" d="M144.249,73.46c-0.206,0.06-0.628,0.126-1.127,0.132c-1.423,0.016-1.796-0.58-1.319-1.38
							c0.57-0.96,1.889-1.504,3.135-1.517c0.481-0.006,0.809,0.057,0.938,0.114l-0.489,0.505c-0.157-0.051-0.39-0.099-0.72-0.095
							c-0.739,0.009-1.493,0.318-1.865,0.943c-0.334,0.563-0.057,0.912,0.772,0.902c0.28-0.003,0.616-0.048,0.83-0.1L144.249,73.46z
							"/>
					</g>
					<path fill="#1D4520" d="M149.18,83.006c-0.01,0.709,0.939,1.232,2.118,1.166c1.18-0.067,2.143-0.692,2.151-1.4
						c0.009-0.709-0.942-1.229-2.121-1.165C150.149,81.672,149.187,82.298,149.18,83.006z"/>
					<path fill="#2B469C" d="M142.387,83.38c-0.01,0.706,0.94,1.233,2.118,1.162c1.181-0.063,2.143-0.688,2.152-1.397
						c0.007-0.708-0.94-1.228-2.121-1.164C143.355,82.046,142.396,82.671,142.387,83.38z"/>
					<path fill="#EC1C24" d="M135.4,83.765c-0.011,0.708,0.941,1.229,2.12,1.166c1.177-0.067,2.139-0.692,2.151-1.4
						c0.006-0.71-0.941-1.229-2.12-1.166C136.371,82.426,135.408,83.056,135.4,83.765z"/>
					<path fill="#343230" d="M123.37,84.4c-0.007,0.463,0.612,0.808,1.389,0.765c0.771-0.046,1.4-0.453,1.407-0.917
						s-0.616-0.808-1.39-0.765C124.006,83.526,123.373,83.937,123.37,84.4z"/>
					<path fill="#343230" d="M123.396,81.996c-0.005,0.464,0.617,0.805,1.389,0.765c0.775-0.045,1.404-0.456,1.408-0.917
						c0.007-0.467-0.614-0.808-1.388-0.765C124.034,81.119,123.401,81.533,123.396,81.996z"/>
				</g>
			</g>
			<g clip-path="url(#SVGID_6_)">
				<path fill="#050400" d="M51.912,123.322c0,0,34.755,25.543,37.85,31.159c0,0,21.899-12.016,11.902,13.344
					c0,0-6.428,27.307,14.759,11.813c21.187-15.494-3.1,5.625-8.569-4.05c-5.471-9.675,4.523,10.203,19.044-6.333
					c14.521-16.538-22.14,23.271-11.665-12.345c0,0,17.377-30.855-2.618-45.376C112.614,111.535,68.575,85.357,51.912,123.322z"/>
			</g>
			<g clip-path="url(#SVGID_6_)">
				<circle fill="#FFFFFF" cx="164.726" cy="90.843" r="7.196"/>
				<g>
					<g>
						<path d="M162.345,94.027c0.323,0.207,1.071,0.528,1.857,0.528c1.457,0,1.909-0.928,1.896-1.625
							c-0.013-1.173-1.07-1.676-2.166-1.676h-0.633v-0.851h0.633c0.825,0,1.87-0.426,1.87-1.419c0-0.671-0.426-1.264-1.471-1.264
							c-0.67,0-1.314,0.296-1.677,0.554l-0.296-0.825c0.438-0.322,1.29-0.644,2.192-0.644c1.65,0,2.398,0.979,2.398,1.998
							c0,0.864-0.517,1.6-1.548,1.973v0.026c1.031,0.206,1.87,0.979,1.87,2.153c0,1.341-1.045,2.515-3.057,2.515
							c-0.941,0-1.767-0.297-2.179-0.567L162.345,94.027z"/>
					</g>
				</g>
			</g>
			<g clip-path="url(#SVGID_6_)">
				<circle fill="#FFFFFF" cx="114.63" cy="62.232" r="7.196"/>
				<g>
					<g>
						<path d="M115.189,66.72v-2.282h-3.894v-0.748l3.738-5.351h1.226v5.209h1.174v0.89h-1.174v2.282H115.189z M115.189,63.548
							V60.75c0-0.439,0.013-0.877,0.039-1.315h-0.039c-0.258,0.49-0.464,0.851-0.696,1.238l-2.051,2.85v0.025H115.189z"/>
					</g>
				</g>
			</g>
		</g>
	</g>
</g>
</svg>
