<?xml version="1.0" encoding="utf-8"?>
<!-- Generator: Adobe Illustrator 16.0.0, SVG Export Plug-In . SVG Version: 6.00 Build 0)  -->
<!DOCTYPE svg PUBLIC "-//W3C//DTD SVG 1.1//EN" "http://www.w3.org/Graphics/SVG/1.1/DTD/svg11.dtd">
<svg version="1.1" xmlns="http://www.w3.org/2000/svg" xmlns:xlink="http://www.w3.org/1999/xlink" x="0px" y="0px" width="448px"
	 height="335px" viewBox="0 0 448 335" enable-background="new 0 0 448 335" xml:space="preserve">
<g id="Layer_2" display="none">
	<g display="inline">
		<g>
			<defs>
				<rect id="SVGID_1_" x="79.63" y="45.351" width="732.842" height="305.173"/>
			</defs>
			<clipPath id="SVGID_2_">
				<use xlink:href="#SVGID_1_"  overflow="visible"/>
			</clipPath>
		</g>
		<g>
			<defs>
				<polygon id="SVGID_3_" points="-67,350.422 959,350.422 959,45.351 -67,45.351 -67,350.422 				"/>
			</defs>
			<clipPath id="SVGID_4_">
				<use xlink:href="#SVGID_3_"  overflow="visible"/>
			</clipPath>
			<g transform="matrix(1 0 0 1 -7.629395e-006 0)" clip-path="url(#SVGID_4_)">
				
					<image overflow="visible" width="1166" height="569" xlink:href="D1F601DF.jpg"  transform="matrix(0.5037 0 0 0.4996 79.8311 45.5825)">
				</image>
			</g>
		</g>
	</g>
</g>
<g id="Layer_1">
	<g>
		<circle fill="#B06274" stroke="#231F20" stroke-miterlimit="10" cx="218.32" cy="99.667" r="92.142"/>
		<path fill="#B9ACD4" stroke="#231F20" stroke-miterlimit="10" d="M189.789,187.299l28.531-87.632l-87.433,29.145
			C130.887,128.812,141.609,169.916,189.789,187.299z"/>
		<path fill="#C46A30" stroke="#231F20" stroke-miterlimit="10" d="M144.359,44.707l73.96,54.96l-87.433,29.145
			C130.887,128.812,113.083,90.019,144.359,44.707z"/>
		<path fill="#EAA1B0" stroke="#231F20" stroke-miterlimit="10" d="M218.319,7.525v92.142l-73.96-54.96
			C144.359,44.707,168.184,8.946,218.319,7.525z"/>
	</g>
</g>
<g id="Info">
	<g>
		<rect x="217.461" y="227.073" fill="#E6E7E8" width="198" height="85.128"/>
		<rect x="217.461" y="271.707" fill="#FFFFFF" width="198" height="37.59"/>
		<g>
			<path fill="#B06274" d="M252.756,238.045h5.084v1.022h-3.852v3.138h3.558v1.009h-3.558v4.272h-1.232V238.045z"/>
			<path fill="#B06274" d="M263.678,245.861c0,0.589,0.028,1.163,0.098,1.625h-1.107l-0.098-0.854h-0.042
				c-0.378,0.532-1.107,1.009-2.073,1.009c-1.373,0-2.073-0.967-2.073-1.947c0-1.639,1.457-2.535,4.076-2.521v-0.14
				c0-0.547-0.154-1.569-1.541-1.555c-0.644,0-1.302,0.182-1.779,0.504l-0.28-0.826c0.561-0.351,1.387-0.589,2.241-0.589
				c2.073,0,2.578,1.415,2.578,2.76V245.861z M262.488,244.026c-1.345-0.028-2.872,0.21-2.872,1.527
				c0,0.812,0.532,1.176,1.148,1.176c0.896,0,1.471-0.56,1.667-1.134c0.042-0.141,0.056-0.28,0.056-0.393V244.026z"/>
			<path fill="#B06274" d="M267.092,239.082v1.625h1.765v0.938h-1.765v3.655c0,0.841,0.238,1.317,0.924,1.317
				c0.336,0,0.533-0.028,0.714-0.084l0.056,0.938c-0.238,0.084-0.616,0.168-1.092,0.168c-0.575,0-1.037-0.196-1.331-0.519
				c-0.336-0.378-0.476-0.98-0.476-1.779v-3.697h-1.051v-0.938h1.051v-1.261L267.092,239.082z"/>
			<path fill="#B06274" d="M276.292,244.04c0,2.508-1.751,3.601-3.375,3.601c-1.821,0-3.25-1.345-3.25-3.488
				c0-2.255,1.499-3.586,3.362-3.586C274.976,240.566,276.292,241.981,276.292,244.04z M270.928,244.11
				c0,1.485,0.84,2.605,2.045,2.605c1.177,0,2.059-1.106,2.059-2.634c0-1.148-0.574-2.591-2.031-2.591
				C271.558,241.491,270.928,242.836,270.928,244.11z"/>
			<path fill="#B06274" d="M277.843,242.822c0-0.799-0.014-1.485-0.056-2.115h1.079l0.056,1.345h0.042
				c0.308-0.911,1.064-1.485,1.891-1.485c0.126,0,0.224,0.015,0.336,0.028v1.162c-0.126-0.027-0.252-0.027-0.42-0.027
				c-0.869,0-1.485,0.645-1.653,1.568c-0.028,0.168-0.042,0.378-0.042,0.574v3.614h-1.233V242.822z"/>
			<path fill="#B06274" d="M282.968,244.32c0.028,1.667,1.079,2.354,2.325,2.354c0.882,0,1.429-0.154,1.877-0.351l0.224,0.883
				c-0.434,0.196-1.19,0.435-2.269,0.435c-2.087,0-3.334-1.387-3.334-3.432c0-2.046,1.205-3.643,3.18-3.643
				c2.228,0,2.802,1.934,2.802,3.18c0,0.252-0.014,0.435-0.042,0.574H282.968z M286.582,243.438
				c0.014-0.771-0.322-1.989-1.709-1.989c-1.26,0-1.793,1.135-1.891,1.989H286.582z"/>
			<path fill="#B06274" d="M289.127,246.239c0.378,0.225,1.022,0.477,1.639,0.477c0.883,0,1.303-0.435,1.303-1.009
				c0-0.588-0.35-0.896-1.247-1.232c-1.232-0.448-1.807-1.106-1.807-1.919c0-1.093,0.896-1.989,2.339-1.989
				c0.687,0,1.289,0.183,1.653,0.42l-0.294,0.896c-0.266-0.168-0.756-0.405-1.387-0.405c-0.729,0-1.121,0.42-1.121,0.924
				c0,0.561,0.392,0.813,1.274,1.163c1.163,0.434,1.779,1.022,1.779,2.031c0,1.204-0.938,2.045-2.521,2.045
				c-0.742,0-1.429-0.196-1.905-0.477L289.127,246.239z"/>
			<path fill="#B06274" d="M297.933,247.486v-5.841h-0.938v-0.938h0.938v-0.322c0-0.953,0.224-1.821,0.785-2.367
				c0.462-0.448,1.079-0.631,1.653-0.631c0.448,0,0.813,0.099,1.051,0.196l-0.168,0.952c-0.182-0.084-0.42-0.153-0.784-0.153
				c-1.051,0-1.317,0.91-1.317,1.961v0.364h1.639v0.938h-1.639v5.841H297.933z"/>
			<path fill="#B06274" d="M306.658,245.861c0,0.589,0.028,1.163,0.098,1.625h-1.107l-0.098-0.854h-0.042
				c-0.378,0.532-1.107,1.009-2.073,1.009c-1.373,0-2.073-0.967-2.073-1.947c0-1.639,1.457-2.535,4.076-2.521v-0.14
				c0-0.547-0.154-1.569-1.541-1.555c-0.644,0-1.302,0.182-1.779,0.504l-0.28-0.826c0.561-0.351,1.387-0.589,2.241-0.589
				c2.073,0,2.578,1.415,2.578,2.76V245.861z M305.467,244.026c-1.345-0.028-2.872,0.21-2.872,1.527
				c0,0.812,0.532,1.176,1.148,1.176c0.896,0,1.471-0.56,1.667-1.134c0.042-0.141,0.056-0.28,0.056-0.393V244.026z"/>
			<path fill="#B06274" d="M313.476,247.248c-0.322,0.154-1.037,0.393-1.947,0.393c-2.045,0-3.376-1.387-3.376-3.46
				c0-2.087,1.429-3.614,3.642-3.614c0.729,0,1.373,0.183,1.709,0.364l-0.28,0.938c-0.294-0.154-0.756-0.322-1.429-0.322
				c-1.555,0-2.396,1.163-2.396,2.563c0,1.569,1.009,2.535,2.354,2.535c0.7,0,1.163-0.168,1.513-0.322L313.476,247.248z"/>
			<path fill="#B06274" d="M316.288,238.802c0,0.42-0.294,0.756-0.785,0.756c-0.448,0-0.742-0.336-0.742-0.756
				s0.308-0.771,0.77-0.771C315.979,238.031,316.288,238.367,316.288,238.802z M314.915,247.486v-6.779h1.233v6.779H314.915z"/>
			<path fill="#B06274" d="M318.191,237.541h1.233v9.945h-1.233V237.541z"/>
			<path fill="#B06274" d="M322.868,238.802c0,0.42-0.294,0.756-0.785,0.756c-0.448,0-0.742-0.336-0.742-0.756
				s0.308-0.771,0.77-0.771C322.559,238.031,322.868,238.367,322.868,238.802z M321.495,247.486v-6.779h1.233v6.779H321.495z"/>
			<path fill="#B06274" d="M326.255,239.082v1.625h1.765v0.938h-1.765v3.655c0,0.841,0.238,1.317,0.924,1.317
				c0.336,0,0.533-0.028,0.714-0.084l0.056,0.938c-0.238,0.084-0.616,0.168-1.092,0.168c-0.575,0-1.037-0.196-1.331-0.519
				c-0.336-0.378-0.476-0.98-0.476-1.779v-3.697H324v-0.938h1.051v-1.261L326.255,239.082z"/>
			<path fill="#B06274" d="M334.167,245.861c0,0.589,0.028,1.163,0.099,1.625h-1.106l-0.099-0.854h-0.042
				c-0.378,0.532-1.106,1.009-2.073,1.009c-1.373,0-2.073-0.967-2.073-1.947c0-1.639,1.457-2.535,4.077-2.521v-0.14
				c0-0.547-0.154-1.569-1.541-1.555c-0.645,0-1.303,0.182-1.779,0.504l-0.28-0.826c0.561-0.351,1.387-0.589,2.241-0.589
				c2.073,0,2.577,1.415,2.577,2.76V245.861z M332.976,244.026c-1.345-0.028-2.871,0.21-2.871,1.527
				c0,0.812,0.532,1.176,1.148,1.176c0.896,0,1.471-0.56,1.667-1.134c0.042-0.141,0.056-0.28,0.056-0.393V244.026z"/>
			<path fill="#B06274" d="M341.993,237.541v8.194c0,0.603,0.028,1.289,0.057,1.751h-1.093l-0.056-1.177h-0.042
				c-0.364,0.757-1.177,1.331-2.283,1.331c-1.64,0-2.914-1.387-2.914-3.446c-0.014-2.255,1.4-3.628,3.04-3.628
				c1.05,0,1.736,0.49,2.045,1.022h0.028v-4.048H341.993z M340.775,243.466c0-0.153-0.015-0.364-0.057-0.518
				c-0.182-0.771-0.854-1.415-1.779-1.415c-1.274,0-2.03,1.12-2.03,2.605c0,1.373,0.687,2.507,2.003,2.507
				c0.826,0,1.583-0.56,1.807-1.471c0.042-0.168,0.057-0.336,0.057-0.532V243.466z"/>
			<path fill="#B06274" d="M350.183,244.04c0,2.508-1.751,3.601-3.376,3.601c-1.821,0-3.25-1.345-3.25-3.488
				c0-2.255,1.499-3.586,3.362-3.586C348.866,240.566,350.183,241.981,350.183,244.04z M344.818,244.11
				c0,1.485,0.841,2.605,2.045,2.605c1.177,0,2.06-1.106,2.06-2.634c0-1.148-0.574-2.591-2.031-2.591
				C345.448,241.491,344.818,242.836,344.818,244.11z"/>
			<path fill="#B06274" d="M351.733,242.822c0-0.799-0.014-1.485-0.056-2.115h1.078l0.057,1.345h0.042
				c0.308-0.911,1.064-1.485,1.891-1.485c0.126,0,0.224,0.015,0.336,0.028v1.162c-0.126-0.027-0.252-0.027-0.42-0.027
				c-0.868,0-1.485,0.645-1.653,1.568c-0.027,0.168-0.042,0.378-0.042,0.574v3.614h-1.232V242.822z"/>
			<path fill="#B06274" d="M356.858,244.32c0.028,1.667,1.078,2.354,2.325,2.354c0.883,0,1.429-0.154,1.877-0.351l0.225,0.883
				c-0.435,0.196-1.191,0.435-2.27,0.435c-2.087,0-3.334-1.387-3.334-3.432c0-2.046,1.205-3.643,3.18-3.643
				c2.228,0,2.802,1.934,2.802,3.18c0,0.252-0.015,0.435-0.042,0.574H356.858z M360.472,243.438
				c0.014-0.771-0.322-1.989-1.709-1.989c-1.261,0-1.793,1.135-1.892,1.989H360.472z"/>
			<path fill="#B06274" d="M363.017,246.239c0.378,0.225,1.022,0.477,1.639,0.477c0.883,0,1.303-0.435,1.303-1.009
				c0-0.588-0.35-0.896-1.246-1.232c-1.233-0.448-1.808-1.106-1.808-1.919c0-1.093,0.896-1.989,2.34-1.989
				c0.686,0,1.288,0.183,1.652,0.42l-0.294,0.896c-0.267-0.168-0.757-0.405-1.387-0.405c-0.729,0-1.121,0.42-1.121,0.924
				c0,0.561,0.393,0.813,1.275,1.163c1.162,0.434,1.778,1.022,1.778,2.031c0,1.204-0.938,2.045-2.521,2.045
				c-0.743,0-1.43-0.196-1.905-0.477L363.017,246.239z"/>
			<path fill="#B06274" d="M377.538,237.541v8.194c0,0.603,0.028,1.289,0.057,1.751h-1.093l-0.056-1.177h-0.042
				c-0.364,0.757-1.177,1.331-2.283,1.331c-1.64,0-2.914-1.387-2.914-3.446c-0.014-2.255,1.4-3.628,3.04-3.628
				c1.05,0,1.736,0.49,2.045,1.022h0.028v-4.048H377.538z M376.32,243.466c0-0.153-0.015-0.364-0.057-0.518
				c-0.182-0.771-0.854-1.415-1.779-1.415c-1.274,0-2.03,1.12-2.03,2.605c0,1.373,0.687,2.507,2.003,2.507
				c0.826,0,1.583-0.56,1.807-1.471c0.042-0.168,0.057-0.336,0.057-0.532V243.466z"/>
			<path fill="#B06274" d="M384.355,245.861c0,0.589,0.028,1.163,0.098,1.625h-1.106l-0.098-0.854h-0.042
				c-0.379,0.532-1.106,1.009-2.073,1.009c-1.373,0-2.073-0.967-2.073-1.947c0-1.639,1.457-2.535,4.076-2.521v-0.14
				c0-0.547-0.154-1.569-1.541-1.555c-0.645,0-1.303,0.182-1.778,0.504l-0.28-0.826c0.56-0.351,1.387-0.589,2.241-0.589
				c2.073,0,2.577,1.415,2.577,2.76V245.861z M383.165,244.026c-1.345-0.028-2.872,0.21-2.872,1.527
				c0,0.812,0.532,1.176,1.148,1.176c0.896,0,1.472-0.56,1.667-1.134c0.042-0.141,0.057-0.28,0.057-0.393V244.026z"/>
			<path fill="#B06274" d="M268.338,255.602c0,0.42-0.294,0.756-0.785,0.756c-0.448,0-0.742-0.336-0.742-0.756
				s0.308-0.771,0.77-0.771C268.03,254.831,268.338,255.167,268.338,255.602z M266.965,264.286v-6.779h1.233v6.779H266.965z"/>
			<path fill="#B06274" d="M270.241,259.342c0-0.715-0.014-1.275-0.056-1.835h1.093l0.07,1.12h0.028
				c0.336-0.63,1.121-1.261,2.241-1.261c0.938,0,2.395,0.561,2.395,2.886v4.034h-1.232v-3.908c0-1.093-0.406-2.003-1.569-2.003
				c-0.798,0-1.429,0.574-1.653,1.261c-0.056,0.154-0.084,0.364-0.084,0.574v4.076h-1.233V259.342z"/>
			<path fill="#B06274" d="M278.137,264.286v-5.841h-0.938v-0.938h0.938v-0.322c0-0.953,0.224-1.821,0.785-2.367
				c0.462-0.448,1.079-0.631,1.653-0.631c0.448,0,0.813,0.099,1.051,0.196l-0.168,0.952c-0.182-0.084-0.42-0.153-0.784-0.153
				c-1.051,0-1.317,0.91-1.317,1.961v0.364h1.639v0.938h-1.639v5.841H278.137z"/>
			<path fill="#B06274" d="M282.604,261.12c0.028,1.667,1.079,2.354,2.325,2.354c0.882,0,1.429-0.154,1.877-0.351l0.224,0.883
				c-0.434,0.196-1.19,0.435-2.269,0.435c-2.087,0-3.334-1.387-3.334-3.432c0-2.046,1.205-3.643,3.18-3.643
				c2.228,0,2.802,1.934,2.802,3.18c0,0.252-0.014,0.435-0.042,0.574H282.604z M286.218,260.238
				c0.014-0.771-0.322-1.989-1.709-1.989c-1.26,0-1.793,1.135-1.891,1.989H286.218z"/>
			<path fill="#B06274" d="M293.764,264.048c-0.322,0.154-1.037,0.393-1.947,0.393c-2.045,0-3.376-1.387-3.376-3.46
				c0-2.087,1.429-3.614,3.642-3.614c0.729,0,1.373,0.183,1.709,0.364l-0.28,0.938c-0.294-0.154-0.756-0.322-1.429-0.322
				c-1.555,0-2.396,1.163-2.396,2.563c0,1.569,1.009,2.535,2.354,2.535c0.7,0,1.163-0.168,1.513-0.322L293.764,264.048z"/>
			<path fill="#B06274" d="M299.952,264.034c-0.28,0.14-0.924,0.378-1.765,0.392l-0.35,0.561c0.518,0.099,0.98,0.448,0.98,1.022
				c0,0.841-0.701,1.163-1.457,1.163c-0.322,0-0.714-0.084-0.98-0.238l0.21-0.631c0.21,0.127,0.49,0.196,0.771,0.196
				c0.322,0,0.603-0.111,0.603-0.448c-0.014-0.364-0.435-0.518-1.093-0.588l0.588-1.079c-1.723-0.21-2.83-1.54-2.83-3.417
				c0-2.073,1.429-3.601,3.642-3.601c0.729,0,1.373,0.183,1.709,0.364l-0.28,0.938c-0.294-0.154-0.756-0.322-1.429-0.322
				c-1.555,0-2.396,1.148-2.396,2.563c0,1.555,1.009,2.521,2.354,2.521c0.7,0,1.177-0.168,1.513-0.322L299.952,264.034z"/>
			<path fill="#B06274" d="M306.14,262.661c0,0.589,0.028,1.163,0.098,1.625h-1.107l-0.098-0.854h-0.042
				c-0.378,0.532-1.107,1.009-2.073,1.009c-1.373,0-2.073-0.967-2.073-1.947c0-1.639,1.457-2.535,4.076-2.521v-0.14
				c0-0.547-0.154-1.569-1.541-1.555c-0.645,0-1.303,0.182-1.779,0.504l-0.28-0.826c0.561-0.351,1.387-0.589,2.241-0.589
				c2.073,0,2.578,1.415,2.578,2.76V262.661z M301.965,256.344c-0.028-0.91,0.35-1.457,0.953-1.457c0.308,0,0.546,0.141,0.868,0.309
				c0.224,0.126,0.42,0.238,0.588,0.238c0.224,0,0.364-0.126,0.393-0.589h0.658c0.014,0.925-0.294,1.415-0.953,1.415
				c-0.308,0-0.574-0.14-0.869-0.294c-0.28-0.168-0.434-0.252-0.602-0.252c-0.224,0-0.336,0.237-0.364,0.63H301.965z
				 M304.949,260.826c-1.345-0.028-2.871,0.21-2.871,1.527c0,0.813,0.532,1.176,1.148,1.176c0.896,0,1.471-0.56,1.667-1.134
				c0.042-0.141,0.056-0.28,0.056-0.393V260.826z"/>
			<path fill="#B06274" d="M314.26,260.84c0,2.508-1.751,3.601-3.375,3.601c-1.821,0-3.25-1.345-3.25-3.488
				c0-2.255,1.499-3.586,3.362-3.586C312.944,257.366,314.26,258.781,314.26,260.84z M308.896,260.91
				c0,1.485,0.84,2.605,2.045,2.605c1.177,0,2.059-1.106,2.059-2.634c0-1.148-0.574-2.591-2.031-2.591
				C309.526,258.291,308.896,259.636,308.896,260.91z"/>
			<path fill="#B06274" d="M318.779,259.72c0-0.868-0.028-1.569-0.056-2.213h1.093l0.07,1.162h0.028
				c0.49-0.826,1.303-1.303,2.409-1.303c1.653,0,2.886,1.387,2.886,3.432c0,2.438-1.499,3.643-3.096,3.643
				c-0.896,0-1.681-0.393-2.087-1.064h-0.028v3.684h-1.219V259.72z M319.998,261.526c0,0.183,0.014,0.351,0.056,0.505
				c0.224,0.854,0.966,1.442,1.849,1.442c1.302,0,2.059-1.064,2.059-2.619c0-1.345-0.714-2.508-2.017-2.508
				c-0.841,0-1.639,0.589-1.863,1.513c-0.042,0.154-0.084,0.337-0.084,0.49V261.526z"/>
			<path fill="#B06274" d="M327.431,261.12c0.028,1.667,1.079,2.354,2.325,2.354c0.882,0,1.429-0.154,1.877-0.351l0.224,0.883
				c-0.434,0.196-1.19,0.435-2.269,0.435c-2.087,0-3.334-1.387-3.334-3.432c0-2.046,1.205-3.643,3.18-3.643
				c2.228,0,2.802,1.934,2.802,3.18c0,0.252-0.014,0.435-0.042,0.574H327.431z M331.045,260.238
				c0.014-0.771-0.322-1.989-1.709-1.989c-1.26,0-1.793,1.135-1.891,1.989H331.045z"/>
			<path fill="#B06274" d="M333.758,254.341h1.232v9.945h-1.232V254.341z"/>
			<path fill="#B06274" d="M343.198,260.84c0,2.508-1.751,3.601-3.376,3.601c-1.821,0-3.25-1.345-3.25-3.488
				c0-2.255,1.499-3.586,3.362-3.586C341.88,257.366,343.198,258.781,343.198,260.84z M337.833,260.91
				c0,1.485,0.841,2.605,2.045,2.605c1.177,0,2.06-1.106,2.06-2.634c0-1.148-0.574-2.591-2.031-2.591
				C338.462,258.291,337.833,259.636,337.833,260.91z"/>
			<path fill="#B06274" d="M348.976,254.845v3.95h4.566v-3.95h1.232v9.441h-1.232v-4.427h-4.566v4.427h-1.232v-9.441H348.976z"/>
			<path fill="#B06274" d="M356.885,254.957c0.589-0.098,1.358-0.182,2.34-0.182c1.204,0,2.087,0.279,2.647,0.784
				c0.504,0.448,0.826,1.135,0.826,1.975c0,0.854-0.252,1.527-0.729,2.018c-0.658,0.687-1.695,1.036-2.886,1.036
				c-0.364,0-0.7-0.014-0.98-0.084v3.782h-1.219V254.957z M358.104,259.51c0.267,0.07,0.603,0.098,1.009,0.098
				c1.471,0,2.367-0.729,2.367-2.003c0-1.261-0.896-1.863-2.228-1.863c-0.532,0-0.938,0.042-1.148,0.099V259.51z"/>
			<path fill="#B06274" d="M366.407,264.286l-3.096-9.441h1.331l1.471,4.65c0.392,1.275,0.742,2.424,1.009,3.53h0.027
				c0.267-1.093,0.645-2.283,1.079-3.516l1.597-4.665h1.303l-3.376,9.441H366.407z"/>
		</g>
		<g>
			<path fill="#231F20" d="M231.468,278.117v8.084h-1.056v-8.084H231.468z"/>
			<path fill="#231F20" d="M233.377,281.968c0-0.612-0.012-1.092-0.048-1.571h0.936l0.06,0.959h0.024
				c0.288-0.539,0.959-1.079,1.919-1.079c0.803,0,2.051,0.479,2.051,2.471v3.454h-1.056v-3.346c0-0.936-0.348-1.716-1.343-1.716
				c-0.684,0-1.223,0.492-1.415,1.08c-0.048,0.132-0.072,0.312-0.072,0.491v3.49h-1.056V281.968z"/>
			<path fill="#231F20" d="M241.212,278.766c0,0.359-0.252,0.647-0.671,0.647c-0.384,0-0.636-0.288-0.636-0.647
				c0-0.36,0.264-0.66,0.66-0.66C240.949,278.105,241.212,278.394,241.212,278.766z M240.037,286.201v-5.805h1.056v5.805H240.037z"
				/>
			<path fill="#231F20" d="M246.983,285.997c-0.276,0.132-0.888,0.336-1.667,0.336c-1.751,0-2.891-1.188-2.891-2.962
				c0-1.787,1.224-3.095,3.119-3.095c0.624,0,1.175,0.156,1.463,0.312l-0.24,0.804c-0.252-0.132-0.647-0.275-1.223-0.275
				c-1.332,0-2.051,0.995-2.051,2.194c0,1.344,0.864,2.171,2.015,2.171c0.6,0,0.996-0.144,1.295-0.275L246.983,285.997z"/>
			<path fill="#231F20" d="M249.396,278.766c0,0.359-0.252,0.647-0.671,0.647c-0.384,0-0.636-0.288-0.636-0.647
				c0-0.36,0.264-0.66,0.66-0.66C249.133,278.105,249.396,278.394,249.396,278.766z M248.221,286.201v-5.805h1.056v5.805H248.221z"
				/>
			<path fill="#231F20" d="M255.107,284.81c0,0.504,0.024,0.996,0.084,1.392h-0.947l-0.084-0.731h-0.036
				c-0.324,0.456-0.947,0.863-1.775,0.863c-1.175,0-1.775-0.827-1.775-1.667c0-1.403,1.247-2.171,3.49-2.159v-0.119
				c0-0.468-0.132-1.344-1.319-1.332c-0.552,0-1.116,0.156-1.523,0.432l-0.24-0.707c0.479-0.3,1.187-0.504,1.919-0.504
				c1.775,0,2.207,1.211,2.207,2.362V284.81z M254.087,283.239c-1.151-0.024-2.458,0.18-2.458,1.307
				c0,0.696,0.456,1.008,0.983,1.008c0.768,0,1.259-0.479,1.427-0.972c0.036-0.12,0.048-0.24,0.048-0.336V283.239z"/>
			<path fill="#231F20" d="M260.952,285.985c-0.24,0.12-0.792,0.324-1.512,0.336l-0.3,0.479c0.443,0.084,0.84,0.384,0.84,0.876
				c0,0.719-0.6,0.995-1.247,0.995c-0.276,0-0.612-0.072-0.84-0.204l0.18-0.54c0.18,0.108,0.42,0.168,0.66,0.168
				c0.275,0,0.516-0.096,0.516-0.384c-0.013-0.312-0.372-0.443-0.936-0.503l0.503-0.924c-1.475-0.18-2.422-1.319-2.422-2.927
				c0-1.774,1.224-3.082,3.119-3.082c0.623,0,1.175,0.156,1.463,0.312l-0.239,0.804c-0.252-0.132-0.648-0.275-1.224-0.275
				c-1.332,0-2.051,0.983-2.051,2.194c0,1.331,0.864,2.159,2.015,2.159c0.6,0,1.008-0.145,1.295-0.276L260.952,285.985z"/>
			<path fill="#231F20" d="M266.255,284.81c0,0.504,0.024,0.996,0.084,1.392h-0.947l-0.084-0.731h-0.036
				c-0.323,0.456-0.947,0.863-1.775,0.863c-1.175,0-1.774-0.827-1.774-1.667c0-1.403,1.247-2.171,3.49-2.159v-0.119
				c0-0.468-0.132-1.344-1.319-1.332c-0.552,0-1.115,0.156-1.523,0.432l-0.24-0.707c0.48-0.3,1.188-0.504,1.919-0.504
				c1.775,0,2.207,1.211,2.207,2.362V284.81z M262.681,279.401c-0.023-0.78,0.3-1.248,0.815-1.248c0.265,0,0.468,0.12,0.744,0.264
				c0.191,0.108,0.359,0.204,0.504,0.204c0.191,0,0.312-0.107,0.336-0.504h0.563c0.012,0.792-0.252,1.212-0.815,1.212
				c-0.265,0-0.492-0.12-0.744-0.252c-0.239-0.144-0.371-0.216-0.516-0.216c-0.191,0-0.288,0.204-0.312,0.54H262.681z
				 M265.236,283.239c-1.151-0.024-2.458,0.18-2.458,1.307c0,0.696,0.455,1.008,0.983,1.008c0.768,0,1.259-0.479,1.427-0.972
				c0.036-0.12,0.048-0.24,0.048-0.336V283.239z"/>
			<path fill="#231F20" d="M273.215,283.251c0,2.146-1.499,3.082-2.891,3.082c-1.56,0-2.782-1.151-2.782-2.986
				c0-1.931,1.283-3.07,2.878-3.07C272.087,280.276,273.215,281.487,273.215,283.251z M268.622,283.311
				c0,1.271,0.72,2.231,1.751,2.231c1.008,0,1.763-0.948,1.763-2.255c0-0.983-0.491-2.219-1.738-2.219
				C269.162,281.068,268.622,282.22,268.622,283.311z"/>
			<path fill="#231F20" d="M276.95,285.134c0.324,0.191,0.876,0.408,1.403,0.408c0.756,0,1.115-0.372,1.115-0.864
				c0-0.504-0.3-0.768-1.067-1.055c-1.056-0.384-1.547-0.948-1.547-1.644c0-0.936,0.768-1.703,2.003-1.703
				c0.588,0,1.104,0.156,1.415,0.36l-0.252,0.768c-0.228-0.145-0.647-0.349-1.188-0.349c-0.623,0-0.959,0.36-0.959,0.792
				c0,0.479,0.336,0.695,1.091,0.995c0.996,0.372,1.523,0.876,1.523,1.739c0,1.031-0.804,1.751-2.158,1.751
				c-0.636,0-1.224-0.168-1.632-0.407L276.95,285.134z"/>
			<path fill="#231F20" d="M282.433,283.49c0.024,1.428,0.924,2.016,1.991,2.016c0.756,0,1.224-0.132,1.607-0.3l0.191,0.755
				c-0.372,0.168-1.02,0.372-1.942,0.372c-1.787,0-2.854-1.188-2.854-2.938s1.031-3.118,2.723-3.118
				c1.906,0,2.398,1.655,2.398,2.723c0,0.216-0.013,0.372-0.036,0.491H282.433z M285.528,282.735
				c0.012-0.66-0.276-1.703-1.463-1.703c-1.08,0-1.535,0.972-1.619,1.703H285.528z"/>
			<path fill="#231F20" d="M288.313,280.396l0.827,1.247c0.229,0.324,0.408,0.611,0.601,0.936h0.023
				c0.192-0.336,0.384-0.636,0.588-0.947l0.804-1.235h1.151l-1.979,2.807l2.027,2.998h-1.188l-0.863-1.308
				c-0.229-0.336-0.42-0.659-0.624-1.007h-0.023c-0.192,0.348-0.384,0.659-0.612,1.007l-0.839,1.308h-1.164l2.063-2.962
				l-1.967-2.843H288.313z"/>
			<path fill="#231F20" d="M298.234,284.606c0,0.611,0.013,1.139,0.049,1.595h-0.936l-0.061-0.947h-0.023
				c-0.265,0.468-0.888,1.079-1.919,1.079c-0.912,0-2.003-0.516-2.003-2.543v-3.394h1.055v3.202c0,1.104,0.349,1.859,1.296,1.859
				c0.707,0,1.199-0.492,1.391-0.972c0.061-0.145,0.097-0.336,0.097-0.54v-3.55h1.055V284.606z"/>
			<path fill="#231F20" d="M304.067,284.81c0,0.504,0.024,0.996,0.084,1.392h-0.947l-0.084-0.731h-0.036
				c-0.324,0.456-0.947,0.863-1.775,0.863c-1.175,0-1.774-0.827-1.774-1.667c0-1.403,1.247-2.171,3.49-2.159v-0.119
				c0-0.468-0.132-1.344-1.319-1.332c-0.552,0-1.115,0.156-1.523,0.432l-0.24-0.707c0.48-0.3,1.188-0.504,1.919-0.504
				c1.775,0,2.207,1.211,2.207,2.362V284.81z M303.047,283.239c-1.151-0.024-2.458,0.18-2.458,1.307
				c0,0.696,0.455,1.008,0.983,1.008c0.768,0,1.259-0.479,1.427-0.972c0.036-0.12,0.048-0.24,0.048-0.336V283.239z"/>
			<path fill="#231F20" d="M305.774,277.686h1.055v8.516h-1.055V277.686z"/>
			<path fill="#231F20" d="M311.15,282.291c0-0.743-0.024-1.343-0.049-1.895h0.936l0.061,0.995h0.023
				c0.42-0.707,1.115-1.115,2.063-1.115c1.415,0,2.471,1.188,2.471,2.938c0,2.087-1.283,3.118-2.651,3.118
				c-0.768,0-1.438-0.336-1.786-0.911h-0.024v3.154h-1.043V282.291z M312.193,283.839c0,0.155,0.012,0.3,0.048,0.432
				c0.192,0.731,0.828,1.235,1.583,1.235c1.115,0,1.764-0.912,1.764-2.243c0-1.151-0.612-2.146-1.728-2.146
				c-0.72,0-1.403,0.504-1.595,1.295c-0.036,0.132-0.072,0.288-0.072,0.42V283.839z"/>
			<path fill="#231F20" d="M317.978,282.207c0-0.684-0.013-1.271-0.049-1.811h0.924l0.048,1.151h0.036
				c0.264-0.779,0.911-1.271,1.619-1.271c0.108,0,0.191,0.012,0.288,0.024v0.995c-0.108-0.024-0.216-0.024-0.36-0.024
				c-0.743,0-1.271,0.552-1.415,1.344c-0.023,0.144-0.036,0.324-0.036,0.491v3.095h-1.055V282.207z"/>
			<path fill="#231F20" d="M322.369,283.49c0.024,1.428,0.924,2.016,1.991,2.016c0.756,0,1.224-0.132,1.607-0.3l0.191,0.755
				c-0.372,0.168-1.02,0.372-1.942,0.372c-1.787,0-2.854-1.188-2.854-2.938s1.031-3.118,2.723-3.118
				c1.906,0,2.398,1.655,2.398,2.723c0,0.216-0.013,0.372-0.036,0.491H322.369z M325.463,282.735
				c0.012-0.66-0.276-1.703-1.463-1.703c-1.08,0-1.535,0.972-1.619,1.703H325.463z"/>
			<path fill="#231F20" d="M331.931,285.997c-0.276,0.132-0.888,0.336-1.668,0.336c-1.751,0-2.89-1.188-2.89-2.962
				c0-1.787,1.223-3.095,3.118-3.095c0.623,0,1.175,0.156,1.463,0.312l-0.24,0.804c-0.251-0.132-0.647-0.275-1.223-0.275
				c-1.331,0-2.051,0.995-2.051,2.194c0,1.344,0.863,2.171,2.015,2.171c0.6,0,0.995-0.144,1.295-0.275L331.931,285.997z"/>
			<path fill="#231F20" d="M338.351,283.251c0,2.146-1.499,3.082-2.891,3.082c-1.56,0-2.782-1.151-2.782-2.986
				c0-1.931,1.283-3.07,2.878-3.07C337.223,280.276,338.351,281.487,338.351,283.251z M333.757,283.311
				c0,1.271,0.72,2.231,1.751,2.231c1.008,0,1.763-0.948,1.763-2.255c0-0.983-0.491-2.219-1.738-2.219
				C334.297,281.068,333.757,282.22,333.757,283.311z"/>
			<path fill="#231F20" d="M343.824,285.997c-0.276,0.132-0.888,0.336-1.668,0.336c-1.751,0-2.89-1.188-2.89-2.962
				c0-1.787,1.223-3.095,3.118-3.095c0.623,0,1.175,0.156,1.463,0.312l-0.24,0.804c-0.251-0.132-0.647-0.275-1.223-0.275
				c-1.331,0-2.051,0.995-2.051,2.194c0,1.344,0.863,2.171,2.015,2.171c0.6,0,0.995-0.144,1.295-0.275L343.824,285.997z"/>
			<path fill="#231F20" d="M345.577,283.49c0.024,1.428,0.924,2.016,1.991,2.016c0.756,0,1.224-0.132,1.607-0.3l0.191,0.755
				c-0.372,0.168-1.02,0.372-1.942,0.372c-1.787,0-2.854-1.188-2.854-2.938s1.031-3.118,2.723-3.118
				c1.906,0,2.398,1.655,2.398,2.723c0,0.216-0.012,0.372-0.036,0.491H345.577z M348.671,282.735
				c0.012-0.66-0.276-1.703-1.463-1.703c-1.08,0-1.535,0.972-1.619,1.703H348.671z"/>
			<path fill="#231F20" d="M237.237,297.052c-0.06-1.128-0.132-2.495-0.132-3.49h-0.024c-0.288,0.936-0.612,1.955-1.02,3.07
				l-1.427,3.922h-0.792l-1.319-3.85c-0.384-1.151-0.695-2.184-0.923-3.143h-0.024c-0.024,1.008-0.084,2.351-0.156,3.574
				l-0.216,3.466h-0.995l0.563-8.084h1.332l1.379,3.91c0.336,0.995,0.6,1.883,0.815,2.723h0.024
				c0.216-0.815,0.503-1.703,0.863-2.723l1.439-3.91h1.331l0.504,8.084h-1.032L237.237,297.052z"/>
			<path fill="#231F20" d="M244.93,299.007c0,0.611,0.012,1.139,0.048,1.595h-0.936l-0.06-0.947h-0.024
				c-0.264,0.468-0.887,1.079-1.919,1.079c-0.911,0-2.003-0.516-2.003-2.543v-3.394h1.056v3.202c0,1.104,0.348,1.859,1.295,1.859
				c0.708,0,1.199-0.492,1.391-0.972c0.06-0.145,0.096-0.336,0.096-0.54v-3.55h1.056V299.007z"/>
			<path fill="#231F20" d="M246.685,292.086h1.056v8.516h-1.056V292.086z"/>
			<path fill="#231F20" d="M250.788,293.405v1.392h1.511v0.804h-1.511v3.13c0,0.72,0.204,1.128,0.792,1.128
				c0.288,0,0.456-0.024,0.611-0.072l0.048,0.804c-0.204,0.071-0.528,0.144-0.936,0.144c-0.492,0-0.888-0.168-1.14-0.443
				c-0.288-0.324-0.408-0.84-0.408-1.523v-3.166h-0.899v-0.804h0.899v-1.079L250.788,293.405z"/>
			<path fill="#231F20" d="M254.664,293.166c0,0.359-0.252,0.647-0.671,0.647c-0.384,0-0.636-0.288-0.636-0.647
				c0-0.36,0.264-0.66,0.66-0.66C254.4,292.506,254.664,292.794,254.664,293.166z M253.488,300.602v-5.805h1.056v5.805H253.488z"/>
			<path fill="#231F20" d="M256.296,296.691c0-0.743-0.024-1.343-0.048-1.895h0.936l0.06,0.995h0.024
				c0.419-0.707,1.115-1.115,2.063-1.115c1.415,0,2.471,1.188,2.471,2.938c0,2.087-1.283,3.118-2.651,3.118
				c-0.767,0-1.439-0.336-1.787-0.911h-0.024v3.154h-1.043V296.691z M257.339,298.239c0,0.155,0.012,0.3,0.048,0.432
				c0.192,0.731,0.828,1.235,1.583,1.235c1.115,0,1.764-0.912,1.764-2.243c0-1.151-0.612-2.146-1.728-2.146
				c-0.72,0-1.403,0.504-1.595,1.295c-0.036,0.132-0.072,0.288-0.072,0.42V298.239z"/>
			<path fill="#231F20" d="M263.125,292.086h1.055v8.516h-1.055V292.086z"/>
			<path fill="#231F20" d="M267.131,293.166c0,0.359-0.252,0.647-0.672,0.647c-0.384,0-0.636-0.288-0.636-0.647
				c0-0.36,0.265-0.66,0.66-0.66C266.868,292.506,267.131,292.794,267.131,293.166z M265.957,300.602v-5.805h1.055v5.805H265.957z"
				/>
			<path fill="#231F20" d="M272.902,300.397c-0.276,0.132-0.888,0.336-1.668,0.336c-1.751,0-2.89-1.188-2.89-2.962
				c0-1.787,1.223-3.095,3.118-3.095c0.623,0,1.175,0.156,1.463,0.312l-0.24,0.804c-0.251-0.132-0.647-0.275-1.223-0.275
				c-1.331,0-2.051,0.995-2.051,2.194c0,1.344,0.863,2.171,2.015,2.171c0.6,0,0.995-0.144,1.295-0.275L272.902,300.397z"/>
			<path fill="#231F20" d="M275.315,293.166c0,0.359-0.252,0.647-0.672,0.647c-0.384,0-0.636-0.288-0.636-0.647
				c0-0.36,0.265-0.66,0.66-0.66C275.051,292.506,275.315,292.794,275.315,293.166z M274.14,300.602v-5.805h1.055v5.805H274.14z"/>
			<path fill="#231F20" d="M281.949,292.086v7.017c0,0.516,0.023,1.104,0.048,1.499h-0.936l-0.048-1.008h-0.036
				c-0.312,0.648-1.008,1.14-1.955,1.14c-1.403,0-2.494-1.188-2.494-2.95c-0.013-1.931,1.199-3.106,2.603-3.106
				c0.899,0,1.487,0.42,1.751,0.876h0.023v-3.467H281.949z M280.905,297.159c0-0.132-0.012-0.312-0.048-0.443
				c-0.155-0.66-0.731-1.212-1.523-1.212c-1.091,0-1.738,0.96-1.738,2.231c0,1.175,0.588,2.146,1.715,2.146
				c0.708,0,1.355-0.479,1.547-1.259c0.036-0.145,0.048-0.288,0.048-0.456V297.159z"/>
			<path fill="#231F20" d="M287.792,299.21c0,0.504,0.024,0.996,0.084,1.392h-0.947l-0.084-0.731h-0.036
				c-0.323,0.456-0.947,0.863-1.775,0.863c-1.175,0-1.774-0.827-1.774-1.667c0-1.403,1.247-2.171,3.49-2.159v-0.119
				c0-0.468-0.132-1.344-1.319-1.332c-0.552,0-1.115,0.156-1.523,0.432l-0.24-0.707c0.48-0.3,1.188-0.504,1.919-0.504
				c1.775,0,2.207,1.211,2.207,2.362V299.21z M286.773,297.64c-1.151-0.024-2.458,0.18-2.458,1.307c0,0.696,0.455,1.008,0.983,1.008
				c0.768,0,1.259-0.479,1.427-0.972c0.036-0.12,0.048-0.24,0.048-0.336V297.64z"/>
			<path fill="#231F20" d="M294.5,292.086v7.017c0,0.516,0.023,1.104,0.048,1.499h-0.936l-0.048-1.008h-0.036
				c-0.312,0.648-1.008,1.14-1.955,1.14c-1.403,0-2.494-1.188-2.494-2.95c-0.013-1.931,1.199-3.106,2.603-3.106
				c0.899,0,1.487,0.42,1.751,0.876h0.023v-3.467H294.5z M293.457,297.159c0-0.132-0.012-0.312-0.048-0.443
				c-0.155-0.66-0.731-1.212-1.522-1.212c-1.092,0-1.739,0.96-1.739,2.231c0,1.175,0.587,2.146,1.715,2.146
				c0.708,0,1.355-0.479,1.547-1.259c0.036-0.145,0.048-0.288,0.048-0.456V297.159z"/>
			<path fill="#231F20" d="M296.854,297.891c0.024,1.428,0.924,2.016,1.991,2.016c0.756,0,1.224-0.132,1.607-0.3l0.191,0.755
				c-0.372,0.168-1.02,0.372-1.942,0.372c-1.787,0-2.854-1.188-2.854-2.938s1.031-3.118,2.723-3.118
				c1.906,0,2.398,1.655,2.398,2.723c0,0.216-0.012,0.372-0.036,0.491H296.854z M299.949,297.136
				c0.012-0.66-0.276-1.703-1.463-1.703c-1.08,0-1.535,0.972-1.619,1.703H299.949z"/>
			<path fill="#231F20" d="M309.824,292.086v7.017c0,0.516,0.023,1.104,0.048,1.499h-0.936l-0.048-1.008h-0.036
				c-0.312,0.648-1.008,1.14-1.955,1.14c-1.403,0-2.494-1.188-2.494-2.95c-0.013-1.931,1.199-3.106,2.603-3.106
				c0.899,0,1.487,0.42,1.751,0.876h0.023v-3.467H309.824z M308.78,297.159c0-0.132-0.012-0.312-0.048-0.443
				c-0.155-0.66-0.731-1.212-1.523-1.212c-1.091,0-1.738,0.96-1.738,2.231c0,1.175,0.588,2.146,1.715,2.146
				c0.708,0,1.355-0.479,1.547-1.259c0.036-0.145,0.048-0.288,0.048-0.456V297.159z"/>
			<path fill="#231F20" d="M312.177,297.891c0.024,1.428,0.924,2.016,1.991,2.016c0.756,0,1.224-0.132,1.607-0.3l0.191,0.755
				c-0.372,0.168-1.02,0.372-1.942,0.372c-1.787,0-2.854-1.188-2.854-2.938s1.031-3.118,2.723-3.118
				c1.906,0,2.398,1.655,2.398,2.723c0,0.216-0.013,0.372-0.036,0.491H312.177z M315.272,297.136
				c0.012-0.66-0.276-1.703-1.463-1.703c-1.08,0-1.535,0.972-1.619,1.703H315.272z"/>
			<path fill="#231F20" d="M320.146,296.691c0-0.743-0.024-1.343-0.049-1.895h0.936l0.061,0.995h0.023
				c0.42-0.707,1.115-1.115,2.063-1.115c1.415,0,2.471,1.188,2.471,2.938c0,2.087-1.283,3.118-2.651,3.118
				c-0.768,0-1.438-0.336-1.786-0.911h-0.024v3.154h-1.043V296.691z M321.189,298.239c0,0.155,0.012,0.3,0.048,0.432
				c0.192,0.731,0.828,1.235,1.583,1.235c1.115,0,1.764-0.912,1.764-2.243c0-1.151-0.612-2.146-1.728-2.146
				c-0.72,0-1.403,0.504-1.595,1.295c-0.036,0.132-0.072,0.288-0.072,0.42V298.239z"/>
			<path fill="#231F20" d="M331.051,299.21c0,0.504,0.024,0.996,0.084,1.392h-0.947l-0.084-0.731h-0.036
				c-0.324,0.456-0.947,0.863-1.775,0.863c-1.175,0-1.774-0.827-1.774-1.667c0-1.403,1.247-2.171,3.49-2.159v-0.119
				c0-0.468-0.132-1.344-1.319-1.332c-0.552,0-1.115,0.156-1.523,0.432l-0.24-0.707c0.48-0.3,1.188-0.504,1.919-0.504
				c1.775,0,2.207,1.211,2.207,2.362V299.21z M330.032,297.64c-1.151-0.024-2.458,0.18-2.458,1.307c0,0.696,0.455,1.008,0.983,1.008
				c0.768,0,1.259-0.479,1.427-0.972c0.036-0.12,0.048-0.24,0.048-0.336V297.64z"/>
			<path fill="#231F20" d="M332.758,296.607c0-0.684-0.013-1.271-0.049-1.811h0.924l0.048,1.151h0.036
				c0.264-0.779,0.911-1.271,1.619-1.271c0.108,0,0.192,0.012,0.288,0.024v0.995c-0.108-0.024-0.216-0.024-0.36-0.024
				c-0.743,0-1.271,0.552-1.415,1.344c-0.023,0.144-0.036,0.324-0.036,0.491v3.095h-1.055V296.607z"/>
			<path fill="#231F20" d="M340.7,300.397c-0.276,0.132-0.888,0.336-1.668,0.336c-1.751,0-2.89-1.188-2.89-2.962
				c0-1.787,1.223-3.095,3.118-3.095c0.623,0,1.175,0.156,1.463,0.312l-0.239,0.804c-0.252-0.132-0.648-0.275-1.224-0.275
				c-1.331,0-2.051,0.995-2.051,2.194c0,1.344,0.863,2.171,2.015,2.171c0.6,0,0.995-0.144,1.295-0.275L340.7,300.397z"/>
			<path fill="#231F20" d="M342.453,297.891c0.024,1.428,0.924,2.016,1.991,2.016c0.756,0,1.224-0.132,1.607-0.3l0.191,0.755
				c-0.372,0.168-1.02,0.372-1.942,0.372c-1.787,0-2.854-1.188-2.854-2.938s1.031-3.118,2.723-3.118
				c1.906,0,2.398,1.655,2.398,2.723c0,0.216-0.013,0.372-0.036,0.491H342.453z M345.547,297.136
				c0.012-0.66-0.276-1.703-1.463-1.703c-1.08,0-1.535,0.972-1.619,1.703H345.547z"/>
			<path fill="#231F20" d="M349.052,293.166c0,0.359-0.252,0.647-0.672,0.647c-0.384,0-0.636-0.288-0.636-0.647
				c0-0.36,0.265-0.66,0.66-0.66C348.789,292.506,349.052,292.794,349.052,293.166z M347.877,300.602v-5.805h1.055v5.805H347.877z"
				/>
			<path fill="#231F20" d="M350.685,296.607c0-0.684-0.013-1.271-0.049-1.811h0.924l0.048,1.151h0.036
				c0.264-0.779,0.911-1.271,1.619-1.271c0.108,0,0.191,0.012,0.288,0.024v0.995c-0.108-0.024-0.216-0.024-0.36-0.024
				c-0.743,0-1.271,0.552-1.415,1.344c-0.023,0.144-0.036,0.324-0.036,0.491v3.095h-1.055V296.607z"/>
			<path fill="#231F20" d="M359.742,297.651c0,2.146-1.499,3.082-2.891,3.082c-1.56,0-2.782-1.151-2.782-2.986
				c0-1.931,1.283-3.07,2.878-3.07C358.614,294.677,359.742,295.888,359.742,297.651z M355.148,297.711
				c0,1.271,0.72,2.231,1.751,2.231c1.008,0,1.763-0.948,1.763-2.255c0-0.983-0.491-2.219-1.738-2.219
				C355.688,295.469,355.148,296.62,355.148,297.711z"/>
			<path fill="#231F20" d="M360.932,299.534c0.324,0.191,0.876,0.408,1.403,0.408c0.756,0,1.115-0.372,1.115-0.864
				c0-0.504-0.3-0.768-1.067-1.055c-1.056-0.384-1.547-0.948-1.547-1.644c0-0.936,0.768-1.703,2.003-1.703
				c0.588,0,1.104,0.156,1.415,0.36l-0.252,0.768c-0.228-0.145-0.647-0.349-1.188-0.349c-0.623,0-0.959,0.36-0.959,0.792
				c0,0.479,0.336,0.695,1.091,0.995c0.996,0.372,1.523,0.876,1.523,1.739c0,1.031-0.804,1.751-2.158,1.751
				c-0.636,0-1.224-0.168-1.632-0.407L360.932,299.534z"/>
			<path fill="#231F20" d="M368.228,299.534c0.324,0.191,0.876,0.408,1.403,0.408c0.756,0,1.115-0.372,1.115-0.864
				c0-0.504-0.3-0.768-1.067-1.055c-1.056-0.384-1.547-0.948-1.547-1.644c0-0.936,0.768-1.703,2.003-1.703
				c0.588,0,1.104,0.156,1.415,0.36l-0.252,0.768c-0.228-0.145-0.647-0.349-1.188-0.349c-0.623,0-0.959,0.36-0.959,0.792
				c0,0.479,0.336,0.695,1.091,0.995c0.996,0.372,1.523,0.876,1.523,1.739c0,1.031-0.804,1.751-2.159,1.751
				c-0.635,0-1.223-0.168-1.631-0.407L368.228,299.534z"/>
			<path fill="#231F20" d="M373.711,297.891c0.024,1.428,0.924,2.016,1.991,2.016c0.756,0,1.224-0.132,1.607-0.3l0.191,0.755
				c-0.372,0.168-1.02,0.372-1.942,0.372c-1.787,0-2.854-1.188-2.854-2.938s1.031-3.118,2.723-3.118
				c1.906,0,2.398,1.655,2.398,2.723c0,0.216-0.012,0.372-0.036,0.491H373.711z M376.806,297.136
				c0.012-0.66-0.276-1.703-1.463-1.703c-1.08,0-1.535,0.972-1.619,1.703H376.806z"/>
			<path fill="#231F20" d="M379.592,294.797l0.827,1.247c0.229,0.324,0.408,0.611,0.601,0.936h0.023
				c0.192-0.336,0.384-0.636,0.588-0.947l0.804-1.235h1.151l-1.979,2.807l2.027,2.998h-1.188l-0.863-1.308
				c-0.229-0.336-0.42-0.659-0.624-1.007h-0.023c-0.192,0.348-0.384,0.659-0.612,1.007l-0.839,1.308h-1.164l2.063-2.962
				l-1.967-2.843H379.592z"/>
			<path fill="#231F20" d="M389.513,299.007c0,0.611,0.013,1.139,0.049,1.595h-0.936l-0.061-0.947h-0.023
				c-0.265,0.468-0.888,1.079-1.919,1.079c-0.912,0-2.003-0.516-2.003-2.543v-3.394h1.055v3.202c0,1.104,0.349,1.859,1.296,1.859
				c0.707,0,1.199-0.492,1.391-0.972c0.061-0.145,0.097-0.336,0.097-0.54v-3.55h1.055V299.007z"/>
			<path fill="#231F20" d="M395.346,299.21c0,0.504,0.024,0.996,0.084,1.392h-0.947l-0.084-0.731h-0.036
				c-0.324,0.456-0.947,0.863-1.775,0.863c-1.175,0-1.774-0.827-1.774-1.667c0-1.403,1.247-2.171,3.49-2.159v-0.119
				c0-0.468-0.132-1.344-1.319-1.332c-0.552,0-1.115,0.156-1.523,0.432l-0.24-0.707c0.48-0.3,1.188-0.504,1.919-0.504
				c1.775,0,2.207,1.211,2.207,2.362V299.21z M394.327,297.64c-1.151-0.024-2.458,0.18-2.458,1.307c0,0.696,0.455,1.008,0.983,1.008
				c0.768,0,1.259-0.479,1.427-0.972c0.036-0.12,0.048-0.24,0.048-0.336V297.64z"/>
			<path fill="#231F20" d="M398.228,293.166c0,0.359-0.252,0.647-0.672,0.647c-0.384,0-0.636-0.288-0.636-0.647
				c0-0.36,0.265-0.66,0.66-0.66C397.964,292.506,398.228,292.794,398.228,293.166z M397.053,300.602v-5.805h1.055v5.805H397.053z"
				/>
			<path fill="#231F20" d="M399.716,299.534c0.324,0.191,0.876,0.408,1.403,0.408c0.756,0,1.115-0.372,1.115-0.864
				c0-0.504-0.3-0.768-1.067-1.055c-1.056-0.384-1.547-0.948-1.547-1.644c0-0.936,0.768-1.703,2.003-1.703
				c0.588,0,1.104,0.156,1.415,0.36l-0.252,0.768c-0.228-0.145-0.647-0.349-1.188-0.349c-0.623,0-0.959,0.36-0.959,0.792
				c0,0.479,0.336,0.695,1.091,0.995c0.996,0.372,1.523,0.876,1.523,1.739c0,1.031-0.804,1.751-2.159,1.751
				c-0.635,0-1.223-0.168-1.631-0.407L399.716,299.534z"/>
		</g>
	</g>
	<rect x="8.815" y="206.144" fill="#E6E7E8" width="150.759" height="121.821"/>
	<rect x="8.815" y="236.965" fill="#FFFFFF" width="150.759" height="32.673"/>
	<rect x="8.815" y="298.965" fill="#FFFFFF" width="150.759" height="20"/>
	<rect x="18.755" y="214.66" fill="#B06274" stroke="#231F20" stroke-miterlimit="10" width="13.819" height="13.82"/>
	<rect x="18.755" y="245.406" fill="#B9ACD4" stroke="#231F20" stroke-miterlimit="10" width="13.819" height="13.82"/>
	<rect x="18.755" y="277.298" fill="#C46A30" stroke="#231F20" stroke-miterlimit="10" width="13.819" height="13.819"/>
	<g>
		<path fill="#231F20" d="M44.756,216.574v8.084h-1.056v-8.084H44.756z"/>
		<path fill="#231F20" d="M46.665,220.425c0-0.612-0.012-1.092-0.048-1.571h0.936l0.06,0.959h0.024
			c0.288-0.539,0.959-1.079,1.919-1.079c0.803,0,2.051,0.479,2.051,2.471v3.454h-1.056v-3.346c0-0.936-0.348-1.716-1.343-1.716
			c-0.684,0-1.223,0.492-1.415,1.08c-0.048,0.132-0.072,0.312-0.072,0.491v3.49h-1.056V220.425z"/>
		<path fill="#231F20" d="M53.433,224.658v-5.001h-0.804v-0.804h0.804v-0.276c0-0.815,0.192-1.559,0.672-2.026
			c0.396-0.384,0.923-0.54,1.415-0.54c0.384,0,0.696,0.084,0.899,0.168l-0.144,0.815c-0.156-0.071-0.359-0.132-0.671-0.132
			c-0.899,0-1.127,0.779-1.127,1.68v0.312h1.403v0.804h-1.403v5.001H53.433z"/>
		<path fill="#231F20" d="M57.261,221.947c0.024,1.428,0.923,2.016,1.991,2.016c0.755,0,1.223-0.132,1.607-0.3l0.192,0.755
			c-0.372,0.168-1.019,0.372-1.943,0.372c-1.787,0-2.854-1.188-2.854-2.938s1.032-3.118,2.723-3.118
			c1.907,0,2.399,1.655,2.399,2.723c0,0.216-0.012,0.372-0.036,0.491H57.261z M60.355,221.192c0.012-0.66-0.276-1.703-1.463-1.703
			c-1.08,0-1.535,0.972-1.619,1.703H60.355z"/>
		<path fill="#231F20" d="M66.822,224.454c-0.276,0.132-0.887,0.336-1.667,0.336c-1.751,0-2.891-1.188-2.891-2.962
			c0-1.787,1.224-3.095,3.119-3.095c0.624,0,1.175,0.156,1.463,0.312l-0.24,0.804c-0.252-0.132-0.647-0.275-1.223-0.275
			c-1.332,0-2.051,0.995-2.051,2.194c0,1.344,0.864,2.171,2.015,2.171c0.6,0,0.996-0.144,1.295-0.275L66.822,224.454z"/>
		<path fill="#231F20" d="M72.126,224.442c-0.24,0.12-0.792,0.324-1.511,0.336l-0.3,0.479c0.444,0.084,0.84,0.384,0.84,0.876
			c0,0.719-0.6,0.995-1.248,0.995c-0.276,0-0.612-0.072-0.839-0.204l0.18-0.54c0.18,0.108,0.42,0.168,0.66,0.168
			c0.276,0,0.516-0.096,0.516-0.384c-0.012-0.312-0.372-0.443-0.936-0.503l0.504-0.924c-1.475-0.18-2.423-1.319-2.423-2.927
			c0-1.774,1.224-3.082,3.119-3.082c0.624,0,1.175,0.156,1.463,0.312l-0.24,0.804c-0.252-0.132-0.647-0.275-1.223-0.275
			c-1.332,0-2.051,0.983-2.051,2.194c0,1.331,0.864,2.159,2.015,2.159c0.6,0,1.007-0.145,1.295-0.276L72.126,224.442z"/>
		<path fill="#231F20" d="M77.43,223.267c0,0.504,0.024,0.996,0.084,1.392h-0.947l-0.084-0.731h-0.036
			c-0.324,0.456-0.947,0.863-1.775,0.863c-1.175,0-1.775-0.827-1.775-1.667c0-1.403,1.247-2.171,3.49-2.159v-0.119
			c0-0.468-0.132-1.344-1.319-1.332c-0.552,0-1.116,0.156-1.523,0.432l-0.24-0.707c0.479-0.3,1.187-0.504,1.919-0.504
			c1.775,0,2.207,1.211,2.207,2.362V223.267z M73.856,217.858c-0.024-0.78,0.3-1.248,0.815-1.248c0.264,0,0.468,0.12,0.744,0.264
			c0.192,0.108,0.36,0.204,0.503,0.204c0.192,0,0.312-0.107,0.336-0.504h0.564c0.012,0.792-0.252,1.212-0.816,1.212
			c-0.264,0-0.492-0.12-0.744-0.252c-0.24-0.144-0.372-0.216-0.516-0.216c-0.192,0-0.288,0.204-0.312,0.54H73.856z M76.411,221.696
			c-1.151-0.024-2.458,0.18-2.458,1.307c0,0.696,0.456,1.008,0.983,1.008c0.768,0,1.259-0.479,1.427-0.972
			c0.036-0.12,0.048-0.24,0.048-0.336V221.696z"/>
		<path fill="#231F20" d="M84.389,221.708c0,2.146-1.499,3.082-2.89,3.082c-1.559,0-2.783-1.151-2.783-2.986
			c0-1.931,1.284-3.07,2.878-3.07C83.262,218.733,84.389,219.944,84.389,221.708z M79.796,221.768c0,1.271,0.72,2.231,1.751,2.231
			c1.007,0,1.763-0.948,1.763-2.255c0-0.983-0.492-2.219-1.739-2.219C80.335,219.525,79.796,220.677,79.796,221.768z"/>
		<path fill="#231F20" d="M88.268,220.748c0-0.743-0.024-1.343-0.048-1.895h0.936l0.06,0.995h0.024
			c0.419-0.707,1.115-1.115,2.063-1.115c1.416,0,2.471,1.188,2.471,2.938c0,2.087-1.283,3.118-2.65,3.118
			c-0.768,0-1.439-0.336-1.787-0.911h-0.024v3.154h-1.043V220.748z M89.312,222.296c0,0.155,0.012,0.3,0.048,0.432
			c0.192,0.731,0.828,1.235,1.583,1.235c1.115,0,1.763-0.912,1.763-2.243c0-1.151-0.611-2.146-1.727-2.146
			c-0.72,0-1.403,0.504-1.595,1.295c-0.036,0.132-0.072,0.288-0.072,0.42V222.296z"/>
		<path fill="#231F20" d="M95.684,221.947c0.024,1.428,0.923,2.016,1.991,2.016c0.755,0,1.223-0.132,1.607-0.3l0.192,0.755
			c-0.372,0.168-1.019,0.372-1.943,0.372c-1.787,0-2.854-1.188-2.854-2.938s1.032-3.118,2.723-3.118
			c1.907,0,2.399,1.655,2.399,2.723c0,0.216-0.012,0.372-0.036,0.491H95.684z M98.778,221.192c0.012-0.66-0.276-1.703-1.463-1.703
			c-1.08,0-1.535,0.972-1.619,1.703H98.778z"/>
		<path fill="#231F20" d="M101.107,216.143h1.056v8.516h-1.056V216.143z"/>
		<path fill="#231F20" d="M109.192,221.708c0,2.146-1.499,3.082-2.89,3.082c-1.559,0-2.783-1.151-2.783-2.986
			c0-1.931,1.284-3.07,2.878-3.07C108.065,218.733,109.192,219.944,109.192,221.708z M104.599,221.768
			c0,1.271,0.72,2.231,1.751,2.231c1.007,0,1.763-0.948,1.763-2.255c0-0.983-0.492-2.219-1.739-2.219
			C105.139,219.525,104.599,220.677,104.599,221.768z"/>
		<path fill="#231F20" d="M114.151,216.574v3.383h3.91v-3.383h1.055v8.084h-1.055v-3.79h-3.91v3.79h-1.056v-8.084H114.151z"/>
		<path fill="#231F20" d="M120.931,216.671c0.504-0.084,1.164-0.156,2.003-0.156c1.032,0,1.787,0.24,2.267,0.672
			c0.433,0.384,0.708,0.972,0.708,1.69c0,0.732-0.216,1.308-0.624,1.728c-0.563,0.588-1.451,0.888-2.47,0.888
			c-0.313,0-0.601-0.013-0.84-0.072v3.238h-1.044V216.671z M121.975,220.568c0.228,0.061,0.516,0.084,0.863,0.084
			c1.26,0,2.027-0.624,2.027-1.715c0-1.079-0.768-1.596-1.907-1.596c-0.456,0-0.804,0.036-0.983,0.084V220.568z"/>
		<path fill="#231F20" d="M129.09,224.658l-2.65-8.084h1.14l1.259,3.982c0.336,1.091,0.636,2.074,0.863,3.022h0.024
			c0.228-0.936,0.552-1.955,0.924-3.011l1.367-3.994h1.115l-2.891,8.084H129.09z"/>
	</g>
	<g>
		<path fill="#231F20" d="M44.18,241.224h4.354v0.877h-3.298v2.686h3.046v0.863h-3.046v3.658H44.18V241.224z"/>
		<path fill="#231F20" d="M53.538,247.917c0,0.504,0.024,0.996,0.084,1.391h-0.947l-0.084-0.73h-0.036
			c-0.324,0.455-0.947,0.863-1.775,0.863c-1.175,0-1.775-0.828-1.775-1.668c0-1.402,1.247-2.17,3.49-2.158v-0.119
			c0-0.469-0.132-1.344-1.319-1.332c-0.551,0-1.115,0.156-1.523,0.432l-0.24-0.707c0.479-0.301,1.188-0.504,1.919-0.504
			c1.775,0,2.207,1.211,2.207,2.361V247.917z M52.519,246.347c-1.151-0.025-2.459,0.18-2.459,1.307c0,0.695,0.456,1.008,0.983,1.008
			c0.768,0,1.259-0.48,1.427-0.973c0.036-0.119,0.048-0.24,0.048-0.336V246.347z"/>
		<path fill="#231F20" d="M56.468,242.112v1.391h1.511v0.805h-1.511v3.129c0,0.721,0.204,1.129,0.792,1.129
			c0.288,0,0.456-0.025,0.611-0.072l0.048,0.803c-0.204,0.072-0.528,0.145-0.936,0.145c-0.492,0-0.888-0.168-1.14-0.443
			c-0.288-0.324-0.408-0.84-0.408-1.523v-3.166h-0.899v-0.805h0.899v-1.078L56.468,242.112z"/>
		<path fill="#231F20" d="M64.349,246.358c0,2.146-1.499,3.082-2.89,3.082c-1.559,0-2.783-1.152-2.783-2.986
			c0-1.932,1.284-3.07,2.878-3.07C63.222,243.384,64.349,244.595,64.349,246.358z M59.756,246.417c0,1.271,0.72,2.232,1.751,2.232
			c1.007,0,1.763-0.949,1.763-2.256c0-0.982-0.492-2.219-1.739-2.219C60.295,244.175,59.756,245.327,59.756,246.417z"/>
		<path fill="#231F20" d="M65.684,245.313c0-0.684-0.012-1.27-0.048-1.811h0.923l0.048,1.152h0.036
			c0.264-0.779,0.912-1.271,1.619-1.271c0.108,0,0.192,0.012,0.288,0.023v0.996c-0.108-0.025-0.216-0.025-0.359-0.025
			c-0.744,0-1.271,0.553-1.416,1.344c-0.024,0.145-0.036,0.324-0.036,0.492v3.094h-1.056V245.313z"/>
		<path fill="#231F20" d="M70.076,246.597c0.024,1.428,0.923,2.016,1.991,2.016c0.756,0,1.224-0.131,1.607-0.299l0.191,0.754
			c-0.372,0.168-1.02,0.373-1.943,0.373c-1.787,0-2.854-1.188-2.854-2.939c0-1.75,1.032-3.117,2.723-3.117
			c1.907,0,2.399,1.654,2.399,2.723c0,0.215-0.013,0.371-0.036,0.49H70.076z M73.17,245.843c0.012-0.66-0.276-1.703-1.463-1.703
			c-1.08,0-1.535,0.971-1.619,1.703H73.17z"/>
		<path fill="#231F20" d="M75.356,248.241c0.324,0.191,0.876,0.408,1.403,0.408c0.756,0,1.115-0.373,1.115-0.865
			c0-0.504-0.3-0.768-1.067-1.055c-1.056-0.383-1.547-0.947-1.547-1.643c0-0.936,0.768-1.703,2.003-1.703
			c0.588,0,1.104,0.156,1.415,0.359l-0.252,0.768c-0.228-0.145-0.647-0.348-1.188-0.348c-0.623,0-0.959,0.359-0.959,0.791
			c0,0.48,0.336,0.695,1.091,0.996c0.996,0.371,1.523,0.875,1.523,1.738c0,1.031-0.804,1.752-2.158,1.752
			c-0.636,0-1.224-0.168-1.632-0.408L75.356,248.241z"/>
		<path fill="#231F20" d="M82.796,240.792h1.055v8.516h-1.055V240.792z"/>
		<path fill="#231F20" d="M86.803,241.872c0,0.359-0.252,0.648-0.672,0.648c-0.384,0-0.636-0.289-0.636-0.648s0.265-0.66,0.66-0.66
			C86.54,241.212,86.803,241.501,86.803,241.872z M85.628,249.308v-5.805h1.055v5.805H85.628z"/>
		<path fill="#231F20" d="M93.401,248.456c0,1.344-0.276,2.146-0.827,2.662c-0.576,0.518-1.392,0.697-2.123,0.697
			c-0.696,0-1.464-0.168-1.932-0.48l0.265-0.816c0.384,0.252,0.983,0.469,1.703,0.469c1.079,0,1.87-0.564,1.87-2.039v-0.635h-0.023
			c-0.312,0.539-0.947,0.971-1.847,0.971c-1.439,0-2.471-1.223-2.471-2.83c0-1.967,1.283-3.07,2.626-3.07
			c1.008,0,1.548,0.516,1.812,0.994h0.023l0.036-0.875h0.936c-0.036,0.408-0.048,0.889-0.048,1.584V248.456z M92.345,245.794
			c0-0.18-0.012-0.336-0.06-0.467c-0.192-0.625-0.696-1.129-1.476-1.129c-1.007,0-1.727,0.852-1.727,2.195
			c0,1.139,0.588,2.088,1.715,2.088c0.659,0,1.247-0.408,1.463-1.08c0.061-0.18,0.084-0.385,0.084-0.564V245.794z"/>
		<path fill="#231F20" d="M99.221,247.917c0,0.504,0.024,0.996,0.084,1.391h-0.947l-0.084-0.73h-0.036
			c-0.324,0.455-0.947,0.863-1.775,0.863c-1.175,0-1.774-0.828-1.774-1.668c0-1.402,1.247-2.17,3.49-2.158v-0.119
			c0-0.469-0.132-1.344-1.319-1.332c-0.552,0-1.115,0.156-1.523,0.432l-0.24-0.707c0.48-0.301,1.188-0.504,1.919-0.504
			c1.775,0,2.207,1.211,2.207,2.361V247.917z M98.202,246.347c-1.151-0.025-2.458,0.18-2.458,1.307c0,0.695,0.455,1.008,0.983,1.008
			c0.768,0,1.259-0.48,1.427-0.973c0.036-0.119,0.048-0.24,0.048-0.336V246.347z"/>
		<path fill="#231F20" d="M105.929,240.792v7.018c0,0.516,0.023,1.104,0.048,1.498h-0.936l-0.048-1.008h-0.036
			c-0.312,0.648-1.008,1.141-1.955,1.141c-1.403,0-2.494-1.188-2.494-2.951c-0.013-1.93,1.199-3.105,2.603-3.105
			c0.899,0,1.487,0.42,1.751,0.875h0.023v-3.467H105.929z M104.885,245.866c0-0.133-0.012-0.313-0.048-0.443
			c-0.155-0.66-0.731-1.213-1.523-1.213c-1.091,0-1.738,0.961-1.738,2.232c0,1.174,0.588,2.146,1.715,2.146
			c0.708,0,1.355-0.48,1.547-1.26c0.036-0.145,0.048-0.287,0.048-0.455V245.866z"/>
		<path fill="#231F20" d="M112.949,246.358c0,2.146-1.499,3.082-2.891,3.082c-1.56,0-2.782-1.152-2.782-2.986
			c0-1.932,1.283-3.07,2.878-3.07C111.821,243.384,112.949,244.595,112.949,246.358z M108.355,246.417
			c0,1.271,0.72,2.232,1.751,2.232c1.008,0,1.763-0.949,1.763-2.256c0-0.982-0.491-2.219-1.738-2.219
			C108.895,244.175,108.355,245.327,108.355,246.417z"/>
		<path fill="#231F20" d="M114.139,248.241c0.324,0.191,0.876,0.408,1.403,0.408c0.756,0,1.115-0.373,1.115-0.865
			c0-0.504-0.3-0.768-1.067-1.055c-1.056-0.383-1.547-0.947-1.547-1.643c0-0.936,0.768-1.703,2.003-1.703
			c0.588,0,1.104,0.156,1.415,0.359l-0.252,0.768c-0.228-0.145-0.647-0.348-1.188-0.348c-0.623,0-0.959,0.359-0.959,0.791
			c0,0.48,0.336,0.695,1.091,0.996c0.996,0.371,1.523,0.875,1.523,1.738c0,1.031-0.804,1.752-2.158,1.752
			c-0.636,0-1.224-0.168-1.632-0.408L114.139,248.241z"/>
		<path fill="#231F20" d="M48.234,262.317c0,0.504,0.024,0.996,0.084,1.391h-0.947l-0.084-0.73H47.25
			c-0.324,0.455-0.947,0.863-1.775,0.863c-1.175,0-1.775-0.828-1.775-1.668c0-1.402,1.247-2.17,3.49-2.158v-0.119
			c0-0.469-0.132-1.344-1.319-1.332c-0.552,0-1.116,0.156-1.523,0.432l-0.24-0.707c0.479-0.301,1.187-0.504,1.919-0.504
			c1.775,0,2.207,1.211,2.207,2.361V262.317z M47.214,260.747c-1.151-0.025-2.458,0.18-2.458,1.307c0,0.695,0.456,1.008,0.983,1.008
			c0.768,0,1.259-0.48,1.427-0.973c0.036-0.119,0.048-0.24,0.048-0.336V260.747z"/>
		<path fill="#231F20" d="M55.193,260.759c0,2.146-1.499,3.082-2.89,3.082c-1.559,0-2.783-1.152-2.783-2.986
			c0-1.932,1.284-3.07,2.878-3.07C54.066,257.784,55.193,258.995,55.193,260.759z M50.6,260.817c0,1.271,0.72,2.232,1.751,2.232
			c1.007,0,1.763-0.949,1.763-2.256c0-0.982-0.492-2.219-1.739-2.219C51.14,258.575,50.6,259.728,50.6,260.817z"/>
		<path fill="#231F20" d="M59.66,260.997c0.024,1.428,0.923,2.016,1.991,2.016c0.755,0,1.223-0.131,1.607-0.299l0.192,0.754
			c-0.372,0.168-1.019,0.373-1.943,0.373c-1.787,0-2.854-1.188-2.854-2.939c0-1.75,1.032-3.117,2.723-3.117
			c1.907,0,2.399,1.654,2.399,2.723c0,0.215-0.012,0.371-0.036,0.49H59.66z M62.754,260.243c0.012-0.66-0.276-1.703-1.463-1.703
			c-1.08,0-1.535,0.971-1.619,1.703H62.754z"/>
		<path fill="#231F20" d="M64.94,262.642c0.324,0.191,0.875,0.408,1.403,0.408c0.756,0,1.115-0.373,1.115-0.865
			c0-0.504-0.3-0.768-1.067-1.055c-1.055-0.383-1.547-0.947-1.547-1.643c0-0.936,0.768-1.703,2.003-1.703
			c0.587,0,1.104,0.156,1.415,0.359l-0.252,0.768c-0.228-0.145-0.647-0.348-1.187-0.348c-0.624,0-0.959,0.359-0.959,0.791
			c0,0.48,0.335,0.695,1.091,0.996c0.996,0.371,1.523,0.875,1.523,1.738c0,1.031-0.803,1.752-2.159,1.752
			c-0.636,0-1.223-0.168-1.631-0.408L64.94,262.642z"/>
		<path fill="#231F20" d="M71.107,256.513v1.391h1.511v0.805h-1.511v3.129c0,0.721,0.204,1.129,0.792,1.129
			c0.288,0,0.456-0.025,0.611-0.072l0.048,0.803c-0.203,0.072-0.527,0.145-0.935,0.145c-0.492,0-0.888-0.168-1.14-0.443
			c-0.288-0.324-0.408-0.84-0.408-1.523v-3.166h-0.899v-0.805h0.899v-1.078L71.107,256.513z"/>
		<path fill="#231F20" d="M74.983,256.272c0,0.359-0.252,0.648-0.672,0.648c-0.384,0-0.636-0.289-0.636-0.648s0.265-0.66,0.66-0.66
			C74.719,255.612,74.983,255.901,74.983,256.272z M73.808,263.708v-5.805h1.055v5.805H73.808z"/>
		<path fill="#231F20" d="M76.616,255.192h1.055v8.516h-1.055V255.192z"/>
		<path fill="#231F20" d="M84.701,260.759c0,2.146-1.499,3.082-2.891,3.082c-1.56,0-2.782-1.152-2.782-2.986
			c0-1.932,1.283-3.07,2.878-3.07C83.573,257.784,84.701,258.995,84.701,260.759z M80.107,260.817c0,1.271,0.72,2.232,1.751,2.232
			c1.008,0,1.763-0.949,1.763-2.256c0-0.982-0.491-2.219-1.738-2.219C80.647,258.575,80.107,259.728,80.107,260.817z"/>
		<path fill="#231F20" d="M93.581,255.192v7.018c0,0.516,0.023,1.104,0.048,1.498h-0.936l-0.048-1.008h-0.036
			c-0.312,0.648-1.008,1.141-1.955,1.141c-1.403,0-2.494-1.188-2.494-2.951c-0.013-1.93,1.199-3.105,2.603-3.105
			c0.899,0,1.487,0.42,1.751,0.875h0.023v-3.467H93.581z M92.537,260.267c0-0.133-0.012-0.313-0.048-0.443
			c-0.155-0.66-0.731-1.213-1.522-1.213c-1.092,0-1.739,0.961-1.739,2.232c0,1.174,0.587,2.146,1.715,2.146
			c0.708,0,1.355-0.48,1.547-1.26c0.036-0.145,0.048-0.287,0.048-0.455V260.267z"/>
		<path fill="#231F20" d="M95.935,260.997c0.024,1.428,0.924,2.016,1.991,2.016c0.756,0,1.224-0.131,1.607-0.299l0.191,0.754
			c-0.372,0.168-1.02,0.373-1.942,0.373c-1.787,0-2.854-1.188-2.854-2.939c0-1.75,1.031-3.117,2.723-3.117
			c1.906,0,2.398,1.654,2.398,2.723c0,0.215-0.013,0.371-0.036,0.49H95.935z M99.03,260.243c0.012-0.66-0.276-1.703-1.463-1.703
			c-1.08,0-1.535,0.971-1.619,1.703H99.03z"/>
		<path fill="#231F20" d="M104.311,257.903l1.14,3.25c0.191,0.541,0.348,1.02,0.468,1.5h0.036c0.132-0.48,0.3-0.959,0.491-1.5
			l1.128-3.25h1.103l-2.278,5.805h-1.008l-2.206-5.805H104.311z"/>
		<path fill="#231F20" d="M110.85,256.272c0,0.359-0.252,0.648-0.672,0.648c-0.384,0-0.636-0.289-0.636-0.648s0.265-0.66,0.66-0.66
			C110.586,255.612,110.85,255.901,110.85,256.272z M109.675,263.708v-5.805h1.055v5.805H109.675z"/>
		<path fill="#231F20" d="M117.485,255.192v7.018c0,0.516,0.023,1.104,0.048,1.498h-0.936l-0.048-1.008h-0.036
			c-0.312,0.648-1.008,1.141-1.955,1.141c-1.403,0-2.494-1.188-2.494-2.951c-0.013-1.93,1.199-3.105,2.603-3.105
			c0.899,0,1.487,0.42,1.751,0.875h0.023v-3.467H117.485z M116.441,260.267c0-0.133-0.012-0.313-0.048-0.443
			c-0.155-0.66-0.731-1.213-1.522-1.213c-1.092,0-1.739,0.961-1.739,2.232c0,1.174,0.587,2.146,1.715,2.146
			c0.708,0,1.355-0.48,1.547-1.26c0.036-0.145,0.048-0.287,0.048-0.455V260.267z"/>
		<path fill="#231F20" d="M123.329,262.317c0,0.504,0.024,0.996,0.084,1.391h-0.947l-0.084-0.73h-0.036
			c-0.324,0.455-0.947,0.863-1.775,0.863c-1.175,0-1.774-0.828-1.774-1.668c0-1.402,1.247-2.17,3.49-2.158v-0.119
			c0-0.469-0.132-1.344-1.319-1.332c-0.552,0-1.115,0.156-1.523,0.432l-0.24-0.707c0.48-0.301,1.188-0.504,1.919-0.504
			c1.775,0,2.207,1.211,2.207,2.361V262.317z M122.309,260.747c-1.151-0.025-2.458,0.18-2.458,1.307
			c0,0.695,0.455,1.008,0.983,1.008c0.768,0,1.259-0.48,1.427-0.973c0.036-0.119,0.048-0.24,0.048-0.336V260.747z"/>
	</g>
	<g>
		<path fill="#231F20" d="M43.701,279.128h4.354v0.877h-3.298v2.686h3.046v0.863h-3.046v3.658h-1.056V279.128z"/>
		<path fill="#231F20" d="M53.059,285.821c0,0.504,0.024,0.996,0.084,1.391h-0.947l-0.084-0.73h-0.036
			c-0.324,0.455-0.947,0.863-1.775,0.863c-1.175,0-1.775-0.828-1.775-1.668c0-1.402,1.247-2.17,3.49-2.158v-0.119
			c0-0.469-0.132-1.344-1.319-1.332c-0.552,0-1.116,0.156-1.523,0.432l-0.24-0.707c0.479-0.301,1.187-0.504,1.919-0.504
			c1.775,0,2.207,1.211,2.207,2.361V285.821z M52.039,284.251c-1.151-0.025-2.458,0.18-2.458,1.307c0,0.695,0.456,1.008,0.983,1.008
			c0.768,0,1.259-0.48,1.427-0.973c0.036-0.119,0.048-0.24,0.048-0.336V284.251z"/>
		<path fill="#231F20" d="M55.989,280.017v1.391H57.5v0.805h-1.511v3.129c0,0.721,0.204,1.129,0.792,1.129
			c0.288,0,0.456-0.025,0.611-0.072l0.048,0.803c-0.204,0.072-0.528,0.145-0.936,0.145c-0.492,0-0.888-0.168-1.14-0.443
			c-0.288-0.324-0.408-0.84-0.408-1.523v-3.166h-0.899v-0.805h0.899v-1.078L55.989,280.017z"/>
		<path fill="#231F20" d="M63.87,284.263c0,2.146-1.499,3.082-2.89,3.082c-1.559,0-2.783-1.152-2.783-2.986
			c0-1.932,1.284-3.07,2.878-3.07C62.743,281.288,63.87,282.499,63.87,284.263z M59.276,284.321c0,1.271,0.72,2.232,1.751,2.232
			c1.007,0,1.763-0.949,1.763-2.256c0-0.982-0.492-2.219-1.739-2.219C59.816,282.079,59.276,283.231,59.276,284.321z"/>
		<path fill="#231F20" d="M65.205,283.218c0-0.684-0.012-1.27-0.048-1.811h0.923l0.048,1.152h0.036
			c0.264-0.779,0.912-1.271,1.619-1.271c0.108,0,0.192,0.012,0.288,0.023v0.996c-0.108-0.025-0.216-0.025-0.36-0.025
			c-0.744,0-1.271,0.553-1.416,1.344c-0.024,0.145-0.036,0.324-0.036,0.492v3.094h-1.056V283.218z"/>
		<path fill="#231F20" d="M69.597,284.501c0.024,1.428,0.923,2.016,1.991,2.016c0.755,0,1.223-0.131,1.607-0.299l0.192,0.754
			c-0.372,0.168-1.019,0.373-1.943,0.373c-1.787,0-2.854-1.188-2.854-2.939c0-1.75,1.032-3.117,2.723-3.117
			c1.907,0,2.399,1.654,2.399,2.723c0,0.215-0.012,0.371-0.036,0.49H69.597z M72.691,283.747c0.012-0.66-0.276-1.703-1.463-1.703
			c-1.079,0-1.535,0.971-1.619,1.703H72.691z"/>
		<path fill="#231F20" d="M74.876,286.146c0.324,0.191,0.875,0.408,1.403,0.408c0.756,0,1.115-0.373,1.115-0.865
			c0-0.504-0.3-0.768-1.067-1.055c-1.055-0.383-1.547-0.947-1.547-1.643c0-0.936,0.768-1.703,2.003-1.703
			c0.587,0,1.103,0.156,1.415,0.359l-0.252,0.768c-0.228-0.145-0.647-0.348-1.187-0.348c-0.624,0-0.959,0.359-0.959,0.791
			c0,0.48,0.335,0.695,1.091,0.996c0.995,0.371,1.523,0.875,1.523,1.738c0,1.031-0.803,1.752-2.159,1.752
			c-0.636,0-1.223-0.168-1.631-0.408L74.876,286.146z"/>
		<path fill="#231F20" d="M83.492,279.776c0,0.359-0.252,0.648-0.671,0.648c-0.384,0-0.636-0.289-0.636-0.648s0.264-0.66,0.66-0.66
			C83.228,279.116,83.492,279.405,83.492,279.776z M82.316,287.212v-5.805h1.056v5.805H82.316z"/>
		<path fill="#231F20" d="M85.125,282.979c0-0.613-0.024-1.092-0.048-1.572H86l0.048,0.947h0.036
			c0.324-0.551,0.864-1.066,1.835-1.066c0.78,0,1.379,0.479,1.631,1.162h0.024c0.18-0.336,0.419-0.574,0.66-0.754
			c0.348-0.266,0.719-0.408,1.271-0.408c0.78,0,1.919,0.504,1.919,2.518v3.406h-1.031v-3.273c0-1.127-0.42-1.787-1.259-1.787
			c-0.612,0-1.067,0.443-1.259,0.947c-0.048,0.156-0.084,0.336-0.084,0.527v3.586h-1.031v-3.479c0-0.922-0.408-1.582-1.211-1.582
			c-0.648,0-1.14,0.527-1.308,1.055c-0.06,0.145-0.084,0.336-0.084,0.516v3.49h-1.031V282.979z"/>
		<path fill="#231F20" d="M99.99,285.618c0,0.611,0.012,1.139,0.048,1.594h-0.936l-0.06-0.947h-0.024
			c-0.264,0.469-0.887,1.08-1.919,1.08c-0.911,0-2.003-0.516-2.003-2.543v-3.395h1.056v3.203c0,1.104,0.348,1.859,1.295,1.859
			c0.708,0,1.199-0.492,1.391-0.973c0.06-0.145,0.096-0.336,0.096-0.539v-3.551h1.056V285.618z"/>
		<path fill="#231F20" d="M101.744,282.979c0-0.613-0.012-1.092-0.048-1.572h0.936l0.06,0.959h0.024
			c0.288-0.539,0.959-1.078,1.919-1.078c0.803,0,2.051,0.479,2.051,2.471v3.453h-1.056v-3.346c0-0.936-0.348-1.715-1.343-1.715
			c-0.684,0-1.223,0.492-1.415,1.08c-0.048,0.131-0.072,0.311-0.072,0.49v3.49h-1.056V282.979z"/>
		<path fill="#231F20" d="M113.657,284.263c0,2.146-1.499,3.082-2.89,3.082c-1.559,0-2.783-1.152-2.783-2.986
			c0-1.932,1.284-3.07,2.878-3.07C112.53,281.288,113.657,282.499,113.657,284.263z M109.064,284.321
			c0,1.271,0.72,2.232,1.751,2.232c1.007,0,1.763-0.949,1.763-2.256c0-0.982-0.492-2.219-1.739-2.219
			C109.604,282.079,109.064,283.231,109.064,284.321z"/>
		<path fill="#231F20" d="M114.992,278.696h1.056v8.516h-1.056V278.696z"/>
		<path fill="#231F20" d="M123.077,284.263c0,2.146-1.499,3.082-2.89,3.082c-1.559,0-2.783-1.152-2.783-2.986
			c0-1.932,1.284-3.07,2.878-3.07C121.95,281.288,123.077,282.499,123.077,284.263z M118.484,284.321
			c0,1.271,0.72,2.232,1.751,2.232c1.007,0,1.763-0.949,1.763-2.256c0-0.982-0.492-2.219-1.739-2.219
			C119.023,282.079,118.484,283.231,118.484,284.321z M121.818,278.901l-1.463,1.715h-0.744l1.043-1.715H121.818z"/>
		<path fill="#231F20" d="M129.377,286.36c0,1.344-0.275,2.146-0.827,2.662c-0.575,0.518-1.392,0.697-2.123,0.697
			c-0.695,0-1.463-0.168-1.931-0.48l0.264-0.816c0.384,0.252,0.983,0.469,1.703,0.469c1.079,0,1.871-0.564,1.871-2.039v-0.635
			h-0.024c-0.312,0.539-0.947,0.971-1.847,0.971c-1.439,0-2.471-1.223-2.471-2.83c0-1.967,1.283-3.07,2.627-3.07
			c1.007,0,1.547,0.516,1.811,0.994h0.024l0.036-0.875h0.936c-0.036,0.408-0.049,0.889-0.049,1.584V286.36z M128.322,283.698
			c0-0.18-0.013-0.336-0.061-0.467c-0.191-0.625-0.695-1.129-1.475-1.129c-1.008,0-1.728,0.852-1.728,2.195
			c0,1.139,0.588,2.088,1.715,2.088c0.66,0,1.248-0.408,1.464-1.08c0.06-0.18,0.084-0.385,0.084-0.564V283.698z"/>
		<path fill="#231F20" d="M132.224,279.776c0,0.359-0.252,0.648-0.672,0.648c-0.384,0-0.636-0.289-0.636-0.648s0.265-0.66,0.66-0.66
			C131.96,279.116,132.224,279.405,132.224,279.776z M131.049,287.212v-5.805h1.055v5.805H131.049z"/>
		<path fill="#231F20" d="M137.994,287.009c-0.276,0.131-0.888,0.336-1.668,0.336c-1.751,0-2.89-1.188-2.89-2.963
			c0-1.787,1.223-3.094,3.118-3.094c0.623,0,1.175,0.156,1.463,0.311l-0.24,0.805c-0.251-0.133-0.647-0.275-1.223-0.275
			c-1.331,0-2.051,0.994-2.051,2.193c0,1.344,0.863,2.172,2.015,2.172c0.6,0,0.995-0.145,1.295-0.275L137.994,287.009z"/>
		<path fill="#231F20" d="M144.413,284.263c0,2.146-1.499,3.082-2.891,3.082c-1.56,0-2.782-1.152-2.782-2.986
			c0-1.932,1.283-3.07,2.878-3.07C143.285,281.288,144.413,282.499,144.413,284.263z M139.819,284.321
			c0,1.271,0.72,2.232,1.751,2.232c1.008,0,1.763-0.949,1.763-2.256c0-0.982-0.491-2.219-1.738-2.219
			C140.359,282.079,139.819,283.231,139.819,284.321z"/>
		<path fill="#231F20" d="M145.604,286.146c0.324,0.191,0.876,0.408,1.403,0.408c0.756,0,1.115-0.373,1.115-0.865
			c0-0.504-0.3-0.768-1.067-1.055c-1.056-0.383-1.547-0.947-1.547-1.643c0-0.936,0.768-1.703,2.003-1.703
			c0.588,0,1.104,0.156,1.415,0.359l-0.252,0.768c-0.228-0.145-0.647-0.348-1.188-0.348c-0.623,0-0.959,0.359-0.959,0.791
			c0,0.48,0.336,0.695,1.091,0.996c0.996,0.371,1.523,0.875,1.523,1.738c0,1.031-0.804,1.752-2.159,1.752
			c-0.635,0-1.223-0.168-1.631-0.408L145.604,286.146z"/>
	</g>
	<g>
		<path fill="#231F20" d="M43.701,303.563h4.354v0.876h-3.298v2.687h3.046v0.863h-3.046v3.658h-1.056V303.563z"/>
		<path fill="#231F20" d="M53.058,310.255c0,0.504,0.024,0.996,0.084,1.392h-0.947l-0.084-0.731h-0.036
			c-0.324,0.456-0.947,0.863-1.775,0.863c-1.175,0-1.775-0.827-1.775-1.667c0-1.403,1.247-2.171,3.49-2.159v-0.119
			c0-0.468-0.132-1.344-1.319-1.332c-0.552,0-1.116,0.156-1.523,0.432l-0.24-0.707c0.479-0.3,1.187-0.504,1.919-0.504
			c1.775,0,2.207,1.211,2.207,2.362V310.255z M52.039,308.685c-1.151-0.024-2.458,0.18-2.458,1.307c0,0.696,0.456,1.008,0.983,1.008
			c0.768,0,1.259-0.479,1.427-0.972c0.036-0.12,0.048-0.24,0.048-0.336V308.685z"/>
		<path fill="#231F20" d="M55.988,304.45v1.392H57.5v0.804h-1.511v3.13c0,0.72,0.204,1.128,0.792,1.128
			c0.288,0,0.456-0.024,0.611-0.072l0.048,0.804c-0.204,0.071-0.528,0.144-0.936,0.144c-0.492,0-0.888-0.168-1.14-0.443
			c-0.288-0.324-0.408-0.84-0.408-1.523v-3.166h-0.899v-0.804h0.899v-1.079L55.988,304.45z"/>
		<path fill="#231F20" d="M63.869,308.696c0,2.146-1.499,3.082-2.89,3.082c-1.559,0-2.783-1.151-2.783-2.986
			c0-1.931,1.284-3.07,2.878-3.07C62.742,305.722,63.869,306.933,63.869,308.696z M59.276,308.756c0,1.271,0.72,2.231,1.751,2.231
			c1.007,0,1.763-0.948,1.763-2.255c0-0.983-0.492-2.219-1.739-2.219C59.815,306.514,59.276,307.665,59.276,308.756z"/>
		<path fill="#231F20" d="M65.204,307.652c0-0.684-0.012-1.271-0.048-1.811h0.923l0.048,1.151h0.036
			c0.264-0.779,0.912-1.271,1.619-1.271c0.108,0,0.192,0.012,0.288,0.024v0.995c-0.108-0.024-0.216-0.024-0.36-0.024
			c-0.744,0-1.271,0.552-1.416,1.344c-0.024,0.144-0.036,0.324-0.036,0.491v3.095h-1.056V307.652z"/>
		<path fill="#231F20" d="M69.596,308.936c0.024,1.428,0.923,2.016,1.991,2.016c0.755,0,1.223-0.132,1.607-0.3l0.192,0.755
			c-0.372,0.168-1.019,0.372-1.943,0.372c-1.787,0-2.854-1.188-2.854-2.938s1.032-3.118,2.723-3.118
			c1.907,0,2.399,1.655,2.399,2.723c0,0.216-0.012,0.372-0.036,0.491H69.596z M72.69,308.181c0.012-0.66-0.276-1.703-1.463-1.703
			c-1.079,0-1.535,0.972-1.619,1.703H72.69z"/>
		<path fill="#231F20" d="M74.876,310.579c0.324,0.191,0.875,0.408,1.403,0.408c0.756,0,1.115-0.372,1.115-0.864
			c0-0.504-0.3-0.768-1.067-1.055c-1.055-0.384-1.547-0.948-1.547-1.644c0-0.936,0.768-1.703,2.003-1.703
			c0.587,0,1.103,0.156,1.415,0.36l-0.252,0.768c-0.228-0.145-0.647-0.349-1.187-0.349c-0.624,0-0.959,0.36-0.959,0.792
			c0,0.479,0.335,0.695,1.091,0.995c0.995,0.372,1.523,0.876,1.523,1.739c0,1.031-0.803,1.751-2.159,1.751
			c-0.636,0-1.223-0.168-1.631-0.407L74.876,310.579z"/>
		<path fill="#231F20" d="M87.281,310.795c0,1.344-0.276,2.146-0.828,2.662c-0.576,0.517-1.391,0.696-2.123,0.696
			c-0.696,0-1.463-0.168-1.931-0.479l0.264-0.816c0.384,0.252,0.983,0.468,1.703,0.468c1.08,0,1.871-0.563,1.871-2.038v-0.636
			h-0.024c-0.312,0.539-0.948,0.971-1.847,0.971c-1.439,0-2.471-1.223-2.471-2.83c0-1.967,1.284-3.07,2.627-3.07
			c1.007,0,1.547,0.516,1.811,0.995h0.024l0.036-0.875h0.936c-0.036,0.407-0.048,0.888-0.048,1.583V310.795z M86.226,308.133
			c0-0.181-0.012-0.336-0.06-0.468c-0.192-0.624-0.696-1.128-1.476-1.128c-1.007,0-1.727,0.852-1.727,2.195
			c0,1.139,0.588,2.087,1.715,2.087c0.66,0,1.247-0.408,1.463-1.08c0.06-0.18,0.083-0.384,0.083-0.563V308.133z"/>
		<path fill="#231F20" d="M89.612,308.936c0.024,1.428,0.923,2.016,1.991,2.016c0.755,0,1.223-0.132,1.607-0.3l0.192,0.755
			c-0.372,0.168-1.019,0.372-1.943,0.372c-1.787,0-2.854-1.188-2.854-2.938s1.032-3.118,2.723-3.118
			c1.907,0,2.399,1.655,2.399,2.723c0,0.216-0.012,0.372-0.036,0.491H89.612z M92.706,308.181c0.012-0.66-0.276-1.703-1.463-1.703
			c-1.079,0-1.535,0.972-1.619,1.703H92.706z"/>
		<path fill="#231F20" d="M95.036,307.413c0-0.612-0.012-1.092-0.048-1.571h0.936l0.06,0.959h0.024
			c0.288-0.539,0.959-1.079,1.919-1.079c0.803,0,2.051,0.479,2.051,2.471v3.454h-1.056v-3.346c0-0.936-0.348-1.716-1.343-1.716
			c-0.684,0-1.223,0.492-1.415,1.08c-0.048,0.132-0.072,0.312-0.072,0.491v3.49h-1.056V307.413z"/>
		<path fill="#231F20" d="M102.284,308.936c0.024,1.428,0.923,2.016,1.991,2.016c0.755,0,1.223-0.132,1.607-0.3l0.192,0.755
			c-0.372,0.168-1.019,0.372-1.943,0.372c-1.787,0-2.854-1.188-2.854-2.938s1.032-3.118,2.723-3.118
			c1.907,0,2.399,1.655,2.399,2.723c0,0.216-0.012,0.372-0.036,0.491H102.284z M105.378,308.181c0.012-0.66-0.276-1.703-1.463-1.703
			c-1.079,0-1.535,0.972-1.619,1.703H105.378z M105.618,303.335l-1.463,1.715h-0.744l1.056-1.715H105.618z"/>
		<path fill="#231F20" d="M108.979,304.45v1.392h1.511v0.804h-1.511v3.13c0,0.72,0.204,1.128,0.792,1.128
			c0.288,0,0.456-0.024,0.612-0.072l0.048,0.804c-0.204,0.071-0.528,0.144-0.936,0.144c-0.492,0-0.888-0.168-1.14-0.443
			c-0.288-0.324-0.408-0.84-0.408-1.523v-3.166h-0.899v-0.804h0.899v-1.079L108.979,304.45z"/>
		<path fill="#231F20" d="M112.854,304.211c0,0.359-0.252,0.647-0.671,0.647c-0.384,0-0.636-0.288-0.636-0.647
			c0-0.36,0.264-0.66,0.66-0.66C112.591,303.551,112.854,303.839,112.854,304.211z M111.679,311.646v-5.805h1.056v5.805H111.679z"/>
		<path fill="#231F20" d="M118.625,311.442c-0.276,0.132-0.888,0.336-1.668,0.336c-1.75,0-2.89-1.188-2.89-2.962
			c0-1.787,1.224-3.095,3.119-3.095c0.623,0,1.175,0.156,1.463,0.312l-0.239,0.804c-0.252-0.132-0.648-0.275-1.224-0.275
			c-1.331,0-2.051,0.995-2.051,2.194c0,1.344,0.864,2.171,2.015,2.171c0.6,0,0.995-0.144,1.295-0.275L118.625,311.442z"/>
		<path fill="#231F20" d="M125.044,308.696c0,2.146-1.499,3.082-2.891,3.082c-1.56,0-2.782-1.151-2.782-2.986
			c0-1.931,1.283-3.07,2.878-3.07C123.917,305.722,125.044,306.933,125.044,308.696z M120.451,308.756
			c0,1.271,0.72,2.231,1.751,2.231c1.008,0,1.763-0.948,1.763-2.255c0-0.983-0.491-2.219-1.738-2.219
			C120.991,306.514,120.451,307.665,120.451,308.756z"/>
		<path fill="#231F20" d="M126.235,310.579c0.324,0.191,0.876,0.408,1.403,0.408c0.756,0,1.115-0.372,1.115-0.864
			c0-0.504-0.3-0.768-1.067-1.055c-1.056-0.384-1.547-0.948-1.547-1.644c0-0.936,0.768-1.703,2.003-1.703
			c0.588,0,1.104,0.156,1.415,0.36l-0.252,0.768c-0.228-0.145-0.647-0.349-1.188-0.349c-0.623,0-0.959,0.36-0.959,0.792
			c0,0.479,0.336,0.695,1.091,0.995c0.996,0.372,1.523,0.876,1.523,1.739c0,1.031-0.804,1.751-2.158,1.751
			c-0.636,0-1.224-0.168-1.632-0.407L126.235,310.579z"/>
	</g>
	<rect x="18.755" y="301.834" fill="#EAA1B0" stroke="#231F20" stroke-miterlimit="10" width="13.819" height="13.82"/>
	<g>
		<rect x="10.755" y="65.475" fill="#E6E7E8" width="95" height="41"/>
		<g>
			<path fill="#231F20" d="M22.439,78.171c0,2.771-1.691,4.258-3.754,4.258c-2.147,0-3.634-1.667-3.634-4.114
				c0-2.566,1.583-4.246,3.742-4.246C21.012,74.07,22.439,75.761,22.439,78.171z M16.154,78.292c0,1.739,0.936,3.286,2.59,3.286
				c1.655,0,2.591-1.523,2.591-3.358c0-1.619-0.839-3.298-2.579-3.298C17.018,74.921,16.154,76.528,16.154,78.292z"/>
			<path fill="#231F20" d="M24.842,74.214v4.797c0,1.799,0.803,2.566,1.883,2.566c1.188,0,1.967-0.792,1.967-2.566v-4.797h1.056
				v4.725c0,2.483-1.308,3.49-3.059,3.49c-1.655,0-2.902-0.936-2.902-3.454v-4.761H24.842z"/>
			<path fill="#231F20" d="M33.098,75.101h-2.459v-0.887h5.985v0.887h-2.471v7.196h-1.055V75.101z"/>
			<path fill="#231F20" d="M37.526,74.322c0.528-0.096,1.295-0.168,2.003-0.168c1.115,0,1.847,0.216,2.338,0.66
				c0.396,0.36,0.636,0.912,0.636,1.547c0,1.055-0.671,1.763-1.511,2.051v0.036c0.612,0.216,0.983,0.792,1.175,1.631
				c0.264,1.127,0.456,1.907,0.624,2.219h-1.08c-0.132-0.24-0.312-0.923-0.528-1.931c-0.24-1.115-0.684-1.535-1.631-1.571H38.57
				v3.502h-1.043V74.322z M38.57,78.004h1.067c1.115,0,1.823-0.612,1.823-1.535c0-1.043-0.755-1.5-1.859-1.5
				c-0.504,0-0.852,0.036-1.031,0.084V78.004z"/>
			<path fill="#231F20" d="M45.35,79.755l-0.839,2.542h-1.08l2.758-8.083h1.248l2.758,8.083H49.08l-0.863-2.542H45.35z
				 M48.012,78.939l-0.804-2.327c-0.18-0.527-0.3-1.007-0.419-1.475h-0.024c-0.12,0.468-0.24,0.972-0.408,1.463l-0.792,2.338H48.012
				z"/>
			<path fill="#231F20" d="M51.254,81.026c0.468,0.3,1.139,0.528,1.859,0.528c1.067,0,1.691-0.563,1.691-1.379
				c0-0.743-0.432-1.187-1.523-1.595c-1.319-0.48-2.135-1.176-2.135-2.303c0-1.259,1.043-2.195,2.615-2.195
				c0.815,0,1.427,0.192,1.775,0.396l-0.288,0.852c-0.252-0.156-0.792-0.384-1.523-0.384c-1.103,0-1.523,0.66-1.523,1.211
				c0,0.755,0.492,1.127,1.607,1.559c1.368,0.528,2.051,1.188,2.051,2.375c0,1.248-0.912,2.339-2.819,2.339
				c-0.779,0-1.631-0.24-2.063-0.528L51.254,81.026z"/>
			<path fill="#231F20" d="M65.483,82.045c-0.372,0.192-1.151,0.384-2.135,0.384c-2.279,0-3.982-1.439-3.982-4.102
				c0-2.542,1.715-4.246,4.222-4.246c0.996,0,1.643,0.216,1.919,0.36l-0.264,0.852c-0.384-0.192-0.948-0.336-1.619-0.336
				c-1.895,0-3.154,1.211-3.154,3.334c0,1.991,1.139,3.25,3.094,3.25c0.647,0,1.295-0.132,1.715-0.336L65.483,82.045z"/>
			<path fill="#231F20" d="M68.161,79.755l-0.839,2.542h-1.08L69,74.214h1.248l2.758,8.083h-1.115l-0.863-2.542H68.161z
				 M70.824,78.939l-0.804-2.327c-0.18-0.527-0.3-1.007-0.419-1.475h-0.024c-0.12,0.468-0.24,0.972-0.408,1.463l-0.792,2.338H70.824
				z"/>
			<path fill="#231F20" d="M74.906,74.214v4.797c0,1.799,0.804,2.566,1.883,2.566c1.188,0,1.967-0.792,1.967-2.566v-4.797h1.056
				v4.725c0,2.483-1.308,3.49-3.059,3.49c-1.655,0-2.902-0.936-2.902-3.454v-4.761H74.906z"/>
			<path fill="#231F20" d="M81.494,81.026c0.468,0.3,1.14,0.528,1.859,0.528c1.067,0,1.691-0.563,1.691-1.379
				c0-0.743-0.433-1.187-1.523-1.595c-1.319-0.48-2.135-1.176-2.135-2.303c0-1.259,1.043-2.195,2.614-2.195
				c0.815,0,1.428,0.192,1.775,0.396l-0.288,0.852c-0.252-0.156-0.792-0.384-1.523-0.384c-1.104,0-1.522,0.66-1.522,1.211
				c0,0.755,0.491,1.127,1.606,1.559c1.367,0.528,2.051,1.188,2.051,2.375c0,1.248-0.911,2.339-2.818,2.339
				c-0.779,0-1.631-0.24-2.063-0.528L81.494,81.026z"/>
			<path fill="#231F20" d="M88.849,79.755l-0.84,2.542H86.93l2.759-8.083h1.247l2.759,8.083h-1.116l-0.863-2.542H88.849z
				 M91.511,78.939l-0.803-2.327c-0.181-0.527-0.3-1.007-0.42-1.475h-0.024c-0.12,0.468-0.239,0.972-0.407,1.463l-0.792,2.338
				H91.511z"/>
			<path fill="#231F20" d="M94.753,81.026c0.468,0.3,1.14,0.528,1.859,0.528c1.067,0,1.691-0.563,1.691-1.379
				c0-0.743-0.433-1.187-1.523-1.595c-1.319-0.48-2.135-1.176-2.135-2.303c0-1.259,1.043-2.195,2.614-2.195
				c0.815,0,1.428,0.192,1.775,0.396l-0.288,0.852c-0.252-0.156-0.792-0.384-1.523-0.384c-1.104,0-1.522,0.66-1.522,1.211
				c0,0.755,0.491,1.127,1.606,1.559c1.367,0.528,2.051,1.188,2.051,2.375c0,1.248-0.911,2.339-2.818,2.339
				c-0.779,0-1.631-0.24-2.063-0.528L94.753,81.026z"/>
			<path fill="#231F20" d="M24.425,96.445c-0.372,0.192-1.151,0.384-2.135,0.384c-2.279,0-3.982-1.439-3.982-4.102
				c0-2.542,1.715-4.246,4.222-4.246c0.996,0,1.643,0.216,1.919,0.36l-0.264,0.851c-0.384-0.191-0.948-0.335-1.619-0.335
				c-1.895,0-3.154,1.211-3.154,3.334c0,1.991,1.139,3.25,3.094,3.25c0.647,0,1.295-0.132,1.715-0.336L24.425,96.445z"/>
			<path fill="#231F20" d="M32.405,92.572c0,2.77-1.691,4.257-3.754,4.257c-2.147,0-3.634-1.667-3.634-4.114
				c0-2.566,1.583-4.246,3.742-4.246C30.978,88.47,32.405,90.161,32.405,92.572z M26.12,92.691c0,1.739,0.936,3.286,2.59,3.286
				c1.655,0,2.591-1.523,2.591-3.358c0-1.619-0.839-3.298-2.579-3.298C26.984,89.321,26.12,90.928,26.12,92.691z"/>
			<path fill="#231F20" d="M40.577,93.147c-0.06-1.127-0.132-2.494-0.132-3.49h-0.024c-0.288,0.936-0.612,1.955-1.02,3.07
				l-1.427,3.922h-0.792l-1.319-3.85c-0.384-1.151-0.695-2.183-0.923-3.142h-0.024c-0.024,1.007-0.084,2.351-0.156,3.574
				l-0.216,3.466h-0.995l0.563-8.083h1.332l1.379,3.91c0.336,0.996,0.6,1.883,0.815,2.723h0.024
				c0.216-0.815,0.503-1.703,0.863-2.723l1.439-3.91h1.331l0.504,8.083h-1.032L40.577,93.147z"/>
			<path fill="#231F20" d="M43.412,88.709c0.503-0.084,1.163-0.156,2.003-0.156c1.031,0,1.787,0.24,2.267,0.672
				c0.432,0.384,0.708,0.971,0.708,1.691c0,0.731-0.216,1.307-0.624,1.727c-0.564,0.587-1.451,0.887-2.471,0.887
				c-0.312,0-0.6-0.012-0.839-0.072v3.238h-1.043V88.709z M44.456,92.607c0.228,0.06,0.516,0.084,0.863,0.084
				c1.259,0,2.027-0.624,2.027-1.715c0-1.08-0.768-1.595-1.907-1.595c-0.456,0-0.804,0.036-0.983,0.084V92.607z"/>
			<path fill="#231F20" d="M56.705,92.572c0,2.77-1.691,4.257-3.754,4.257c-2.147,0-3.634-1.667-3.634-4.114
				c0-2.566,1.583-4.246,3.742-4.246C55.277,88.47,56.705,90.161,56.705,92.572z M50.42,92.691c0,1.739,0.936,3.286,2.59,3.286
				c1.655,0,2.591-1.523,2.591-3.358c0-1.619-0.839-3.298-2.579-3.298C51.284,89.321,50.42,90.928,50.42,92.691z"/>
			<path fill="#231F20" d="M58.064,96.697v-8.083h1.151l2.579,4.09c0.587,0.947,1.067,1.799,1.439,2.626l0.036-0.012
				c-0.096-1.079-0.12-2.063-0.12-3.322v-3.382h0.983v8.083h-1.055l-2.567-4.102c-0.563-0.9-1.103-1.823-1.499-2.699l-0.036,0.012
				c0.06,1.019,0.072,1.991,0.072,3.334v3.454H58.064z"/>
			<path fill="#231F20" d="M70.133,92.907h-3.13v2.915h3.502v0.875h-4.558v-8.083h4.378v0.875h-3.322v2.555h3.13V92.907z"/>
			<path fill="#231F20" d="M71.864,96.697v-8.083h1.151l2.578,4.09c0.588,0.947,1.067,1.799,1.439,2.626l0.036-0.012
				c-0.096-1.079-0.12-2.063-0.12-3.322v-3.382h0.983v8.083h-1.056l-2.566-4.102c-0.563-0.9-1.104-1.823-1.499-2.699l-0.036,0.012
				c0.061,1.019,0.072,1.991,0.072,3.334v3.454H71.864z"/>
			<path fill="#231F20" d="M81.294,89.501h-2.458v-0.888h5.984v0.888H82.35v7.196h-1.056V89.501z"/>
			<path fill="#231F20" d="M89.897,92.907h-3.13v2.915h3.502v0.875h-4.558v-8.083h4.378v0.875h-3.322v2.555h3.13V92.907z"/>
			<path fill="#231F20" d="M91.496,95.426c0.468,0.3,1.14,0.528,1.859,0.528c1.067,0,1.691-0.563,1.691-1.379
				c0-0.743-0.433-1.187-1.523-1.595c-1.319-0.48-2.135-1.175-2.135-2.303c0-1.259,1.043-2.195,2.614-2.195
				c0.815,0,1.428,0.192,1.775,0.396l-0.288,0.852c-0.252-0.156-0.792-0.384-1.523-0.384c-1.104,0-1.522,0.66-1.522,1.211
				c0,0.755,0.491,1.127,1.606,1.559c1.367,0.528,2.051,1.188,2.051,2.375c0,1.247-0.911,2.338-2.818,2.338
				c-0.779,0-1.631-0.24-2.063-0.528L91.496,95.426z"/>
		</g>
		<line fill="none" stroke="#231F20" stroke-miterlimit="10" x1="174.603" y1="31.592" x2="61.005" y2="64.886"/>
		<line fill="none" stroke="#231F20" stroke-miterlimit="10" x1="157.634" y1="149.923" x2="55.005" y2="105.886"/>
		<line fill="none" stroke="#231F20" stroke-miterlimit="10" x1="139.331" y1="95.834" x2="101.005" y2="95.834"/>
	</g>
	<g>
		<rect x="324.473" y="109.462" fill="#E6E7E8" width="116" height="44.76"/>
		<g>
			<path fill="#231F20" d="M333.81,127.913c-0.372,0.192-1.151,0.384-2.135,0.384c-2.279,0-3.982-1.439-3.982-4.102
				c0-2.542,1.715-4.246,4.222-4.246c0.996,0,1.643,0.216,1.919,0.36l-0.264,0.852c-0.384-0.192-0.948-0.336-1.619-0.336
				c-1.895,0-3.154,1.211-3.154,3.334c0,1.991,1.139,3.25,3.094,3.25c0.647,0,1.295-0.132,1.715-0.336L333.81,127.913z"/>
			<path fill="#231F20" d="M336.488,125.622l-0.839,2.542h-1.08l2.758-8.083h1.248l2.758,8.083h-1.115l-0.863-2.542H336.488z
				 M339.15,124.806l-0.804-2.327c-0.18-0.527-0.3-1.007-0.419-1.475h-0.024c-0.12,0.468-0.24,0.972-0.408,1.463l-0.792,2.338
				H339.15z"/>
			<path fill="#231F20" d="M343.232,120.081v4.797c0,1.799,0.803,2.566,1.883,2.566c1.188,0,1.967-0.792,1.967-2.566v-4.797h1.056
				v4.725c0,2.483-1.308,3.49-3.059,3.49c-1.655,0-2.902-0.936-2.902-3.454v-4.761H343.232z"/>
			<path fill="#231F20" d="M349.821,126.893c0.467,0.3,1.139,0.528,1.859,0.528c1.067,0,1.691-0.563,1.691-1.379
				c0-0.743-0.432-1.187-1.523-1.595c-1.319-0.48-2.135-1.176-2.135-2.303c0-1.259,1.043-2.195,2.614-2.195
				c0.815,0,1.427,0.192,1.775,0.396l-0.288,0.852c-0.252-0.156-0.792-0.384-1.523-0.384c-1.103,0-1.523,0.66-1.523,1.211
				c0,0.755,0.492,1.127,1.607,1.559c1.367,0.528,2.051,1.188,2.051,2.375c0,1.248-0.912,2.339-2.819,2.339
				c-0.779,0-1.631-0.24-2.063-0.528L349.821,126.893z"/>
			<path fill="#231F20" d="M357.176,125.622l-0.839,2.542h-1.08l2.758-8.083h1.248l2.758,8.083h-1.115l-0.864-2.542H357.176z
				 M359.838,124.806l-0.804-2.327c-0.18-0.527-0.3-1.007-0.419-1.475h-0.024c-0.12,0.468-0.24,0.972-0.408,1.463l-0.792,2.338
				H359.838z"/>
			<path fill="#231F20" d="M371.393,127.913c-0.372,0.192-1.151,0.384-2.135,0.384c-2.279,0-3.982-1.439-3.982-4.102
				c0-2.542,1.715-4.246,4.222-4.246c0.996,0,1.643,0.216,1.919,0.36l-0.264,0.852c-0.384-0.192-0.948-0.336-1.619-0.336
				c-1.895,0-3.154,1.211-3.154,3.334c0,1.991,1.139,3.25,3.094,3.25c0.648,0,1.295-0.132,1.715-0.336L371.393,127.913z"/>
			<path fill="#231F20" d="M379.373,124.039c0,2.771-1.691,4.258-3.754,4.258c-2.147,0-3.634-1.667-3.634-4.114
				c0-2.566,1.583-4.246,3.742-4.246C377.945,119.937,379.373,121.628,379.373,124.039z M373.088,124.159
				c0,1.739,0.936,3.286,2.591,3.286c1.655,0,2.59-1.523,2.59-3.358c0-1.619-0.839-3.298-2.579-3.298
				S373.088,122.396,373.088,124.159z"/>
			<path fill="#231F20" d="M387.544,124.615c-0.06-1.127-0.132-2.495-0.132-3.49h-0.024c-0.288,0.936-0.612,1.955-1.02,3.07
				l-1.427,3.922h-0.792l-1.319-3.85c-0.384-1.151-0.695-2.183-0.923-3.142h-0.024c-0.024,1.007-0.084,2.351-0.156,3.574
				l-0.216,3.466h-0.995l0.563-8.083h1.331l1.379,3.91c0.336,0.996,0.6,1.883,0.815,2.723h0.024
				c0.216-0.815,0.503-1.703,0.863-2.723l1.439-3.91h1.331l0.504,8.083h-1.032L387.544,124.615z"/>
			<path fill="#231F20" d="M390.38,120.177c0.503-0.084,1.163-0.156,2.003-0.156c1.031,0,1.787,0.24,2.267,0.672
				c0.432,0.384,0.708,0.971,0.708,1.691c0,0.731-0.216,1.307-0.624,1.727c-0.564,0.587-1.451,0.888-2.471,0.888
				c-0.312,0-0.6-0.012-0.839-0.072v3.238h-1.043V120.177z M391.424,124.075c0.228,0.06,0.516,0.084,0.863,0.084
				c1.259,0,2.027-0.624,2.027-1.715c0-1.08-0.768-1.595-1.907-1.595c-0.456,0-0.804,0.036-0.983,0.084V124.075z"/>
			<path fill="#231F20" d="M403.672,124.039c0,2.771-1.69,4.258-3.754,4.258c-2.146,0-3.634-1.667-3.634-4.114
				c0-2.566,1.583-4.246,3.742-4.246C402.245,119.937,403.672,121.628,403.672,124.039z M397.388,124.159
				c0,1.739,0.936,3.286,2.591,3.286s2.59-1.523,2.59-3.358c0-1.619-0.839-3.298-2.578-3.298S397.388,122.396,397.388,124.159z"/>
			<path fill="#231F20" d="M405.031,128.165v-8.083h1.151l2.579,4.09c0.588,0.947,1.067,1.799,1.439,2.626l0.035-0.012
				c-0.096-1.079-0.119-2.063-0.119-3.322v-3.382h0.983v8.083h-1.056l-2.566-4.102c-0.563-0.9-1.104-1.823-1.499-2.699l-0.036,0.012
				c0.06,1.019,0.071,1.991,0.071,3.334v3.454H405.031z"/>
			<path fill="#231F20" d="M417.101,124.375h-3.13v2.915h3.502v0.875h-4.558v-8.083h4.378v0.875h-3.322v2.555h3.13V124.375z"/>
			<path fill="#231F20" d="M418.831,128.165v-8.083h1.151l2.579,4.09c0.588,0.947,1.067,1.799,1.439,2.626l0.035-0.012
				c-0.096-1.079-0.119-2.063-0.119-3.322v-3.382h0.983v8.083h-1.056l-2.566-4.102c-0.563-0.9-1.104-1.823-1.499-2.699l-0.036,0.012
				c0.06,1.019,0.071,1.991,0.071,3.334v3.454H418.831z"/>
			<path fill="#231F20" d="M428.262,120.968h-2.458v-0.887h5.984v0.887h-2.471v7.196h-1.056V120.968z"/>
			<path fill="#231F20" d="M436.864,124.375h-3.13v2.915h3.502v0.875h-4.558v-8.083h4.378v0.875h-3.322v2.555h3.13V124.375z"/>
			<path fill="#231F20" d="M352.131,142.564v-8.083h1.151l2.579,4.09c0.587,0.947,1.067,1.799,1.439,2.626l0.036-0.012
				c-0.096-1.079-0.12-2.063-0.12-3.322v-3.382h0.983v8.083h-1.055l-2.567-4.102c-0.563-0.9-1.103-1.823-1.499-2.699l-0.036,0.012
				c0.06,1.019,0.072,1.991,0.072,3.334v3.454H352.131z"/>
			<path fill="#231F20" d="M364.2,138.774h-3.13v2.915h3.502v0.875h-4.558v-8.083h4.378v0.875h-3.322v2.555h3.13V138.774z"/>
			<path fill="#231F20" d="M371.567,142.313c-0.372,0.192-1.151,0.384-2.135,0.384c-2.279,0-3.982-1.439-3.982-4.102
				c0-2.542,1.715-4.246,4.222-4.246c0.996,0,1.643,0.216,1.919,0.36l-0.264,0.851c-0.384-0.191-0.948-0.335-1.619-0.335
				c-1.895,0-3.154,1.211-3.154,3.334c0,1.991,1.139,3.25,3.094,3.25c0.647,0,1.295-0.132,1.715-0.336L371.567,142.313z"/>
			<path fill="#231F20" d="M377.064,138.774h-3.13v2.915h3.502v0.875h-4.558v-8.083h4.377v0.875h-3.322v2.555h3.13V138.774z"/>
			<path fill="#231F20" d="M378.663,141.293c0.467,0.3,1.139,0.528,1.859,0.528c1.067,0,1.691-0.563,1.691-1.379
				c0-0.743-0.432-1.187-1.523-1.595c-1.319-0.48-2.135-1.175-2.135-2.303c0-1.259,1.043-2.195,2.614-2.195
				c0.815,0,1.427,0.192,1.775,0.396l-0.288,0.852c-0.252-0.156-0.792-0.384-1.523-0.384c-1.103,0-1.523,0.66-1.523,1.211
				c0,0.755,0.492,1.127,1.607,1.559c1.367,0.528,2.051,1.188,2.051,2.375c0,1.247-0.912,2.338-2.819,2.338
				c-0.779,0-1.631-0.24-2.063-0.528L378.663,141.293z"/>
			<path fill="#231F20" d="M384.579,141.293c0.467,0.3,1.139,0.528,1.859,0.528c1.067,0,1.691-0.563,1.691-1.379
				c0-0.743-0.432-1.187-1.523-1.595c-1.319-0.48-2.135-1.175-2.135-2.303c0-1.259,1.043-2.195,2.614-2.195
				c0.815,0,1.427,0.192,1.775,0.396l-0.288,0.852c-0.252-0.156-0.792-0.384-1.523-0.384c-1.103,0-1.523,0.66-1.523,1.211
				c0,0.755,0.492,1.127,1.607,1.559c1.367,0.528,2.051,1.188,2.051,2.375c0,1.247-0.912,2.338-2.819,2.338
				c-0.779,0-1.631-0.24-2.063-0.528L384.579,141.293z"/>
			<path fill="#231F20" d="M391.934,140.022l-0.839,2.542h-1.08l2.758-8.083h1.248l2.759,8.083h-1.116l-0.864-2.542H391.934z
				 M394.596,139.207l-0.804-2.327c-0.18-0.527-0.3-1.007-0.419-1.475h-0.024c-0.12,0.468-0.24,0.972-0.408,1.463l-0.792,2.339
				H394.596z M395.16,132.646l-1.535,1.403h-0.852l1.116-1.403H395.16z"/>
			<path fill="#231F20" d="M397.97,134.589c0.528-0.096,1.296-0.168,2.003-0.168c1.115,0,1.848,0.216,2.339,0.66
				c0.396,0.36,0.636,0.912,0.636,1.547c0,1.055-0.672,1.763-1.511,2.051v0.036c0.611,0.216,0.983,0.792,1.175,1.631
				c0.264,1.127,0.456,1.907,0.624,2.219h-1.079c-0.133-0.24-0.313-0.923-0.528-1.931c-0.239-1.115-0.684-1.535-1.631-1.571h-0.983
				v3.502h-1.044V134.589z M399.014,138.271h1.067c1.115,0,1.823-0.612,1.823-1.535c0-1.043-0.756-1.5-1.859-1.5
				c-0.504,0-0.852,0.036-1.031,0.084V138.271z"/>
			<path fill="#231F20" d="M405.47,134.481v8.083h-1.056v-8.083H405.47z"/>
			<path fill="#231F20" d="M408.602,140.022l-0.84,2.542h-1.079l2.759-8.083h1.247l2.759,8.083h-1.115l-0.864-2.542H408.602z
				 M411.264,139.207l-0.803-2.327c-0.181-0.527-0.3-1.007-0.42-1.475h-0.024c-0.12,0.468-0.239,0.972-0.407,1.463l-0.792,2.339
				H411.264z"/>
		</g>
		<line fill="none" stroke="#231F20" stroke-miterlimit="10" x1="292.5" y1="140.137" x2="333.5" y2="140.137"/>
	</g>
</g>
</svg>
